# 3ds Max Wavefront OBJ Exporter v0.97b - (c)2007 guruware
# File Created: 27.01.2018 12:44:18

newmtl wire_027177027
	Ns 32
	d 1
	Tr 0
	Tf 1 1 1
	illum 2
	Ka 0.105882 0.694118 0.105882
	Kd 0.105882 0.694118 0.105882
	Ks 0.350000 0.350000 0.350000
