module tech.test/m

go 1.18

require (
	github.com/golang-migrate/migrate/v4 v4.15.2
	github.com/golang/mock v1.6.0
	github.com/google/go-cmp v0.5.6
	github.com/grpc-ecosystem/go-grpc-middleware v1.3.0
	github.com/hashicorp/go-multierror v1.1.1
	github.com/lib/pq v1.10.6
	github.com/sirupsen/logrus v1.8.1
	github.com/spf13/cobra v1.1.3
	github.com/stretchr/testify v1.7.0
	github.com/thanhpk/randstr v1.0.4
	google.golang.org/grpc v1.48.0
	google.golang.org/protobuf v1.28.0
)

require (
	github.com/davecgh/go-spew v1.1.1 // indirect
	github.com/golang/protobuf v1.5.2 // indirect
	github.com/hashicorp/errwrap v1.1.0 // indirect
	github.com/inconshreveable/mousetrap v1.0.0 // indirect
	github.com/pmezard/go-difflib v1.0.0 // indirect
	github.com/spf13/pflag v1.0.5 // indirect
	go.uber.org/atomic v1.7.0 // indirect
	golang.org/x/net v0.0.0-20220225172249-27dd8689420f // indirect
	golang.org/x/sys v0.0.0-20220317061510-51cd9980dadf // indirect
	golang.org/x/text v0.3.7 // indirect
	golang.org/x/xerrors v0.0.0-20200804184101-5ec99f83aff1 // indirect
	google.golang.org/genproto v0.0.0-20220314164441-57ef72a4c106 // indirect
	gopkg.in/yaml.v3 v3.0.0-20210107192922-496545a6307b // indirect
)
