module CrudappV2

go 1.15

require (
	github.com/cockroachdb/apd v1.1.0 // indirect
	github.com/gofrs/uuid v4.0.0+incompatible // indirect
	github.com/gorilla/mux v1.8.0
	github.com/jackc/fake v0.0.0-20150926172116-812a484cc733 // indirect
	github.com/jackc/pgx v3.6.2+incompatible
	github.com/jmoiron/sqlx v1.3.4
	github.com/shopspring/decimal v1.2.0 // indirect
	github.com/sirupsen/logrus v1.8.1
	github.com/spf13/viper v1.8.1
)
