{
	"info": {
		"_postman_id": "38d3e559-ba6b-41fd-99ba-9a47d93ae650",
		"name": "SocialNetworkProject",
		"schema": "https://schema.getpostman.com/json/collection/v2.1.0/collection.json"
	},
	"item": [
		{
			"name": "Posts",
			"item": [
				{
					"name": "AuthenticatedUser",
					"item": [
						{
							"name": "createPost",
							"event": [
								{
									"listen": "test",
									"script": {
										"id": "7efc72bb-9fbb-45c1-9df7-7faaa924d92a",
										"exec": [
											"pm.test(\"Status code is 200\", function () {",
											"    pm.response.to.have.status(200);",
											"});",
											"pm.test(\"Body matches string\", function () {",
											"    pm.expect(pm.response.text()).to.include(\"Counter-Strike Global Offensive is modern version of the great classic!\");",
											"});",
											"",
											"response = JSON.parse(responseBody)",
											"id = response.id",
											"pm.environment.set(\"postId\", id);",
											""
										],
										"type": "text/javascript"
									}
								}
							],
							"request": {
								"method": "POST",
								"header": [
									{
										"key": "Content-Type",
										"name": "Content-Type",
										"value": "application/json",
										"type": "text"
									}
								],
								"body": {
									"mode": "raw",
									"raw": "{\n  \"id\": 0,\n  \"picture\": \"string\",\n  \"switchSecurity\": true,\n  \"text\": \"Counter-Strike Global Offensive is modern version of the great classic!\"\n}",
									"options": {
										"raw": {
											"language": "json"
										}
									}
								},
								"url": {
									"raw": "{{urlBase}}{{urlPost}}/create",
									"host": [
										"{{urlBase}}{{urlPost}}"
									],
									"path": [
										"create"
									]
								},
								"description": "Logged user creates post."
							},
							"response": []
						},
						{
							"name": "createSecondPost",
							"event": [
								{
									"listen": "test",
									"script": {
										"id": "6d791d31-5c89-477a-bd49-da450c97005a",
										"exec": [
											"pm.test(\"Status code is 200\", function () {",
											"    pm.response.to.have.status(200);",
											"});",
											"pm.test(\"Body matches string\", function () {",
											"    pm.expect(pm.response.text()).to.include(\"Check out my TV series 'Sherlock'. Season 4 is coming. Prepare to solve murders... #detective\");",
											"});",
											"response = JSON.parse(responseBody)",
											"id = response.id",
											"pm.environment.set(\"postIdTwo\", id);"
										],
										"type": "text/javascript"
									}
								}
							],
							"request": {
								"auth": {
									"type": "basic",
									"basic": [
										{
											"key": "password",
											"value": "password",
											"type": "string"
										},
										{
											"key": "username",
											"value": "Sherlock",
											"type": "string"
										}
									]
								},
								"method": "POST",
								"header": [
									{
										"key": "Content-Type",
										"name": "Content-Type",
										"value": "application/json",
										"type": "text"
									}
								],
								"body": {
									"mode": "raw",
									"raw": "{\n  \"id\": 0,\n  \"picture\": \"string\",\n  \"switchSecurity\": true,\n  \"text\": \"Check out my TV series 'Sherlock'. Season 4 is coming. Prepare to solve murders... #detective\"\n}",
									"options": {
										"raw": {
											"language": "json"
										}
									}
								},
								"url": {
									"raw": "{{urlBase}}{{urlPost}}/create",
									"host": [
										"{{urlBase}}{{urlPost}}"
									],
									"path": [
										"create"
									]
								},
								"description": "Creating second post with another user."
							},
							"response": []
						},
						{
							"name": "createThirdPost",
							"event": [
								{
									"listen": "test",
									"script": {
										"id": "0f8eee1e-a913-4f97-a82e-5b8bb1583c3d",
										"exec": [
											"pm.test(\"Status code is 200\", function () {",
											"    pm.response.to.have.status(200);",
											"});",
											"pm.test(\"Body matches string\", function () {",
											"    pm.expect(pm.response.text()).to.include(\"2020 Moon landing mission with live people on board, has just started! :o SpaceX is on the verge of changing modern science!\");",
											"});",
											"response = JSON.parse(responseBody)",
											"id = response.id",
											"pm.environment.set(\"postIdThree\", id);"
										],
										"type": "text/javascript"
									}
								}
							],
							"request": {
								"auth": {
									"type": "basic",
									"basic": [
										{
											"key": "username",
											"value": "Elon Musk",
											"type": "string"
										},
										{
											"key": "password",
											"value": "password",
											"type": "string"
										}
									]
								},
								"method": "POST",
								"header": [
									{
										"key": "Content-Type",
										"name": "Content-Type",
										"value": "application/json",
										"type": "text"
									}
								],
								"body": {
									"mode": "raw",
									"raw": "\n{\n  \"id\": 0,\n  \"picture\": \"string\",\n  \"switchSecurity\": true,\n  \"text\": \"2020 Moon landing mission with live people on board, has just started! :o SpaceX is on the verge of changing modern science!\"\n}",
									"options": {
										"raw": {
											"language": "json"
										}
									}
								},
								"url": {
									"raw": "{{urlBase}}{{urlPost}}/create",
									"host": [
										"{{urlBase}}{{urlPost}}"
									],
									"path": [
										"create"
									]
								},
								"description": "Create third post from different user."
							},
							"response": []
						},
						{
							"name": "verifyPostCanNOTbeEmpty",
							"event": [
								{
									"listen": "test",
									"script": {
										"id": "6d45f336-81be-4cf5-8c2b-b5e2e2e8810f",
										"exec": [
											"pm.test(\"Status code is 400\", function () {",
											"    pm.response.to.have.status(400);",
											"});"
										],
										"type": "text/javascript"
									}
								}
							],
							"request": {
								"method": "POST",
								"header": [
									{
										"key": "Content-Type",
										"name": "Content-Type",
										"value": "application/json",
										"type": "text"
									}
								],
								"body": {
									"mode": "raw",
									"raw": "{\n  \"id\": 0,\n  \"picture\": \"string\",\n  \"switchSecurity\": true,\n  \"text\": \"\"\n}",
									"options": {
										"raw": {
											"language": "json"
										}
									}
								},
								"url": {
									"raw": "{{urlBase}}{{urlPost}}/create",
									"host": [
										"{{urlBase}}{{urlPost}}"
									],
									"path": [
										"create"
									]
								},
								"description": "Verify post can NOT be created with empty body."
							},
							"response": []
						},
						{
							"name": "getPostByID",
							"event": [
								{
									"listen": "test",
									"script": {
										"id": "f5fbd2bd-35ce-48c3-9b17-94dc013a6c0f",
										"exec": [
											"pm.test(\"Status code is 200\", function () {",
											"    pm.response.to.have.status(200);",
											"});",
											"pm.test(\"Body matches string\", function () {",
											"    pm.expect(pm.response.text()).to.include(\"Counter-Strike Global Offensive is modern version of the great classic!\");",
											"});"
										],
										"type": "text/javascript"
									}
								}
							],
							"request": {
								"method": "GET",
								"header": [],
								"url": {
									"raw": "{{urlBase}}{{urlPost}}/{{postId}}",
									"host": [
										"{{urlBase}}{{urlPost}}"
									],
									"path": [
										"{{postId}}"
									]
								}
							},
							"response": []
						},
						{
							"name": "likePost",
							"event": [
								{
									"listen": "test",
									"script": {
										"id": "b3301622-3c9e-457a-889e-d31a27db3129",
										"exec": [
											"pm.test(\"Status code is 200\", function () {",
											"    pm.response.to.have.status(200);",
											"});"
										],
										"type": "text/javascript"
									}
								}
							],
							"request": {
								"auth": {
									"type": "basic",
									"basic": [
										{
											"key": "password",
											"value": "password",
											"type": "string"
										},
										{
											"key": "username",
											"value": "Sherlock",
											"type": "string"
										}
									]
								},
								"method": "PUT",
								"header": [],
								"url": {
									"raw": "{{urlBase}}{{urlPost}}/like/{{postId}}",
									"host": [
										"{{urlBase}}{{urlPost}}"
									],
									"path": [
										"like",
										"{{postId}}"
									]
								}
							},
							"response": []
						},
						{
							"name": "likePostWithDifferentUser",
							"event": [
								{
									"listen": "test",
									"script": {
										"id": "db1a85cc-4b43-4985-badd-8a1c621c000d",
										"exec": [
											"pm.test(\"Status code is 200\", function () {",
											"    pm.response.to.have.status(200);",
											"});"
										],
										"type": "text/javascript"
									}
								}
							],
							"request": {
								"method": "PUT",
								"header": [],
								"url": {
									"raw": "{{urlBase}}{{urlPost}}/like/{{postId}}",
									"host": [
										"{{urlBase}}{{urlPost}}"
									],
									"path": [
										"like",
										"{{postId}}"
									]
								},
								"description": "Another user likes the same comment."
							},
							"response": []
						},
						{
							"name": "getCountofLIkes",
							"event": [
								{
									"listen": "test",
									"script": {
										"id": "f8bd255b-4de4-4ea6-9485-788b99b9fc44",
										"exec": [
											"pm.test(\"Status code is 200\", function () {",
											"    pm.response.to.have.status(200);",
											"});"
										],
										"type": "text/javascript"
									}
								}
							],
							"request": {
								"method": "GET",
								"header": [],
								"url": {
									"raw": "{{urlBase}}{{urlPost}}/like/count/{{postId}}",
									"host": [
										"{{urlBase}}{{urlPost}}"
									],
									"path": [
										"like",
										"count",
										"{{postId}}"
									]
								},
								"description": "Get the number of likes for a selected post."
							},
							"response": []
						},
						{
							"name": "editOwnPost",
							"event": [
								{
									"listen": "test",
									"script": {
										"id": "3f35960c-17a8-401d-b304-d76bfa411f04",
										"exec": [
											"pm.test(\"Status code is 200\", function () {",
											"    pm.response.to.have.status(200);",
											"});",
											"pm.test(\"Body matches string\", function () {",
											"    pm.expect(pm.response.text()).to.include(\"edit own post\");",
											"});"
										],
										"type": "text/javascript"
									}
								}
							],
							"request": {
								"method": "PUT",
								"header": [
									{
										"key": "Content-Type",
										"name": "Content-Type",
										"value": "application/json",
										"type": "text"
									}
								],
								"body": {
									"mode": "raw",
									"raw": "{\r\n  \"id\": \"{{postId}}\",\r\n  \"switchSecurity\": false,\r\n  \"text\": \"edit own post\"\r\n}",
									"options": {
										"raw": {
											"language": "json"
										}
									}
								},
								"url": {
									"raw": "{{urlBase}}{{urlPost}}/update",
									"host": [
										"{{urlBase}}{{urlPost}}"
									],
									"path": [
										"update"
									]
								}
							},
							"response": []
						},
						{
							"name": "verifyPostCanNOTbeEditedEmpty",
							"event": [
								{
									"listen": "test",
									"script": {
										"id": "44f744ca-a624-498e-b0c7-e3563d02a258",
										"exec": [
											"pm.test(\"Status code is 200\", function () {",
											"    pm.response.to.have.status(500);",
											"});"
										],
										"type": "text/javascript"
									}
								}
							],
							"request": {
								"method": "PUT",
								"header": [
									{
										"key": "Content-Type",
										"name": "Content-Type",
										"value": "application/json",
										"type": "text"
									}
								],
								"body": {
									"mode": "raw",
									"raw": "{\r\n  \"id\": \"{{postId}}\",\r\n  \"switchSecurity\": false,\r\n  \"text\": \"\"\r\n}",
									"options": {
										"raw": {
											"language": "json"
										}
									}
								},
								"url": {
									"raw": "{{urlBase}}{{urlPost}}/update",
									"host": [
										"{{urlBase}}{{urlPost}}"
									],
									"path": [
										"update"
									]
								},
								"description": "Verify post can NOT be edited with empty body."
							},
							"response": []
						},
						{
							"name": "verifyPostIsEdited",
							"event": [
								{
									"listen": "test",
									"script": {
										"id": "2b1d3e99-9ca1-48cc-a5bf-aadec3bdb3ee",
										"exec": [
											"pm.test(\"Status code is 200\", function () {",
											"    pm.response.to.have.status(200);",
											"});",
											"pm.test(\"Body matches string\", function () {",
											"    pm.expect(pm.response.text()).to.include(\"edit own post\");",
											"});"
										],
										"type": "text/javascript"
									}
								}
							],
							"request": {
								"method": "GET",
								"header": [],
								"url": {
									"raw": "{{urlBase}}{{urlPost}}/{{postId}}",
									"host": [
										"{{urlBase}}{{urlPost}}"
									],
									"path": [
										"{{postId}}"
									]
								},
								"description": "Verify post is successfully edited by creator of the post."
							},
							"response": []
						},
						{
							"name": "deleteOwnPost",
							"event": [
								{
									"listen": "test",
									"script": {
										"id": "d44f0a20-5424-4d78-b150-4650b0555f34",
										"exec": [
											"pm.test(\"Status code is 200\", function () {",
											"    pm.response.to.have.status(200);",
											"});"
										],
										"type": "text/javascript"
									}
								}
							],
							"request": {
								"method": "DELETE",
								"header": [],
								"url": {
									"raw": "{{urlBase}}{{urlPost}}/delete/{{postId}}",
									"host": [
										"{{urlBase}}{{urlPost}}"
									],
									"path": [
										"delete",
										"{{postId}}"
									]
								}
							},
							"response": []
						},
						{
							"name": "verifyPostIsDeleted",
							"event": [
								{
									"listen": "test",
									"script": {
										"id": "004888e7-84f2-4261-b19f-485a48bf9293",
										"exec": [
											"pm.test(\"Status code must be 404\", function () {",
											"    pm.response.to.have.status(404);",
											"});"
										],
										"type": "text/javascript"
									}
								}
							],
							"request": {
								"method": "GET",
								"header": [],
								"url": {
									"raw": "{{urlBase}}{{urlPost}}/{{postId}}",
									"host": [
										"{{urlBase}}{{urlPost}}"
									],
									"path": [
										"{{postId}}"
									]
								},
								"description": "Verify author of the post, can delete his own post."
							},
							"response": []
						},
						{
							"name": "getPostsPerPage",
							"event": [
								{
									"listen": "test",
									"script": {
										"id": "e1d824b2-1c90-40b5-9a21-a149b5fdffd4",
										"exec": [
											"pm.test(\"Status code is 200\", function () {",
											"    pm.response.to.have.status(200);",
											"});"
										],
										"type": "text/javascript"
									}
								}
							],
							"request": {
								"method": "GET",
								"header": [],
								"url": {
									"raw": "{{urlBase}}{{urlPost}}?page=0&size=1",
									"host": [
										"{{urlBase}}{{urlPost}}"
									],
									"query": [
										{
											"key": "page",
											"value": "0"
										},
										{
											"key": "size",
											"value": "1"
										}
									]
								}
							},
							"response": []
						},
						{
							"name": "getPostsForCurrentUser",
							"event": [
								{
									"listen": "test",
									"script": {
										"id": "d830ed3f-f031-4291-9404-ff83f2c365b5",
										"exec": [
											"pm.test(\"Status code is 200\", function () {",
											"    pm.response.to.have.status(200);",
											"});"
										],
										"type": "text/javascript"
									}
								}
							],
							"request": {
								"method": "GET",
								"header": [],
								"url": {
									"raw": "{{urlBase}}{{urlPost}}/mine?page=0&size=1",
									"host": [
										"{{urlBase}}{{urlPost}}"
									],
									"path": [
										"mine"
									],
									"query": [
										{
											"key": "page",
											"value": "0"
										},
										{
											"key": "size",
											"value": "1"
										}
									]
								},
								"description": "Get all posts for the selected user."
							},
							"response": []
						},
						{
							"name": "getPostsByPopularity",
							"event": [
								{
									"listen": "test",
									"script": {
										"id": "3537ad4c-727e-4284-a489-a6ab3bed500a",
										"exec": [
											"pm.test(\"Status code is 200\", function () {",
											"    pm.response.to.have.status(200);",
											"});"
										],
										"type": "text/javascript"
									}
								}
							],
							"request": {
								"method": "GET",
								"header": [],
								"url": {
									"raw": "{{urlBase}}{{urlPost}}/mine?page=0&size=1",
									"host": [
										"{{urlBase}}{{urlPost}}"
									],
									"path": [
										"mine"
									],
									"query": [
										{
											"key": "page",
											"value": "0"
										},
										{
											"key": "size",
											"value": "1"
										}
									]
								},
								"description": "Get posts by number of likes."
							},
							"response": []
						},
						{
							"name": "getPostsForUser",
							"event": [
								{
									"listen": "test",
									"script": {
										"id": "9624be6f-c2d8-4859-b7ad-cc60c1573ba5",
										"exec": [
											"pm.test(\"Status code is 200\", function () {",
											"    pm.response.to.have.status(200);",
											"});"
										],
										"type": "text/javascript"
									}
								}
							],
							"request": {
								"method": "GET",
								"header": [],
								"url": {
									"raw": "{{urlBase}}{{urlPost}}/user/Sherlock?page=1&size=1",
									"host": [
										"{{urlBase}}{{urlPost}}"
									],
									"path": [
										"user",
										"Sherlock"
									],
									"query": [
										{
											"key": "page",
											"value": "1"
										},
										{
											"key": "size",
											"value": "1"
										}
									]
								},
								"description": "Get all posts for selected user."
							},
							"response": []
						}
					],
					"auth": {
						"type": "basic",
						"basic": [
							{
								"key": "password",
								"value": "password",
								"type": "string"
							},
							{
								"key": "username",
								"value": "Rambo",
								"type": "string"
							}
						]
					},
					"event": [
						{
							"listen": "prerequest",
							"script": {
								"id": "26a7eca2-4850-4e91-accf-fac9836f5985",
								"type": "text/javascript",
								"exec": [
									""
								]
							}
						},
						{
							"listen": "test",
							"script": {
								"id": "16368232-6fb8-41f5-9346-4de956c0f45e",
								"type": "text/javascript",
								"exec": [
									""
								]
							}
						}
					],
					"protocolProfileBehavior": {},
					"_postman_isSubFolder": true
				},
				{
					"name": "UnAuthenticatedUser",
					"item": [
						{
							"name": "getAllPosts",
							"event": [
								{
									"listen": "test",
									"script": {
										"id": "2c0dad44-b968-40d4-8f94-ecb331577fc2",
										"exec": [
											"pm.test(\"Status code is 200\", function () {",
											"    pm.response.to.have.status(200);",
											"});"
										],
										"type": "text/javascript"
									}
								}
							],
							"request": {
								"method": "GET",
								"header": [],
								"url": {
									"raw": "{{urlBase}}/api/posts",
									"host": [
										"{{urlBase}}"
									],
									"path": [
										"api",
										"posts"
									]
								},
								"description": "Un-authenticated user can see all public posts."
							},
							"response": []
						},
						{
							"name": "getPostById",
							"event": [
								{
									"listen": "test",
									"script": {
										"id": "4f4b1c64-8f60-4831-ba16-78c2ad2a78e5",
										"exec": [
											"pm.test(\"Status code is 200\", function () {",
											"    pm.response.to.have.status(200);",
											"});"
										],
										"type": "text/javascript"
									}
								}
							],
							"request": {
								"method": "GET",
								"header": [],
								"url": {
									"raw": "{{urlBase}}/api/posts/{{postIdTwo}}",
									"host": [
										"{{urlBase}}"
									],
									"path": [
										"api",
										"posts",
										"{{postIdTwo}}"
									]
								},
								"description": "Un-authenticated user can see exact public post."
							},
							"response": []
						}
					],
					"auth": {
						"type": "noauth"
					},
					"event": [
						{
							"listen": "prerequest",
							"script": {
								"id": "98eae28c-1d44-414f-a135-4a883b30a674",
								"type": "text/javascript",
								"exec": [
									""
								]
							}
						},
						{
							"listen": "test",
							"script": {
								"id": "bbd91387-988a-4445-9bf2-dfde722d4133",
								"type": "text/javascript",
								"exec": [
									""
								]
							}
						}
					],
					"protocolProfileBehavior": {},
					"_postman_isSubFolder": true
				},
				{
					"name": "Admin",
					"item": [
						{
							"name": "adminEditPost",
							"event": [
								{
									"listen": "test",
									"script": {
										"id": "dc87aab3-3d61-4c8e-85f4-e2a6bfc648ef",
										"exec": [
											"pm.test(\"Status code is 200\", function () {",
											"    pm.response.to.have.status(200);",
											"});",
											"pm.test(\"Body matches string\", function () {",
											"    pm.expect(pm.response.text()).to.include(\"Admin edited post!\");",
											"});"
										],
										"type": "text/javascript"
									}
								}
							],
							"request": {
								"method": "PUT",
								"header": [
									{
										"key": "Content-Type",
										"name": "Content-Type",
										"value": "application/json",
										"type": "text"
									}
								],
								"body": {
									"mode": "raw",
									"raw": "{\r\n  \"id\": \"{{postIdTwo}}\",\r\n  \"picture\": \"string\",\r\n  \"switchSecurity\": true,\r\n  \"text\": \"Admin edited post!\"\r\n}",
									"options": {
										"raw": {
											"language": "json"
										}
									}
								},
								"url": {
									"raw": "{{urlBase}}/api/admin/posts/update",
									"host": [
										"{{urlBase}}"
									],
									"path": [
										"api",
										"admin",
										"posts",
										"update"
									]
								},
								"description": "Admin can edit authenticated user."
							},
							"response": []
						},
						{
							"name": "verifyAdminCanNOTeditPostEmpty",
							"event": [
								{
									"listen": "test",
									"script": {
										"id": "33eaee3a-93ec-4bfe-bfa9-98c0a7ea8052",
										"exec": [
											"pm.test(\"Status code should be 500\", function () {",
											"    pm.response.to.have.status(500);",
											"});"
										],
										"type": "text/javascript"
									}
								}
							],
							"request": {
								"method": "PUT",
								"header": [
									{
										"key": "Content-Type",
										"name": "Content-Type",
										"value": "application/json",
										"type": "text"
									}
								],
								"body": {
									"mode": "raw",
									"raw": "{\r\n  \"id\": \"{{postIdTwo}}\",\r\n  \"picture\": \"string\",\r\n  \"switchSecurity\": true,\r\n  \"text\": \"\"\r\n}",
									"options": {
										"raw": {
											"language": "json"
										}
									}
								},
								"url": {
									"raw": "{{urlBase}}/api/admin/posts/update",
									"host": [
										"{{urlBase}}"
									],
									"path": [
										"api",
										"admin",
										"posts",
										"update"
									]
								},
								"description": "Verify admin can NOT edit a post with empty string."
							},
							"response": []
						},
						{
							"name": "verifyPostIsEditedByAdmin",
							"event": [
								{
									"listen": "test",
									"script": {
										"id": "853205a7-ca1f-4ebb-bedf-a58957aa81dd",
										"exec": [
											"pm.test(\"Status code is 200\", function () {",
											"    pm.response.to.have.status(200);",
											"});",
											"pm.test(\"Body matches string\", function () {",
											"    pm.expect(pm.response.text()).to.include(\"Admin edited post!\");",
											"});"
										],
										"type": "text/javascript"
									}
								}
							],
							"request": {
								"auth": {
									"type": "basic",
									"basic": [
										{
											"key": "username",
											"value": "Rambo",
											"type": "string"
										},
										{
											"key": "password",
											"value": "password",
											"type": "string"
										}
									]
								},
								"method": "GET",
								"header": [],
								"url": {
									"raw": "{{urlBase}}{{urlPost}}/{{postIdTwo}}",
									"host": [
										"{{urlBase}}{{urlPost}}"
									],
									"path": [
										"{{postIdTwo}}"
									]
								},
								"description": "Verify admin successfully edited post."
							},
							"response": []
						},
						{
							"name": "adminDeletePost",
							"event": [
								{
									"listen": "test",
									"script": {
										"id": "efeb639e-8f20-4fb5-ac39-f1bdb1c5ed26",
										"exec": [
											"pm.test(\"Status code is 200\", function () {",
											"    pm.response.to.have.status(200);",
											"});",
											""
										],
										"type": "text/javascript"
									}
								}
							],
							"request": {
								"method": "DELETE",
								"header": [],
								"url": {
									"raw": "{{urlBase}}/api/admin/posts/delete/{{postIdTwo}}",
									"host": [
										"{{urlBase}}"
									],
									"path": [
										"api",
										"admin",
										"posts",
										"delete",
										"{{postIdTwo}}"
									]
								},
								"description": "Admin can delete any user post."
							},
							"response": []
						},
						{
							"name": "verifyPostIsDeletedByAdmin",
							"event": [
								{
									"listen": "test",
									"script": {
										"id": "556db6a7-072a-4164-8cb8-ce8d08b982cb",
										"exec": [
											"pm.test(\"Status code must be 404\", function () {",
											"    pm.response.to.have.status(404);",
											"});"
										],
										"type": "text/javascript"
									}
								}
							],
							"request": {
								"auth": {
									"type": "basic",
									"basic": [
										{
											"key": "username",
											"value": "Rambo",
											"type": "string"
										},
										{
											"key": "password",
											"value": "password",
											"type": "string"
										}
									]
								},
								"method": "GET",
								"header": [],
								"url": {
									"raw": "{{urlBase}}{{urlPost}}/{{postIdTwo}}",
									"host": [
										"{{urlBase}}{{urlPost}}"
									],
									"path": [
										"{{postIdTwo}}"
									]
								},
								"description": "Verify admin successfully deleted post."
							},
							"response": []
						},
						{
							"name": "adminGetPostsByPage",
							"event": [
								{
									"listen": "test",
									"script": {
										"id": "8c5848ca-6e5c-4d85-a10e-53ace2833567",
										"exec": [
											"pm.test(\"Status code is 200\", function () {",
											"    pm.response.to.have.status(200);",
											"});"
										],
										"type": "text/javascript"
									}
								}
							],
							"request": {
								"method": "GET",
								"header": [],
								"url": {
									"raw": "{{urlBase}}/api/admin/posts?page=1&size=1",
									"host": [
										"{{urlBase}}"
									],
									"path": [
										"api",
										"admin",
										"posts"
									],
									"query": [
										{
											"key": "page",
											"value": "1"
										},
										{
											"key": "size",
											"value": "1"
										}
									]
								},
								"description": "Admin should see all posts, including the private ones."
							},
							"response": []
						}
					],
					"auth": {
						"type": "basic",
						"basic": [
							{
								"key": "username",
								"value": "Arnold",
								"type": "string"
							},
							{
								"key": "password",
								"value": "password",
								"type": "string"
							}
						]
					},
					"event": [
						{
							"listen": "prerequest",
							"script": {
								"id": "b0db10e1-b10a-402c-b6c9-64263c6b4600",
								"type": "text/javascript",
								"exec": [
									""
								]
							}
						},
						{
							"listen": "test",
							"script": {
								"id": "04d4ea5f-15eb-4dbc-9896-9c51f75d8975",
								"type": "text/javascript",
								"exec": [
									""
								]
							}
						}
					],
					"protocolProfileBehavior": {},
					"_postman_isSubFolder": true
				}
			],
			"protocolProfileBehavior": {}
		},
		{
			"name": "Comments",
			"item": [
				{
					"name": "AuthenticatedUser",
					"item": [
						{
							"name": "createComment",
							"event": [
								{
									"listen": "test",
									"script": {
										"id": "78006ba4-9d98-48c0-b070-a77b9049d6ce",
										"exec": [
											"pm.test(\"Status code is 200\", function () {",
											"    pm.response.to.have.status(200);",
											"});",
											"pm.test(\"Body matches string\", function () {",
											"    pm.expect(pm.response.text()).to.include(\"authenticated user comment\");",
											"});",
											"response = JSON.parse(responseBody)",
											"id = response.id",
											"pm.environment.set(\"commentId\", id);"
										],
										"type": "text/javascript"
									}
								}
							],
							"request": {
								"method": "POST",
								"header": [
									{
										"key": "Content-Type",
										"name": "Content-Type",
										"value": "application/json",
										"type": "text"
									}
								],
								"body": {
									"mode": "raw",
									"raw": "\"authenticated user comment\"",
									"options": {
										"raw": {
											"language": "json"
										}
									}
								},
								"url": {
									"raw": "{{urlBase}}{{urlComment}}/create/{{postIdThree}}",
									"host": [
										"{{urlBase}}{{urlComment}}"
									],
									"path": [
										"create",
										"{{postIdThree}}"
									]
								},
								"description": "Authenticated user comments a post."
							},
							"response": []
						},
						{
							"name": "createSecondComment",
							"event": [
								{
									"listen": "test",
									"script": {
										"id": "a53868d9-7aed-49be-8c65-49fffad206b0",
										"exec": [
											"pm.test(\"Status code is 200\", function () {",
											"    pm.response.to.have.status(200);",
											"});",
											"pm.test(\"Body matches string\", function () {",
											"    pm.expect(pm.response.text()).to.include(\"Sherlock comments this post\");",
											"});",
											"response = JSON.parse(responseBody)",
											"id = response.id",
											"pm.environment.set(\"commentIdTwo\", id);"
										],
										"type": "text/javascript"
									}
								}
							],
							"request": {
								"auth": {
									"type": "basic",
									"basic": [
										{
											"key": "username",
											"value": "Sherlock",
											"type": "string"
										},
										{
											"key": "password",
											"value": "password",
											"type": "string"
										}
									]
								},
								"method": "POST",
								"header": [
									{
										"key": "Content-Type",
										"name": "Content-Type",
										"value": "application/json",
										"type": "text"
									}
								],
								"body": {
									"mode": "raw",
									"raw": "\"Sherlock comments this post\"",
									"options": {
										"raw": {
											"language": "json"
										}
									}
								},
								"url": {
									"raw": "{{urlBase}}{{urlComment}}/create/{{postIdThree}}",
									"host": [
										"{{urlBase}}{{urlComment}}"
									],
									"path": [
										"create",
										"{{postIdThree}}"
									]
								},
								"description": "Create second comment from another user."
							},
							"response": []
						},
						{
							"name": "createThirdComment",
							"event": [
								{
									"listen": "test",
									"script": {
										"id": "fe06ed91-6da0-47c4-bd92-d371dcc6ae4b",
										"exec": [
											"pm.test(\"Status code is 200\", function () {",
											"    pm.response.to.have.status(200);",
											"});",
											"pm.test(\"Body matches string\", function () {",
											"    pm.expect(pm.response.text()).to.include(\"I must break you!\");",
											"});",
											"response = JSON.parse(responseBody)",
											"id = response.id",
											"pm.environment.set(\"commentIdThree\", id);"
										],
										"type": "text/javascript"
									}
								}
							],
							"request": {
								"auth": {
									"type": "basic",
									"basic": [
										{
											"key": "username",
											"value": "Rocky Balboa",
											"type": "string"
										},
										{
											"key": "password",
											"value": "password",
											"type": "string"
										}
									]
								},
								"method": "POST",
								"header": [
									{
										"key": "Content-Type",
										"name": "Content-Type",
										"value": "application/json",
										"type": "text"
									}
								],
								"body": {
									"mode": "raw",
									"raw": "\"I must break you!\"",
									"options": {
										"raw": {
											"language": "json"
										}
									}
								},
								"url": {
									"raw": "{{urlBase}}{{urlComment}}/create/{{postIdThree}}",
									"host": [
										"{{urlBase}}{{urlComment}}"
									],
									"path": [
										"create",
										"{{postIdThree}}"
									]
								},
								"description": "Create third comment from different user."
							},
							"response": []
						},
						{
							"name": "verifyCommentCanNOTbeCreatedEmpty",
							"event": [
								{
									"listen": "test",
									"script": {
										"id": "291a6660-f8ea-4570-a04b-74dab78d7388",
										"exec": [
											"pm.test(\"Status code must be 400\", function () {",
											"    pm.response.to.have.status(400);",
											"});"
										],
										"type": "text/javascript"
									}
								}
							],
							"request": {
								"method": "POST",
								"header": [],
								"url": {
									"raw": "{{urlBase}}{{urlComment}}/create/{{postIdThree}}",
									"host": [
										"{{urlBase}}{{urlComment}}"
									],
									"path": [
										"create",
										"{{postIdThree}}"
									]
								},
								"description": "Verify comment can NOT be created with empty string."
							},
							"response": []
						},
						{
							"name": "editOwnComment",
							"event": [
								{
									"listen": "test",
									"script": {
										"id": "c1e193a7-5de5-4e68-bab9-14d10a7745a0",
										"exec": [
											"pm.test(\"Status code is 200\", function () {",
											"    pm.response.to.have.status(200);",
											"});",
											"pm.test(\"Body matches string\", function () {",
											"    pm.expect(pm.response.text()).to.include(\"edited comment by author of the comment\");",
											"});"
										],
										"type": "text/javascript"
									}
								}
							],
							"request": {
								"method": "PUT",
								"header": [
									{
										"key": "Content-Type",
										"name": "Content-Type",
										"value": "application/json",
										"type": "text"
									}
								],
								"body": {
									"mode": "raw",
									"raw": "{\r\n  \"id\": \"{{commentId}}\",\r\n  \"text\": \"edited comment by author of the comment\"\r\n}",
									"options": {
										"raw": {
											"language": "json"
										}
									}
								},
								"url": {
									"raw": "{{urlBase}}{{urlComment}}/update",
									"host": [
										"{{urlBase}}{{urlComment}}"
									],
									"path": [
										"update"
									]
								},
								"description": "Authenticated user can edit his own post."
							},
							"response": []
						},
						{
							"name": "verifyCommentCanNOTbeEditedEmpty",
							"event": [
								{
									"listen": "test",
									"script": {
										"id": "c7cff757-4c37-4299-8d29-bdc8253ae9c0",
										"exec": [
											"pm.test(\"Status code should be 500\", function () {",
											"    pm.response.to.have.status(500);",
											"});"
										],
										"type": "text/javascript"
									}
								}
							],
							"request": {
								"method": "PUT",
								"header": [
									{
										"key": "Content-Type",
										"name": "Content-Type",
										"value": "application/json",
										"type": "text"
									}
								],
								"body": {
									"mode": "raw",
									"raw": "{\r\n  \"id\": \"{{commentId}}\",\r\n  \"text\": \"\"\r\n}",
									"options": {
										"raw": {
											"language": "json"
										}
									}
								},
								"url": {
									"raw": "{{urlBase}}{{urlComment}}/update",
									"host": [
										"{{urlBase}}{{urlComment}}"
									],
									"path": [
										"update"
									]
								},
								"description": "Verify comment can NOT be edited by author, with empty string."
							},
							"response": []
						},
						{
							"name": "likeComment",
							"event": [
								{
									"listen": "test",
									"script": {
										"id": "d33f4389-81f9-4c25-bcda-367daa3f3bf5",
										"exec": [
											"pm.test(\"Status code is 200\", function () {",
											"    pm.response.to.have.status(200);",
											"});"
										],
										"type": "text/javascript"
									}
								}
							],
							"request": {
								"method": "PUT",
								"header": [],
								"url": {
									"raw": "{{urlBase}}{{urlComment}}/like/{{commentId}}",
									"host": [
										"{{urlBase}}{{urlComment}}"
									],
									"path": [
										"like",
										"{{commentId}}"
									]
								},
								"description": "Authenticated user can like comment."
							},
							"response": []
						},
						{
							"name": "getNumberOfLikes",
							"event": [
								{
									"listen": "test",
									"script": {
										"id": "87d1cd7f-bfa1-45cb-aaef-0e77616d490e",
										"exec": [
											"pm.test(\"Status code is 200\", function () {",
											"    pm.response.to.have.status(200);",
											"});"
										],
										"type": "text/javascript"
									}
								}
							],
							"request": {
								"method": "GET",
								"header": [],
								"url": {
									"raw": "{{urlBase}}{{urlComment}}/like/count/{{commentId}}",
									"host": [
										"{{urlBase}}{{urlComment}}"
									],
									"path": [
										"like",
										"count",
										"{{commentId}}"
									]
								},
								"description": "Get number of likes for a selected comment of a post."
							},
							"response": []
						},
						{
							"name": "getCommentsForPost",
							"event": [
								{
									"listen": "test",
									"script": {
										"id": "6aad8eba-48de-4a36-a5ba-a9e9b1c64209",
										"exec": [
											"pm.test(\"Status code is 200\", function () {",
											"    pm.response.to.have.status(200);",
											"});"
										],
										"type": "text/javascript"
									}
								}
							],
							"request": {
								"method": "GET",
								"header": [],
								"url": {
									"raw": "{{urlBase}}{{urlComment}}/{{postIdThree}}",
									"host": [
										"{{urlBase}}{{urlComment}}"
									],
									"path": [
										"{{postIdThree}}"
									]
								},
								"description": "Authenticated user can see all comments for a given post."
							},
							"response": []
						},
						{
							"name": "deleteOwnComment",
							"event": [
								{
									"listen": "test",
									"script": {
										"id": "4d51f53c-c68a-451e-88a1-7d9336d19f6f",
										"exec": [
											"pm.test(\"Status code is 200\", function () {",
											"    pm.response.to.have.status(200);",
											"});"
										],
										"type": "text/javascript"
									}
								}
							],
							"request": {
								"method": "DELETE",
								"header": [],
								"url": {
									"raw": "{{urlBase}}{{urlComment}}/delete/{{commentId}}",
									"host": [
										"{{urlBase}}{{urlComment}}"
									],
									"path": [
										"delete",
										"{{commentId}}"
									]
								},
								"description": "Authenticated user can delete his own comment."
							},
							"response": []
						},
						{
							"name": "verifyCommentIsDeleted",
							"event": [
								{
									"listen": "test",
									"script": {
										"id": "dbb7e0d1-599f-4a9c-9724-342c0e04a2e2",
										"exec": [
											"pm.test(\"Status code is 200\", function () {",
											"    pm.response.to.have.status(200);",
											"});"
										],
										"type": "text/javascript"
									}
								}
							],
							"request": {
								"method": "GET",
								"header": [],
								"url": {
									"raw": "{{urlBase}}{{urlComment}}/{{postIdThree}}",
									"host": [
										"{{urlBase}}{{urlComment}}"
									],
									"path": [
										"{{postIdThree}}"
									]
								},
								"description": "Verify author of the comment, successfully deletes his own comment."
							},
							"response": []
						}
					],
					"auth": {
						"type": "basic",
						"basic": [
							{
								"key": "password",
								"value": "password",
								"type": "string"
							},
							{
								"key": "username",
								"value": "Elon Musk",
								"type": "string"
							}
						]
					},
					"protocolProfileBehavior": {},
					"_postman_isSubFolder": true
				},
				{
					"name": "Admin",
					"item": [
						{
							"name": "adminEditComment",
							"event": [
								{
									"listen": "test",
									"script": {
										"id": "ac5c6527-e12d-42d0-8ef1-8bf20db8c08f",
										"exec": [
											"pm.test(\"Status code is 200\", function () {",
											"    pm.response.to.have.status(200);",
											"});",
											"pm.test(\"Body matches string\", function () {",
											"    pm.expect(pm.response.text()).to.include(\"admin edited comment\");",
											"});"
										],
										"type": "text/javascript"
									}
								}
							],
							"request": {
								"method": "PUT",
								"header": [
									{
										"key": "Content-Type",
										"name": "Content-Type",
										"value": "application/json",
										"type": "text"
									}
								],
								"body": {
									"mode": "raw",
									"raw": "{\r\n  \"id\": \"{{commentIdTwo}}\",\r\n  \"text\": \"admin edited comment\"\r\n}",
									"options": {
										"raw": {
											"language": "json"
										}
									}
								},
								"url": {
									"raw": "{{urlBase}}/api/admin/comments/update",
									"host": [
										"{{urlBase}}"
									],
									"path": [
										"api",
										"admin",
										"comments",
										"update"
									]
								},
								"description": "Admin can edit any comment."
							},
							"response": []
						},
						{
							"name": "verifyAdminCanNOTeditCommentEmpty",
							"event": [
								{
									"listen": "test",
									"script": {
										"id": "e783fc63-cac6-4998-825d-35fbb131ee5b",
										"exec": [
											"pm.test(\"Status code is 200\", function () {",
											"    pm.response.to.have.status(500);",
											"});"
										],
										"type": "text/javascript"
									}
								}
							],
							"request": {
								"method": "PUT",
								"header": [
									{
										"key": "Content-Type",
										"name": "Content-Type",
										"value": "application/json",
										"type": "text"
									}
								],
								"body": {
									"mode": "raw",
									"raw": "{\r\n  \"id\": \"{{commentIdTwo}}\",\r\n  \"text\": \"\"\r\n}",
									"options": {
										"raw": {
											"language": "json"
										}
									}
								},
								"url": {
									"raw": "{{urlBase}}/api/admin/comments/update",
									"host": [
										"{{urlBase}}"
									],
									"path": [
										"api",
										"admin",
										"comments",
										"update"
									]
								},
								"description": "Verify admin can NOT edit comment, with empty string."
							},
							"response": []
						},
						{
							"name": "adminDeleteComment",
							"event": [
								{
									"listen": "test",
									"script": {
										"id": "56a127bb-f555-455a-9ae5-8b1928b19b3f",
										"exec": [
											"pm.test(\"Status code is 200\", function () {",
											"    pm.response.to.have.status(200);",
											"});"
										],
										"type": "text/javascript"
									}
								}
							],
							"request": {
								"method": "DELETE",
								"header": [],
								"url": {
									"raw": "{{urlBase}}/api/admin/comments/delete/{{commentIdTwo}}",
									"host": [
										"{{urlBase}}"
									],
									"path": [
										"api",
										"admin",
										"comments",
										"delete",
										"{{commentIdTwo}}"
									]
								},
								"description": "Admin can delete any comment."
							},
							"response": []
						},
						{
							"name": "getCommentsByPost",
							"event": [
								{
									"listen": "test",
									"script": {
										"id": "6d99c8bb-79e8-42fc-9533-3c9dc8a05a64",
										"exec": [
											"pm.test(\"Status code is 200\", function () {",
											"    pm.response.to.have.status(200);",
											"});"
										],
										"type": "text/javascript"
									}
								}
							],
							"request": {
								"method": "GET",
								"header": [],
								"url": {
									"raw": "{{urlBase}}/api/admin/comments/post/{{postIdThree}}",
									"host": [
										"{{urlBase}}"
									],
									"path": [
										"api",
										"admin",
										"comments",
										"post",
										"{{postIdThree}}"
									]
								},
								"description": "Admin must be able to see all comments for every post."
							},
							"response": []
						}
					],
					"auth": {
						"type": "basic",
						"basic": [
							{
								"key": "username",
								"value": "Arnold",
								"type": "string"
							},
							{
								"key": "password",
								"value": "password",
								"type": "string"
							}
						]
					},
					"event": [
						{
							"listen": "prerequest",
							"script": {
								"id": "27ddeb50-aa36-49b6-88d2-60cd6a8f3ff3",
								"type": "text/javascript",
								"exec": [
									""
								]
							}
						},
						{
							"listen": "test",
							"script": {
								"id": "c7b04f8a-f623-45c1-866c-e5f9ffc0ef23",
								"type": "text/javascript",
								"exec": [
									""
								]
							}
						}
					],
					"protocolProfileBehavior": {},
					"_postman_isSubFolder": true
				},
				{
					"name": "UnAuthenticatedUser",
					"item": [
						{
							"name": "getCommentsForPost",
							"event": [
								{
									"listen": "test",
									"script": {
										"id": "02a1c643-9c15-459b-8cfe-95c586d52c38",
										"exec": [
											"pm.test(\"Status code is 200\", function () {",
											"    pm.response.to.have.status(200);",
											"});",
											"pm.test(\"Body matches string\", function () {",
											"    pm.expect(pm.response.text()).to.include(\"I must break you!\");",
											"});"
										],
										"type": "text/javascript"
									}
								}
							],
							"request": {
								"method": "GET",
								"header": [],
								"url": {
									"raw": "{{urlBase}}/api/comments/post/{{postIdThree}}",
									"host": [
										"{{urlBase}}"
									],
									"path": [
										"api",
										"comments",
										"post",
										"{{postIdThree}}"
									]
								},
								"description": "Non-authenticated user can see all comments for a public post."
							},
							"response": []
						},
						{
							"name": "getCommentById",
							"event": [
								{
									"listen": "test",
									"script": {
										"id": "6f3f10b1-83ab-4542-9684-f0437ecfba2c",
										"exec": [
											"pm.test(\"Status code is 200\", function () {",
											"    pm.response.to.have.status(200);",
											"});",
											"pm.test(\"Body matches string\", function () {",
											"    pm.expect(pm.response.text()).to.include(\"I must break you!\");",
											"});"
										],
										"type": "text/javascript"
									}
								}
							],
							"request": {
								"method": "GET",
								"header": [],
								"url": {
									"raw": "{{urlBase}}/api/comments/{{commentIdThree}}",
									"host": [
										"{{urlBase}}"
									],
									"path": [
										"api",
										"comments",
										"{{commentIdThree}}"
									]
								},
								"description": "Public comments should be visible for unauthenticated users."
							},
							"response": []
						}
					],
					"auth": {
						"type": "noauth"
					},
					"protocolProfileBehavior": {},
					"_postman_isSubFolder": true
				}
			],
			"protocolProfileBehavior": {}
		},
		{
			"name": "Replies",
			"item": [
				{
					"name": "AuthenticatedUser",
					"item": [
						{
							"name": "createReply",
							"event": [
								{
									"listen": "test",
									"script": {
										"id": "5f5f3b5a-de3c-4206-bd2c-a722ee639f29",
										"exec": [
											"pm.test(\"Status code is 200\", function () {",
											"    pm.response.to.have.status(200);",
											"});",
											"pm.test(\"Body matches string\", function () {",
											"    pm.expect(pm.response.text()).to.include(\"this is a reply to a comment from authenticated user\");",
											"});",
											"response = JSON.parse(responseBody)",
											"id = response.id",
											"pm.environment.set(\"replyId\", id);"
										],
										"type": "text/javascript"
									}
								}
							],
							"request": {
								"method": "POST",
								"header": [
									{
										"key": "Content-Type",
										"name": "Content-Type",
										"value": "application/json",
										"type": "text"
									}
								],
								"body": {
									"mode": "raw",
									"raw": "\"this is a reply to a comment from authenticated user\"",
									"options": {
										"raw": {
											"language": "json"
										}
									}
								},
								"url": {
									"raw": "{{urlBase}}{{urlReply}}/comment/create/{{commentIdThree}}",
									"host": [
										"{{urlBase}}{{urlReply}}"
									],
									"path": [
										"comment",
										"create",
										"{{commentIdThree}}"
									]
								},
								"description": "Authenticated user can reply to a comment of a post."
							},
							"response": []
						},
						{
							"name": "createSecondReply",
							"event": [
								{
									"listen": "test",
									"script": {
										"id": "23982696-5ffd-426a-874e-47224439bc9c",
										"exec": [
											"pm.test(\"Status code is 200\", function () {",
											"    pm.response.to.have.status(200);",
											"});",
											"pm.test(\"Body matches string\", function () {",
											"    pm.expect(pm.response.text()).to.include(\"Rocky replies to a comment\");",
											"});",
											"response = JSON.parse(responseBody)",
											"id = response.id",
											"pm.environment.set(\"replyIdTwo\", id);"
										],
										"type": "text/javascript"
									}
								}
							],
							"request": {
								"auth": {
									"type": "basic",
									"basic": [
										{
											"key": "username",
											"value": "Rocky Balboa",
											"type": "string"
										},
										{
											"key": "password",
											"value": "password",
											"type": "string"
										}
									]
								},
								"method": "POST",
								"header": [
									{
										"key": "Content-Type",
										"name": "Content-Type",
										"value": "application/json",
										"type": "text"
									}
								],
								"body": {
									"mode": "raw",
									"raw": "\"Rocky replies to a comment\"",
									"options": {
										"raw": {
											"language": "json"
										}
									}
								},
								"url": {
									"raw": "{{urlBase}}{{urlReply}}/comment/create/{{commentIdThree}}",
									"host": [
										"{{urlBase}}{{urlReply}}"
									],
									"path": [
										"comment",
										"create",
										"{{commentIdThree}}"
									]
								},
								"description": "Create second reply for the same comment, from another user."
							},
							"response": []
						},
						{
							"name": "createThirdReply",
							"event": [
								{
									"listen": "test",
									"script": {
										"id": "add672b8-5e8f-4865-8a00-4911ab3a8717",
										"exec": [
											"pm.test(\"Status code is 200\", function () {",
											"    pm.response.to.have.status(200);",
											"});",
											"pm.test(\"Body matches string\", function () {",
											"    pm.expect(pm.response.text()).to.include(\"Rambo replies to a comment\");",
											"});",
											"response = JSON.parse(responseBody)",
											"id = response.id",
											"pm.environment.set(\"replyIdThree\", id);"
										],
										"type": "text/javascript"
									}
								}
							],
							"request": {
								"auth": {
									"type": "basic",
									"basic": [
										{
											"key": "username",
											"value": "Rambo",
											"type": "string"
										},
										{
											"key": "password",
											"value": "password",
											"type": "string"
										}
									]
								},
								"method": "POST",
								"header": [
									{
										"key": "Content-Type",
										"name": "Content-Type",
										"value": "application/json",
										"type": "text"
									}
								],
								"body": {
									"mode": "raw",
									"raw": "\"Rambo replies to a comment\"",
									"options": {
										"raw": {
											"language": "json"
										}
									}
								},
								"url": {
									"raw": "{{urlBase}}{{urlReply}}/comment/create/{{commentIdThree}}",
									"host": [
										"{{urlBase}}{{urlReply}}"
									],
									"path": [
										"comment",
										"create",
										"{{commentIdThree}}"
									]
								},
								"description": "Create third reply for the same comment, from different user."
							},
							"response": []
						},
						{
							"name": "verifyReplyCanNOTbeEmpty",
							"event": [
								{
									"listen": "test",
									"script": {
										"id": "ca69a34d-56be-4118-b989-f1e15b6d1d05",
										"exec": [
											"pm.test(\"Status code must be 400\", function () {",
											"    pm.response.to.have.status(400);",
											"});"
										],
										"type": "text/javascript"
									}
								}
							],
							"request": {
								"method": "POST",
								"header": [],
								"url": {
									"raw": "{{urlBase}}{{urlReply}}/comment/create/{{commentIdThree}}",
									"host": [
										"{{urlBase}}{{urlReply}}"
									],
									"path": [
										"comment",
										"create",
										"{{commentIdThree}}"
									]
								},
								"description": "Verify reply to a comment of a post, can NOT be created with empty string."
							},
							"response": []
						},
						{
							"name": "editOwnReply",
							"event": [
								{
									"listen": "test",
									"script": {
										"id": "f70e8e3a-66e5-4b3b-b4e1-80fc25088ffe",
										"exec": [
											"pm.test(\"Status code is 200\", function () {",
											"    pm.response.to.have.status(200);",
											"});",
											"pm.test(\"Body matches string\", function () {",
											"    pm.expect(pm.response.text()).to.include(\"edited reply by author of the reply\");",
											"});"
										],
										"type": "text/javascript"
									}
								}
							],
							"request": {
								"method": "PUT",
								"header": [
									{
										"key": "Content-Type",
										"name": "Content-Type",
										"value": "application/json",
										"type": "text"
									}
								],
								"body": {
									"mode": "raw",
									"raw": "{\r\n  \"id\": \"{{replyId}}\",\r\n  \"text\": \"edited reply by author of the reply\"\r\n}",
									"options": {
										"raw": {
											"language": "json"
										}
									}
								},
								"url": {
									"raw": "{{urlBase}}{{urlReply}}/update",
									"host": [
										"{{urlBase}}{{urlReply}}"
									],
									"path": [
										"update"
									]
								},
								"description": "Authenticated user can edit his own replies to a comment of a topic."
							},
							"response": []
						},
						{
							"name": "verifyReplyCanNOTbeEditedEmpty",
							"event": [
								{
									"listen": "test",
									"script": {
										"id": "9635adbd-b0df-4289-a94f-0a16c0544fa7",
										"exec": [
											"pm.test(\"Status code should be 500\", function () {",
											"    pm.response.to.have.status(500);",
											"});"
										],
										"type": "text/javascript"
									}
								}
							],
							"request": {
								"method": "PUT",
								"header": [
									{
										"key": "Content-Type",
										"name": "Content-Type",
										"value": "application/json",
										"type": "text"
									}
								],
								"body": {
									"mode": "raw",
									"raw": "{\r\n  \"id\": \"{{replyId}}\",\r\n  \"text\": \"\"\r\n}",
									"options": {
										"raw": {
											"language": "json"
										}
									}
								},
								"url": {
									"raw": "{{urlBase}}{{urlReply}}/update",
									"host": [
										"{{urlBase}}{{urlReply}}"
									],
									"path": [
										"update"
									]
								},
								"description": "Verify author can NOT edit his reply with empty string."
							},
							"response": []
						},
						{
							"name": " likeReply",
							"event": [
								{
									"listen": "test",
									"script": {
										"id": "60473b20-bf16-4873-84f9-0f980b9c3d58",
										"exec": [
											"pm.test(\"Status code is 200\", function () {",
											"    pm.response.to.have.status(200);",
											"});"
										],
										"type": "text/javascript"
									}
								}
							],
							"request": {
								"method": "PUT",
								"header": [],
								"url": {
									"raw": "{{urlBase}}{{urlReply}}/like/{{replyId}}",
									"host": [
										"{{urlBase}}{{urlReply}}"
									],
									"path": [
										"like",
										"{{replyId}}"
									]
								},
								"description": "Authenticated user can likes replies to comments of a post."
							},
							"response": []
						},
						{
							"name": "getAllRepliesForComment",
							"event": [
								{
									"listen": "test",
									"script": {
										"id": "73917764-f973-45a4-b56d-c8ab2bcf20ee",
										"exec": [
											"pm.test(\"Status code is 200\", function () {",
											"    pm.response.to.have.status(200);",
											"});",
											"pm.test(\"Body matches string\", function () {",
											"    pm.expect(pm.response.text()).to.include(\"edited reply by author of the reply\");",
											"});",
											"pm.test(\"Body matches string\", function () {",
											"    pm.expect(pm.response.text()).to.include(\"Rocky replies to a comment\");",
											"});",
											"pm.test(\"Body matches string\", function () {",
											"    pm.expect(pm.response.text()).to.include(\"Rambo replies to a comment\");",
											"});"
										],
										"type": "text/javascript"
									}
								}
							],
							"request": {
								"method": "GET",
								"header": [],
								"url": {
									"raw": "{{urlBase}}{{urlReply}}/comment/{{commentIdThree}}",
									"host": [
										"{{urlBase}}{{urlReply}}"
									],
									"path": [
										"comment",
										"{{commentIdThree}}"
									]
								},
								"description": "Authenticated user can see all replies for a comment of a post."
							},
							"response": []
						},
						{
							"name": "deleteReply",
							"event": [
								{
									"listen": "test",
									"script": {
										"id": "04e7437e-cdc3-437e-9253-38e185cf7af2",
										"exec": [
											"pm.test(\"Status code is 200\", function () {",
											"    pm.response.to.have.status(200);",
											"});"
										],
										"type": "text/javascript"
									}
								}
							],
							"request": {
								"method": "DELETE",
								"header": [],
								"url": {
									"raw": "{{urlBase}}{{urlReply}}/delete/{{replyId}}",
									"host": [
										"{{urlBase}}{{urlReply}}"
									],
									"path": [
										"delete",
										"{{replyId}}"
									]
								},
								"description": "Authenticated user can delete his own reply to a comment of a post."
							},
							"response": []
						}
					],
					"auth": {
						"type": "basic",
						"basic": [
							{
								"key": "password",
								"value": "password",
								"type": "string"
							},
							{
								"key": "username",
								"value": "Elon Musk",
								"type": "string"
							}
						]
					},
					"protocolProfileBehavior": {},
					"_postman_isSubFolder": true
				},
				{
					"name": "Admin",
					"item": [
						{
							"name": " getRepliesForCommentAdmin",
							"event": [
								{
									"listen": "test",
									"script": {
										"id": "2d74ab0f-3f1e-4329-bc38-83cd52b556da",
										"exec": [
											"pm.test(\"Status code is 200\", function () {",
											"    pm.response.to.have.status(200);",
											"});"
										],
										"type": "text/javascript"
									}
								}
							],
							"request": {
								"method": "GET",
								"header": [],
								"url": {
									"raw": "{{urlBase}}/api/admin/replies/comment/{{commentIdThree}}",
									"host": [
										"{{urlBase}}"
									],
									"path": [
										"api",
										"admin",
										"replies",
										"comment",
										"{{commentIdThree}}"
									]
								},
								"description": "Admin should be able to see all replies to a comment of a post."
							},
							"response": []
						},
						{
							"name": "adminEditReply",
							"event": [
								{
									"listen": "test",
									"script": {
										"id": "a395e00b-8f73-42c9-8ecd-78f03281ba13",
										"exec": [
											"pm.test(\"Status code is 200\", function () {",
											"    pm.response.to.have.status(200);",
											"});",
											"pm.test(\"Body matches string\", function () {",
											"    pm.expect(pm.response.text()).to.include(\"admin edited this reply for a comment of a post\");",
											"});"
										],
										"type": "text/javascript"
									}
								}
							],
							"request": {
								"method": "PUT",
								"header": [
									{
										"key": "Content-Type",
										"name": "Content-Type",
										"value": "application/json",
										"type": "text"
									}
								],
								"body": {
									"mode": "raw",
									"raw": "{\r\n  \"id\": \"{{replyIdTwo}}\",\r\n  \"text\": \"admin edited this reply for a comment of a post\"\r\n}",
									"options": {
										"raw": {
											"language": "json"
										}
									}
								},
								"url": {
									"raw": "{{urlBase}}/api/admin/replies/update",
									"host": [
										"{{urlBase}}"
									],
									"path": [
										"api",
										"admin",
										"replies",
										"update"
									]
								},
								"description": "Admin can edit any reply for a comment of a post."
							},
							"response": []
						},
						{
							"name": "verifyAdminCanNOTeditReplyEmpty",
							"event": [
								{
									"listen": "test",
									"script": {
										"id": "b1c9d441-96ed-4aa6-aae6-6eb021e0591e",
										"exec": [
											"pm.test(\"Status code is 200\", function () {",
											"    pm.response.to.have.status(500);",
											"});"
										],
										"type": "text/javascript"
									}
								}
							],
							"request": {
								"method": "PUT",
								"header": [
									{
										"key": "Content-Type",
										"name": "Content-Type",
										"value": "application/json",
										"type": "text"
									}
								],
								"body": {
									"mode": "raw",
									"raw": "{\r\n  \"id\": \"{{replyIdTwo}}\",\r\n  \"text\": \"\"\r\n}",
									"options": {
										"raw": {
											"language": "json"
										}
									}
								},
								"url": {
									"raw": "{{urlBase}}/api/admin/replies/update",
									"host": [
										"{{urlBase}}"
									],
									"path": [
										"api",
										"admin",
										"replies",
										"update"
									]
								},
								"description": "Verify admin can NOT edit a reply with empty string."
							},
							"response": []
						},
						{
							"name": "adminDeleteReply",
							"event": [
								{
									"listen": "test",
									"script": {
										"id": "bdf529fb-5ba3-4578-92ba-006cdeb2bcd5",
										"exec": [
											"pm.test(\"Status code is 200\", function () {",
											"    pm.response.to.have.status(200);",
											"});"
										],
										"type": "text/javascript"
									}
								}
							],
							"request": {
								"method": "DELETE",
								"header": [],
								"url": {
									"raw": "{{urlBase}}/api/admin/replies/delete/{{replyIdTwo}}",
									"host": [
										"{{urlBase}}"
									],
									"path": [
										"api",
										"admin",
										"replies",
										"delete",
										"{{replyIdTwo}}"
									]
								},
								"description": "Admin can delete any reply for a comment of a post."
							},
							"response": []
						}
					],
					"auth": {
						"type": "basic",
						"basic": [
							{
								"key": "username",
								"value": "Arnold",
								"type": "string"
							},
							{
								"key": "password",
								"value": "password",
								"type": "string"
							}
						]
					},
					"event": [
						{
							"listen": "prerequest",
							"script": {
								"id": "322b74e7-5e52-4a1e-8b10-d439a313416f",
								"type": "text/javascript",
								"exec": [
									""
								]
							}
						},
						{
							"listen": "test",
							"script": {
								"id": "0dc200e3-dbee-4e85-a388-7cec068e1647",
								"type": "text/javascript",
								"exec": [
									""
								]
							}
						}
					],
					"protocolProfileBehavior": {},
					"_postman_isSubFolder": true
				},
				{
					"name": "UnAuthenticatedUser",
					"item": [
						{
							"name": "getRepliesForComment",
							"event": [
								{
									"listen": "test",
									"script": {
										"id": "b9431cdc-3f9b-4d36-914c-716f34a96497",
										"exec": [
											"pm.test(\"Status code is 200\", function () {",
											"    pm.response.to.have.status(200);",
											"});",
											"pm.test(\"Body matches string\", function () {",
											"    pm.expect(pm.response.text()).to.include(\"Rambo replies to a comment\");",
											"});"
										],
										"type": "text/javascript"
									}
								}
							],
							"request": {
								"method": "GET",
								"header": [],
								"url": {
									"raw": "{{urlBase}}/api/replies/comment/{{commentIdThree}}",
									"host": [
										"{{urlBase}}"
									],
									"path": [
										"api",
										"replies",
										"comment",
										"{{commentIdThree}}"
									]
								},
								"description": "Non-authenticated user can see all public replies for a comment of a post."
							},
							"response": []
						}
					],
					"protocolProfileBehavior": {},
					"_postman_isSubFolder": true
				}
			],
			"protocolProfileBehavior": {}
		},
		{
			"name": "ConnectWithUser",
			"item": [
				{
					"name": "sendConnectionRequest",
					"event": [
						{
							"listen": "test",
							"script": {
								"id": "ad092253-0fa8-4bcc-83cd-88b7ca6f7f12",
								"exec": [
									"pm.test(\"Status code is 200\", function () {",
									"    pm.response.to.have.status(200);",
									"});",
									"pm.test(\"Body matches string\", function () {",
									"    pm.expect(pm.response.text()).to.include(\"WAITING\");",
									"});"
								],
								"type": "text/javascript"
							}
						}
					],
					"request": {
						"method": "POST",
						"header": [],
						"url": {
							"raw": "{{urlBase}}{{urlConnection}}/send/{{user}}",
							"host": [
								"{{urlBase}}{{urlConnection}}"
							],
							"path": [
								"send",
								"{{user}}"
							]
						},
						"description": "Authenticated user sends connection request to another authenticated user."
					},
					"response": []
				},
				{
					"name": "getPendingUsers",
					"event": [
						{
							"listen": "test",
							"script": {
								"id": "1e9a8944-b9b5-4159-9b9f-9322b4073618",
								"exec": [
									"pm.test(\"Status code is 200\", function () {",
									"    pm.response.to.have.status(200);",
									"});"
								],
								"type": "text/javascript"
							}
						}
					],
					"request": {
						"method": "GET",
						"header": [],
						"url": {
							"raw": "{{urlBase}}{{urlConnection}}/waiting",
							"host": [
								"{{urlBase}}{{urlConnection}}"
							],
							"path": [
								"waiting"
							]
						},
						"description": "Get all users, who are waiting for their friend requests to be accepted."
					},
					"response": []
				},
				{
					"name": "acceptFriendRequest",
					"event": [
						{
							"listen": "test",
							"script": {
								"id": "09c970f6-d524-459d-8afd-9d05117bb484",
								"exec": [
									"pm.test(\"Status code is 200\", function () {",
									"    pm.response.to.have.status(200);",
									"});",
									"pm.test(\"Body matches string\", function () {",
									"    pm.expect(pm.response.text()).to.include(\"true\");",
									"});"
								],
								"type": "text/javascript"
							}
						}
					],
					"request": {
						"auth": {
							"type": "basic",
							"basic": [
								{
									"key": "username",
									"value": "Sherlock",
									"type": "string"
								},
								{
									"key": "password",
									"value": "password",
									"type": "string"
								}
							]
						},
						"method": "PUT",
						"header": [],
						"url": {
							"raw": "{{urlBase}}{{urlConnection}}/accept/1",
							"host": [
								"{{urlBase}}{{urlConnection}}"
							],
							"path": [
								"accept",
								"1"
							]
						},
						"description": "Authenticated user accepts friend request, sent by another authenticated user."
					},
					"response": []
				},
				{
					"name": "getAllConnectedUsers",
					"event": [
						{
							"listen": "test",
							"script": {
								"id": "82924942-e24e-48a7-b477-fbf0d7a3da08",
								"exec": [
									"pm.test(\"Status code is 200\", function () {",
									"    pm.response.to.have.status(200);",
									"});",
									"pm.test(\"Body matches string\", function () {",
									"    pm.expect(pm.response.text()).to.include(\"Elon Musk\");",
									"});",
									"pm.test(\"Body matches string\", function () {",
									"    pm.expect(pm.response.text()).to.include(\"Sherlock\");",
									"});"
								],
								"type": "text/javascript"
							}
						}
					],
					"request": {
						"method": "GET",
						"header": [],
						"url": {
							"raw": "{{urlBase}}{{urlConnection}}/approved",
							"host": [
								"{{urlBase}}{{urlConnection}}"
							],
							"path": [
								"approved"
							]
						},
						"description": "List of all connected users."
					},
					"response": []
				},
				{
					"name": "disconnectUser",
					"event": [
						{
							"listen": "test",
							"script": {
								"id": "e51cbcd0-84bd-4480-ae49-386598df769a",
								"exec": [
									"pm.test(\"Status code is 200\", function () {",
									"    pm.response.to.have.status(200);",
									"});",
									""
								],
								"type": "text/javascript"
							}
						}
					],
					"request": {
						"method": "DELETE",
						"header": [],
						"url": {
							"raw": "{{urlBase}}{{urlConnection}}/disconnect/{{user}}",
							"host": [
								"{{urlBase}}{{urlConnection}}"
							],
							"path": [
								"disconnect",
								"{{user}}"
							]
						},
						"description": "Authenticated user can unfriend another authenticated user."
					},
					"response": []
				},
				{
					"name": "verifyUserIsDiconnected",
					"event": [
						{
							"listen": "test",
							"script": {
								"id": "431ebbca-1f8c-487f-bcca-d237d7184927",
								"exec": [
									"pm.test(\"Status code is 200\", function () {",
									"    pm.response.to.have.status(200);",
									"});",
									"pm.test(\"Body matches string\", function () {",
									"    pm.expect(pm.response.text()).to.not.include(\"Sherlock\");",
									"});"
								],
								"type": "text/javascript"
							}
						}
					],
					"request": {
						"method": "GET",
						"header": [],
						"url": {
							"raw": "{{urlBase}}{{urlConnection}}/approved",
							"host": [
								"{{urlBase}}{{urlConnection}}"
							],
							"path": [
								"approved"
							]
						},
						"description": "Verify user is successfully unfriended another user."
					},
					"response": []
				}
			],
			"auth": {
				"type": "basic",
				"basic": [
					{
						"key": "username",
						"value": "Elon Musk",
						"type": "string"
					},
					{
						"key": "password",
						"value": "password",
						"type": "string"
					}
				]
			},
			"event": [
				{
					"listen": "prerequest",
					"script": {
						"id": "a12cdc9f-152d-446c-b6bb-d9c94cd0c181",
						"type": "text/javascript",
						"exec": [
							""
						]
					}
				},
				{
					"listen": "test",
					"script": {
						"id": "7f460c87-0e57-486b-89ec-3b82d33375bc",
						"type": "text/javascript",
						"exec": [
							""
						]
					}
				}
			],
			"protocolProfileBehavior": {}
		},
		{
			"name": "UserAdministration",
			"item": [
				{
					"name": "getCurrentUser",
					"event": [
						{
							"listen": "test",
							"script": {
								"id": "8e01462e-6af8-4bbe-8b3b-e7b039e778eb",
								"exec": [
									"pm.test(\"Status code is 200\", function () {",
									"    pm.response.to.have.status(200);",
									"});"
								],
								"type": "text/javascript"
							}
						}
					],
					"request": {
						"method": "GET",
						"header": [],
						"url": {
							"raw": "{{urlBase}}{{urlUser}}/current",
							"host": [
								"{{urlBase}}{{urlUser}}"
							],
							"path": [
								"current"
							]
						}
					},
					"response": []
				},
				{
					"name": "getAllUsers",
					"event": [
						{
							"listen": "test",
							"script": {
								"id": "d9bc3db5-6901-4dc6-b1e5-5798be397536",
								"exec": [
									"pm.test(\"Status code is 200\", function () {",
									"    pm.response.to.have.status(200);",
									"});",
									"pm.test(\"Body matches string\", function () {",
									"    pm.expect(pm.response.text()).to.include(\"Elon Musk\");",
									"});",
									"pm.test(\"Body matches string\", function () {",
									"    pm.expect(pm.response.text()).to.include(\"Sherlock\");",
									"});",
									"pm.test(\"Body matches string\", function () {",
									"    pm.expect(pm.response.text()).to.include(\"Rambo\");",
									"});",
									"pm.test(\"Body matches string\", function () {",
									"    pm.expect(pm.response.text()).to.include(\"Rocky Balboa\");",
									"});",
									"pm.test(\"Body matches string\", function () {",
									"    pm.expect(pm.response.text()).to.include(\"James\");",
									"});",
									"pm.test(\"Body matches string\", function () {",
									"    pm.expect(pm.response.text()).to.include(\"Arnold\");",
									"});",
									"pm.test(\"Body matches string\", function () {",
									"    pm.expect(pm.response.text()).to.include(\"James2\");",
									"});"
								],
								"type": "text/javascript"
							}
						}
					],
					"request": {
						"method": "GET",
						"header": [],
						"url": {
							"raw": "{{urlBase}}{{urlUser}}",
							"host": [
								"{{urlBase}}{{urlUser}}"
							]
						}
					},
					"response": []
				},
				{
					"name": "editOwnProfile",
					"event": [
						{
							"listen": "test",
							"script": {
								"id": "9722fddc-942a-4ed2-9447-34e49051ed19",
								"exec": [
									"pm.test(\"Status code is 200\", function () {",
									"    pm.response.to.have.status(200);",
									"});"
								],
								"type": "text/javascript"
							}
						}
					],
					"request": {
						"method": "PUT",
						"header": [
							{
								"key": "Content-Type",
								"name": "Content-Type",
								"value": "application/json",
								"type": "text"
							}
						],
						"body": {
							"mode": "raw",
							"raw": "{\r\n  \"alias\": \"Tesla\",\r\n  \"info\": {\r\n    \"description\": \"I am the real Tony Stark!\",\r\n    \"favoriteMap\": \"dust 2\",\r\n    \"favoriteWeapon\": \"M4A4\",\r\n    \"nationality\": \"United States\",\r\n    \"privacyType\": \"private\",\r\n    \"rank\": \"Silver I\",\r\n    \"team\": \"SpaceX\"\r\n  }\r\n}",
							"options": {
								"raw": {
									"language": "json"
								}
							}
						},
						"url": {
							"raw": "{{urlBase}}{{urlUser}}",
							"host": [
								"{{urlBase}}{{urlUser}}"
							]
						},
						"description": "Authenticated user can edit his own profile."
					},
					"response": []
				},
				{
					"name": "deleteOwnProfile",
					"event": [
						{
							"listen": "test",
							"script": {
								"id": "f50219c5-c7b3-434b-98ed-ed98a50e0efc",
								"exec": [
									"pm.test(\"Status code is 200\", function () {",
									"    pm.response.to.have.status(200);",
									"});",
									"pm.test(\"Body matches string\", function () {",
									"    pm.expect(pm.response.text()).to.include(\"James2\");",
									"});"
								],
								"type": "text/javascript"
							}
						}
					],
					"request": {
						"auth": {
							"type": "basic",
							"basic": [
								{
									"key": "username",
									"value": "James2",
									"type": "string"
								},
								{
									"key": "password",
									"value": "password",
									"type": "string"
								}
							]
						},
						"method": "DELETE",
						"header": [],
						"url": {
							"raw": "{{urlBase}}{{urlUser}}/delete",
							"host": [
								"{{urlBase}}{{urlUser}}"
							],
							"path": [
								"delete"
							]
						},
						"description": "Authenticated user can delete his own profile."
					},
					"response": []
				},
				{
					"name": "verifyUserIsDeleted",
					"event": [
						{
							"listen": "test",
							"script": {
								"id": "39f41e91-ad57-4b09-8679-96ab2f2cff1b",
								"exec": [
									"pm.test(\"Status code is 404\", function () {",
									"    pm.response.to.have.status(404);",
									"});",
									""
								],
								"type": "text/javascript"
							}
						}
					],
					"request": {
						"auth": {
							"type": "basic",
							"basic": [
								{
									"key": "username",
									"value": "James2",
									"type": "string"
								},
								{
									"key": "password",
									"value": "password",
									"type": "string"
								}
							]
						},
						"method": "GET",
						"header": [],
						"url": {
							"raw": "{{urlBase}}{{urlUser}}/current",
							"host": [
								"{{urlBase}}{{urlUser}}"
							],
							"path": [
								"current"
							]
						},
						"description": "Verify user can successfully delete his profil."
					},
					"response": []
				}
			],
			"auth": {
				"type": "basic",
				"basic": [
					{
						"key": "password",
						"value": "password",
						"type": "string"
					},
					{
						"key": "username",
						"value": "Elon musk",
						"type": "string"
					}
				]
			},
			"event": [
				{
					"listen": "prerequest",
					"script": {
						"id": "44a9c4b3-8765-42d5-80b0-c35d55f0bd2e",
						"type": "text/javascript",
						"exec": [
							""
						]
					}
				},
				{
					"listen": "test",
					"script": {
						"id": "42db84ad-2fd5-4638-9cad-1f7077abf6e3",
						"type": "text/javascript",
						"exec": [
							""
						]
					}
				}
			],
			"protocolProfileBehavior": {}
		},
		{
			"name": "AdminAdministration",
			"item": [
				{
					"name": "editAdmin",
					"event": [
						{
							"listen": "test",
							"script": {
								"id": "692750cb-a424-471c-93d7-6ae0e20019c6",
								"exec": [
									"pm.test(\"Status code is 200\", function () {",
									"    pm.response.to.have.status(200);",
									"});"
								],
								"type": "text/javascript"
							}
						}
					],
					"request": {
						"method": "PUT",
						"header": [
							{
								"key": "Content-Type",
								"name": "Content-Type",
								"value": "application/json",
								"type": "text"
							}
						],
						"body": {
							"mode": "raw",
							"raw": "{\r\n  \"alias\": \"James May\",\r\n  \"info\": {\r\n    \"description\": \"Good news, the new Dacia Sandero...\",\r\n    \"favoriteMap\": \"Vertigo\",\r\n    \"favoriteWeapon\": \"P90\",\r\n    \"nationality\": \"United Kingdom\",\r\n    \"privacyType\": \"public\",\r\n    \"rank\": \"Silver I\",\r\n    \"team\": \"Grand Tour\"\r\n  }\r\n}",
							"options": {
								"raw": {
									"language": "json"
								}
							}
						},
						"url": {
							"raw": "{{urlBase}}{{urlAdmin}}/update/James",
							"host": [
								"{{urlBase}}{{urlAdmin}}"
							],
							"path": [
								"update",
								"James"
							]
						}
					},
					"response": []
				},
				{
					"name": "banUser",
					"event": [
						{
							"listen": "test",
							"script": {
								"id": "54c03296-d1ed-4a77-8ef5-0abc1501fab4",
								"exec": [
									"pm.test(\"Status code is 200\", function () {",
									"    pm.response.to.have.status(200);",
									"});",
									"pm.test(\"Body matches string\", function () {",
									"    pm.expect(pm.response.text()).to.include(\"James\");",
									"});"
								],
								"type": "text/javascript"
							}
						}
					],
					"request": {
						"method": "DELETE",
						"header": [],
						"url": {
							"raw": "{{urlBase}}{{urlAdmin}}/delete/5",
							"host": [
								"{{urlBase}}{{urlAdmin}}"
							],
							"path": [
								"delete",
								"5"
							]
						},
						"description": "Admin can ban users."
					},
					"response": []
				}
			],
			"auth": {
				"type": "basic",
				"basic": [
					{
						"key": "username",
						"value": "Arnold",
						"type": "string"
					},
					{
						"key": "password",
						"value": "password",
						"type": "string"
					}
				]
			},
			"event": [
				{
					"listen": "prerequest",
					"script": {
						"id": "507a5137-6428-4e72-8b28-2c6e54348f1a",
						"type": "text/javascript",
						"exec": [
							""
						]
					}
				},
				{
					"listen": "test",
					"script": {
						"id": "3ab493ea-9a14-4e2f-ab3e-37b9c5483bf8",
						"type": "text/javascript",
						"exec": [
							""
						]
					}
				}
			],
			"protocolProfileBehavior": {}
		},
		{
			"name": "Nationality",
			"item": [
				{
					"name": "getAllNationalities",
					"event": [
						{
							"listen": "test",
							"script": {
								"id": "62a27199-fe61-4c50-bda6-dd54ccfeee42",
								"exec": [
									"pm.test(\"Status code is 200\", function () {",
									"    pm.response.to.have.status(200);",
									"});"
								],
								"type": "text/javascript"
							}
						}
					],
					"request": {
						"method": "GET",
						"header": [],
						"url": {
							"raw": "{{urlBase}}{{urlNationality}}",
							"host": [
								"{{urlBase}}{{urlNationality}}"
							]
						}
					},
					"response": []
				},
				{
					"name": "getNatioanlityById",
					"event": [
						{
							"listen": "test",
							"script": {
								"id": "72e0f6f4-3d0a-4674-965c-1b8e81dc8154",
								"exec": [
									"pm.test(\"Status code is 200\", function () {",
									"    pm.response.to.have.status(200);",
									"});"
								],
								"type": "text/javascript"
							}
						}
					],
					"request": {
						"method": "GET",
						"header": [],
						"url": {
							"raw": "{{urlBase}}{{urlNationality}}/20",
							"host": [
								"{{urlBase}}{{urlNationality}}"
							],
							"path": [
								"20"
							]
						}
					},
					"response": []
				},
				{
					"name": "getNationalityByName",
					"event": [
						{
							"listen": "test",
							"script": {
								"id": "1d938348-f0a0-4c60-98d6-15ffc5010721",
								"exec": [
									"pm.test(\"Status code is 200\", function () {",
									"    pm.response.to.have.status(200);",
									"});"
								],
								"type": "text/javascript"
							}
						}
					],
					"request": {
						"method": "GET",
						"header": [],
						"url": {
							"raw": "{{urlBase}}{{urlNationality}}/name/Bulgaria",
							"host": [
								"{{urlBase}}{{urlNationality}}"
							],
							"path": [
								"name",
								"Bulgaria"
							]
						}
					},
					"response": []
				}
			],
			"auth": {
				"type": "basic",
				"basic": [
					{
						"key": "username",
						"value": "Arnold",
						"type": "string"
					},
					{
						"key": "password",
						"value": "password",
						"type": "string"
					}
				]
			},
			"event": [
				{
					"listen": "prerequest",
					"script": {
						"id": "13742b60-5a1c-499d-9715-7aa9b477d130",
						"type": "text/javascript",
						"exec": [
							""
						]
					}
				},
				{
					"listen": "test",
					"script": {
						"id": "0a75a95f-8a86-45ab-a369-e58b45b3f7cc",
						"type": "text/javascript",
						"exec": [
							""
						]
					}
				}
			],
			"protocolProfileBehavior": {}
		},
		{
			"name": "Map",
			"item": [
				{
					"name": "getAllMaps",
					"event": [
						{
							"listen": "test",
							"script": {
								"id": "c41f0005-dc6c-42c6-b80c-f28039132c47",
								"exec": [
									"pm.test(\"Status code is 200\", function () {",
									"    pm.response.to.have.status(200);",
									"});"
								],
								"type": "text/javascript"
							}
						}
					],
					"request": {
						"method": "GET",
						"header": [],
						"url": {
							"raw": "{{urlBase}}{{urlMap}}",
							"host": [
								"{{urlBase}}{{urlMap}}"
							]
						}
					},
					"response": []
				},
				{
					"name": "getMapById",
					"event": [
						{
							"listen": "test",
							"script": {
								"id": "25bf4e3a-f7eb-4cd8-9ad1-53b4bf850e23",
								"exec": [
									"pm.test(\"Status code is 200\", function () {",
									"    pm.response.to.have.status(200);",
									"});",
									"pm.test(\"Body matches string\", function () {",
									"    pm.expect(pm.response.text()).to.include(\"Dust 2\");",
									"});"
								],
								"type": "text/javascript"
							}
						}
					],
					"request": {
						"method": "GET",
						"header": [],
						"url": {
							"raw": "{{urlBase}}{{urlMap}}/{{mapID}}",
							"host": [
								"{{urlBase}}{{urlMap}}"
							],
							"path": [
								"{{mapID}}"
							]
						}
					},
					"response": []
				},
				{
					"name": "getMapByName",
					"event": [
						{
							"listen": "test",
							"script": {
								"id": "b7766312-e26f-4b40-b561-b7c8e9bd2034",
								"exec": [
									"pm.test(\"Status code is 200\", function () {",
									"    pm.response.to.have.status(200);",
									"});"
								],
								"type": "text/javascript"
							}
						}
					],
					"request": {
						"method": "GET",
						"header": [],
						"url": {
							"raw": "{{urlBase}}{{urlMap}}/name/dust 2",
							"host": [
								"{{urlBase}}{{urlMap}}"
							],
							"path": [
								"name",
								"dust 2"
							]
						}
					},
					"response": []
				}
			],
			"protocolProfileBehavior": {}
		},
		{
			"name": "Ranks",
			"item": [
				{
					"name": "getAllRanks",
					"event": [
						{
							"listen": "test",
							"script": {
								"id": "3b3f9d86-afbd-404c-9fb5-19493d66251b",
								"exec": [
									"pm.test(\"Status code is 200\", function () {",
									"    pm.response.to.have.status(200);",
									"});"
								],
								"type": "text/javascript"
							}
						}
					],
					"request": {
						"method": "GET",
						"header": [],
						"url": {
							"raw": "{{urlBase}}{{urlRank}}",
							"host": [
								"{{urlBase}}{{urlRank}}"
							]
						}
					},
					"response": []
				},
				{
					"name": "getRankById",
					"event": [
						{
							"listen": "test",
							"script": {
								"id": "27800917-ec8f-47a9-8bd9-5c0b56ac5232",
								"exec": [
									"pm.test(\"Status code is 200\", function () {",
									"    pm.response.to.have.status(200);",
									"});",
									"pm.test(\"Body matches string\", function () {",
									"    pm.expect(pm.response.text()).to.include(\"Silver I\");",
									"});"
								],
								"type": "text/javascript"
							}
						}
					],
					"request": {
						"method": "GET",
						"header": [],
						"url": {
							"raw": "{{urlBase}}{{urlRank}}/1",
							"host": [
								"{{urlBase}}{{urlRank}}"
							],
							"path": [
								"1"
							]
						}
					},
					"response": []
				},
				{
					"name": "getRankByName",
					"event": [
						{
							"listen": "test",
							"script": {
								"id": "45e89969-b9d8-4a9b-84fc-1e1243d00f1a",
								"exec": [
									"pm.test(\"Status code is 200\", function () {",
									"    pm.response.to.have.status(200);",
									"});",
									"pm.test(\"Body matches string\", function () {",
									"    pm.expect(pm.response.text()).to.include(\"Silver I\");",
									"});"
								],
								"type": "text/javascript"
							}
						}
					],
					"request": {
						"method": "GET",
						"header": [],
						"url": {
							"raw": "{{urlBase}}{{urlRank}}/name/Silver I",
							"host": [
								"{{urlBase}}{{urlRank}}"
							],
							"path": [
								"name",
								"Silver I"
							]
						}
					},
					"response": []
				}
			],
			"protocolProfileBehavior": {}
		},
		{
			"name": "Weapons",
			"item": [
				{
					"name": "getAllWeapons",
					"event": [
						{
							"listen": "test",
							"script": {
								"id": "77dd3874-eb79-4d52-87cd-40ebbf16b278",
								"exec": [
									"pm.test(\"Status code is 200\", function () {",
									"    pm.response.to.have.status(200);",
									"});"
								],
								"type": "text/javascript"
							}
						}
					],
					"request": {
						"method": "GET",
						"header": [],
						"url": {
							"raw": "{{urlBase}}{{urlWeapon}}",
							"host": [
								"{{urlBase}}{{urlWeapon}}"
							]
						}
					},
					"response": []
				},
				{
					"name": "getWeaponById",
					"event": [
						{
							"listen": "test",
							"script": {
								"id": "50bd2f57-0890-4eb1-ae1f-1007b69eea0e",
								"exec": [
									"pm.test(\"Status code is 200\", function () {",
									"    pm.response.to.have.status(200);",
									"});",
									"pm.test(\"Body matches string\", function () {",
									"    pm.expect(pm.response.text()).to.include(\"M4A4\");",
									"});"
								],
								"type": "text/javascript"
							}
						}
					],
					"request": {
						"method": "GET",
						"header": [],
						"url": {
							"raw": "{{urlBase}}{{urlWeapon}}/20",
							"host": [
								"{{urlBase}}{{urlWeapon}}"
							],
							"path": [
								"20"
							]
						}
					},
					"response": []
				},
				{
					"name": "getWeaponByName",
					"event": [
						{
							"listen": "test",
							"script": {
								"id": "60310263-a6a0-438e-a55f-555fa1e3d1a4",
								"exec": [
									"pm.test(\"Status code is 200\", function () {",
									"    pm.response.to.have.status(200);",
									"});",
									"pm.test(\"Body matches string\", function () {",
									"    pm.expect(pm.response.text()).to.include(\"M4A4\");",
									"});"
								],
								"type": "text/javascript"
							}
						}
					],
					"request": {
						"method": "GET",
						"header": [],
						"url": {
							"raw": "{{urlBase}}{{urlWeapon}}/name/M4A4",
							"host": [
								"{{urlBase}}{{urlWeapon}}"
							],
							"path": [
								"name",
								"M4A4"
							]
						}
					},
					"response": []
				}
			],
			"protocolProfileBehavior": {}
		},
		{
			"name": "DeleteTestDataAfterTests",
			"item": [
				{
					"name": "deletePostData",
					"event": [
						{
							"listen": "test",
							"script": {
								"id": "7da15632-a771-4a46-807f-f87bee2ae10a",
								"exec": [
									"pm.test(\"Status code is 200\", function () {",
									"    pm.response.to.have.status(200);",
									"});"
								],
								"type": "text/javascript"
							}
						}
					],
					"request": {
						"method": "DELETE",
						"header": [],
						"url": {
							"raw": "{{urlBase}}/api/admin/posts/delete/{{postIdThree}}",
							"host": [
								"{{urlBase}}"
							],
							"path": [
								"api",
								"admin",
								"posts",
								"delete",
								"{{postIdThree}}"
							]
						},
						"description": "After all tests are executed, post data should be deleted, in order to not overload the DB."
					},
					"response": []
				}
			],
			"auth": {
				"type": "basic",
				"basic": [
					{
						"key": "username",
						"value": "Arnold",
						"type": "string"
					},
					{
						"key": "password",
						"value": "password",
						"type": "string"
					}
				]
			},
			"protocolProfileBehavior": {}
		}
	],
	"event": [
		{
			"listen": "prerequest",
			"script": {
				"id": "da9d6e1c-be53-49ba-b7fb-0fa81545d55a",
				"type": "text/javascript",
				"exec": [
					""
				]
			}
		},
		{
			"listen": "test",
			"script": {
				"id": "073a6513-b2ad-4a4c-9131-3709d8de1d6b",
				"type": "text/javascript",
				"exec": [
					""
				]
			}
		}
	],
	"protocolProfileBehavior": {}
}