C:\Users\User\Desktop\GitLab projects\social-network\CucumberFramework\src\test\java\PageObjects\ProfilePage.java
C:\Users\User\Desktop\GitLab projects\social-network\CucumberFramework\src\test\java\PageObjects\AccountPage.java
C:\Users\User\Desktop\GitLab projects\social-network\CucumberFramework\src\test\java\TestRunner\TestRunner.java
C:\Users\User\Desktop\GitLab projects\social-network\CucumberFramework\src\test\java\PageObjects\LoginPage.java
C:\Users\User\Desktop\GitLab projects\social-network\CucumberFramework\src\test\java\Utilities\WaitHelper.java
C:\Users\User\Desktop\GitLab projects\social-network\CucumberFramework\src\test\java\StepDefinitions\Steps.java
C:\Users\User\Desktop\GitLab projects\social-network\CucumberFramework\src\test\java\StepDefinitions\BaseClass.java
C:\Users\User\Desktop\GitLab projects\social-network\CucumberFramework\src\test\java\PageObjects\AdminPage.java
C:\Users\User\Desktop\GitLab projects\social-network\CucumberFramework\src\test\java\PageObjects\RegistrationPage.java
C:\Users\User\Desktop\GitLab projects\social-network\CucumberFramework\src\test\java\PageObjects\HomePage.java
C:\Users\User\Desktop\GitLab projects\social-network\CucumberFramework\src\test\java\PageObjects\UserProfilePage.java
