[{
    "Cedula":"1314845210",
    "Apellido": "Loor Barreto",
    "Nombre":"Boris Leonel",
    "Semestre":"Quinto",
    "Paralelo":"B"
},
{
    "Cedula":"1318465213",
    "Apellido": "Macias Perreira",
    "Nombre":"Nicole Julia",
    "Semestre":"Quinto",
    "Paralelo":"B"
},
{
    "Cedula":"1311542879",
    "Apellido": "Chavez Paz",
    "Nombre":"Julexi Carla",
    "Semestre":"Quinto",
    "Paralelo":"B"
},
{
    "Cedula":"1317952146",
    "Apellido": "Gomez Mera",
    "Nombre":"Emilia Ana",
    "Semestre":"Quinto",
    "Paralelo":"B"
},
{
    "Cedula":"1317896521",
    "Apellido": "Martinez Intriago",
    "Nombre":"Ana Ema",
    "Semestre":"Quinto",
    "Paralelo":"B"
},
{
    "Cedula":"1318795413",
    "Apellido": "Cordova Loor",
    "Nombre":"Ines Liria",
    "Semestre":"Quinto",
    "Paralelo":"B"
},
{
    "Cedula":"1316513284",
    "Apellido": "Perez Vera",
    "Nombre":"Leonela Maria",
    "Semestre":"Quinto",
    "Paralelo":"B"
},
{
    "Cedula":"1317413368",
    "Apellido": "Ponce Montesdeoca",
    "Nombre":"Martin Julio",
    "Semestre":"Quinto",
    "Paralelo":"B"
},
{
    "Cedula":"13141230325",
    "Apellido": "Pomera Lucas",
    "Nombre":"Viviana Francisca",
    "Semestre":"Quinto",
    "Paralelo":"B"
},
{
    "Cedula":"1317841032",
    "Apellido": "Tigua Catro",
    "Nombre":"Maria Antonieta",
    "Semestre":"Quinto",
    "Paralelo":"B"
}
]