[
    {
        "id": 1,
        "cedula": "1350854814",
        "nombre": "Caroline Lucas",
        "direccion": "abc 130",
        "telefono": "0994137994",
        "correo": "Caroline@gmail.com",
        "curso": "5to",
        "paralelo": "B"
    }
]
