{
  "project_info": {
    "project_number": "393504869049",
    "project_id": "authlink-6b55f",
    "storage_bucket": "authlink-6b55f.appspot.com"
  },
  "client": [
    {
      "client_info": {
        "mobilesdk_app_id": "1:393504869049:android:1d4408597b0fbf74406968",
        "android_client_info": {
          "package_name": "com.authlink.test"
        }
      },
      "oauth_client": [
        {
          "client_id": "393504869049-ln1ugm01joefalin83vhacl7p9vkajnf.apps.googleusercontent.com",
          "client_type": 1,
          "android_info": {
            "package_name": "com.authlink.test",
            "certificate_hash": "79d2501709da0bf9c246f0aec541038249dcb860"
          }
        },
        {
          "client_id": "393504869049-g2jicbcg3n47lvougmdsaf30tm6f0rcm.apps.googleusercontent.com",
          "client_type": 3
        }
      ],
      "api_key": [
        {
          "current_key": "AIzaSyDQu2t-gE68cN6nqvZZXc-dmEhlyyYMLmI"
        }
      ],
      "services": {
        "appinvite_service": {
          "other_platform_oauth_client": [
            {
              "client_id": "393504869049-g2jicbcg3n47lvougmdsaf30tm6f0rcm.apps.googleusercontent.com",
              "client_type": 3
            },
            {
              "client_id": "393504869049-gqhruo2k9dqllict5eulcvm3ngqaqh2o.apps.googleusercontent.com",
              "client_type": 2,
              "ios_info": {
                "bundle_id": "com.authlink.test",
                "app_store_id": "1582874960"
              }
            }
          ]
        }
      }
    }
  ],
  "configuration_version": "1"
}