{
    "id": "bfe12b1a-b53e-4502-9287-6c393d94366b",
    "birthDate": "1993-04-28T11:26:35Z",
    "birthCity": "Murillo",
    "residenceCity": "Zuogaimanma",
    "residenceAddress": "90734 Reindahl Road",
    "phone": "5209075800",
    "email": "bwarnes6@boston.com",
    "favoriteColor": "#9946e0"
  }