{
    "id": "49110e39-9a89-45c5-8ea9-ec2cf62f39d0",
    "birthDate": "1998-02-09T06:43:45Z",
    "birthCity": "Oklahoma City",
    "residenceCity": "Khonj",
    "residenceAddress": "72 Shopko Court",
    "phone": "4057171105",
    "email": "kstourton2@tuttocitta.it",
    "favoriteColor": "#85880d"
  }