{
    "id": "e7064c31-3c46-4f3f-a2ed-4d45f94eb566",
    "birthDate": "1994-03-19T06:29:56Z",
    "birthCity": "Fox Creek",
    "residenceCity": "Chitral",
    "residenceAddress": "5 Holy Cross Drive",
    "phone": "5878132420",
    "email": "tbradden0@is.gd",
    "favoriteColor": "#749874"
}