{
    "id": "5cacda31-8c57-441f-8118-871009f7e54f",
    "birthDate": "2000-05-09T19:48:32Z",
    "birthCity": "Seattle",
    "residenceCity": "Damanhūr",
    "residenceAddress": "3 Bashford Park",
    "phone": "2069351787",
    "email": "aharbage8@deviantart.com",
    "favoriteColor": "#db7eec"
  }