Build bot: trigger new builds

79 jobs for builds-1527712433 in 138 minutes and 14 seconds (queued for 10 seconds)
Status Name Job ID Coverage
  Test
passed aarch64--glibc--bleeding-edge #71436146

01:40:43

passed aarch64--musl--bleeding-edge #71436147

01:24:15

passed aarch64--uclibc--bleeding-edge #71436148

01:19:30

passed aarch64be--glibc--bleeding-edge #71436144

01:18:00

passed aarch64be--uclibc--bleeding-edge #71436145

00:38:07

passed arcle-750d--uclibc--bleeding-edge #71436149

00:38:42

failed arcle-hs38--glibc--bleeding-edge #71436150

00:27:43

passed arcle-hs38--uclibc--bleeding-edge #71436151

00:41:25

passed armebv7-eabihf--glibc--bleeding-edge #71436152

00:52:13

passed armebv7-eabihf--musl--bleeding-edge #71436153

01:08:05

passed armebv7-eabihf--uclibc--bleeding-edge #71436154

00:50:52

passed armv5-eabi--glibc--bleeding-edge #71436155

01:01:28

passed armv5-eabi--musl--bleeding-edge #71436156

01:38:47

passed armv5-eabi--uclibc--bleeding-edge #71436157

01:34:43

passed armv6-eabihf--glibc--bleeding-edge #71436158

01:49:58

passed armv6-eabihf--musl--bleeding-edge #71436159

01:09:49

passed armv6-eabihf--uclibc--bleeding-edge #71436160

01:25:40

passed armv7-eabihf--glibc--bleeding-edge #71436161

01:54:07

passed armv7-eabihf--musl--bleeding-edge #71436162

01:40:37

passed armv7-eabihf--uclibc--bleeding-edge #71436163

01:45:20

failed armv7m--uclibc--bleeding-edge #71436164

00:21:16

failed m68k-68xxx--uclibc--bleeding-edge #71436165

01:16:01

failed m68k-coldfire--uclibc--bleeding-edge #71436167

00:26:48

failed microblazebe--glibc--bleeding-edge #71436168

00:57:41

failed microblazebe--musl--bleeding-edge #71436169

00:50:42

passed microblazebe--uclibc--bleeding-edge #71436170

00:40:41

failed microblazeel--glibc--bleeding-edge #71436171

00:59:22

failed microblazeel--musl--bleeding-edge #71443429

00:46:32

passed microblazeel--uclibc--bleeding-edge #71436173

00:58:14

failed mips32--glibc--bleeding-edge #71436174

00:52:46

failed mips32--musl--bleeding-edge #71436175

01:15:12

failed mips32--uclibc--bleeding-edge #71436176

01:20:46

failed mips32el--glibc--bleeding-edge #71436177

01:27:41

failed mips32el--musl--bleeding-edge #71436178

00:48:56

failed mips32el--uclibc--bleeding-edge #71436179

01:02:45

failed mips32r5el--glibc--bleeding-edge #71436180

01:39:27

failed mips32r5el--musl--bleeding-edge #71436181

01:17:07

failed mips32r5el--uclibc--bleeding-edge #71436183

01:22:25

failed mips32r6el--glibc--bleeding-edge #71436185

01:03:47

failed mips32r6el--musl--bleeding-edge #71436186

00:51:49

failed mips32r6el--uclibc--bleeding-edge #71436188

01:17:51

failed mips64-n32--glibc--bleeding-edge #71436192

01:37:22

failed mips64-n32--musl--bleeding-edge #71436193

01:16:49

failed mips64-n32--uclibc--bleeding-edge #71436194

01:12:36

failed mips64el-n32--glibc--bleeding-edge #71436189

01:25:09

failed mips64el-n32--musl--bleeding-edge #71436190

01:39:49

failed mips64el-n32--uclibc--bleeding-edge #71436191

01:23:14

failed mips64r6el-n32--glibc--bleeding-edge #71436195

01:32:36

failed mips64r6el-n32--musl--bleeding-edge #71436196

00:50:26

failed mips64r6el-n32--uclibc--bleeding-edge #71436197

01:16:49

passed nios2--glibc--bleeding-edge #71436198

00:41:17

passed powerpc-e500mc--glibc--bleeding-edge #71436205

01:05:14

passed powerpc-e500mc--musl--bleeding-edge #71436206

01:00:33

passed powerpc-e500mc--uclibc--bleeding-edge #71436207

00:47:36

passed powerpc64-e5500--glibc--bleeding-edge #71436199

00:54:49

passed powerpc64-e5500--musl--bleeding-edge #71436200

00:40:35

failed powerpc64-power8--glibc--bleeding-edge #71436203

01:06:43

failed powerpc64-power8--musl--bleeding-edge #71436204

00:49:35

failed powerpc64le-power8--glibc--bleeding-edge #71436201

02:15:47

failed powerpc64le-power8--musl--bleeding-edge #71436202

00:46:52

failed sh-sh4--glibc--bleeding-edge #71436210

01:20:20

failed sh-sh4--musl--bleeding-edge #71436211

01:18:46

failed sh-sh4--uclibc--bleeding-edge #71436212

01:12:33

passed sh-sh4aeb--glibc--bleeding-edge #71436208

00:59:44

passed sh-sh4aeb--musl--bleeding-edge #71436209

00:37:39

failed sparc64--glibc--bleeding-edge #71436213

00:51:42

failed sparcv8--uclibc--bleeding-edge #71436214

01:14:54

passed x86-64-core-i7--glibc--bleeding-edge #71436215

01:49:27

passed x86-64-core-i7--musl--bleeding-edge #71437435

01:17:53

passed x86-64-core-i7--uclibc--bleeding-edge #71436217

01:31:23

passed x86-core2--glibc--bleeding-edge #71436218

01:37:35

passed x86-core2--musl--bleeding-edge #71436219

01:20:56

passed x86-core2--uclibc--bleeding-edge #71436220

01:36:33

passed x86-i686--glibc--bleeding-edge #71436221

01:56:52

passed x86-i686--musl--bleeding-edge #71436222

01:23:29

passed x86-i686--uclibc--bleeding-edge #71436223

01:05:41

failed xtensa-lx60--uclibc--bleeding-edge #71436224

00:51:28

failed microblazeel--musl--bleeding-edge #71436172

00:26:30

failed x86-64-core-i7--musl--bleeding-edge #71436216

00:05:43

 
Name Stage Failure
failed
arcle-hs38--glibc--bleeding-edge Test
make: Leaving directory '/opt/buildroot'
==================== END LOG FILE =======================
ERROR: cannot build toolchain
Uploading build log
Host key verification failed.
Host key verification failed.
lost connection
Toolchain build failed, not going further
ERROR: Job failed: exit code 1
failed
armv7m--uclibc--bleeding-edge Test
make: Leaving directory '/opt/buildroot'
==================== END LOG FILE =======================
ERROR: cannot build toolchain
Uploading build log
Host key verification failed.
Host key verification failed.
lost connection
Toolchain build failed, not going further
ERROR: Job failed: exit code 1
failed
m68k-68xxx--uclibc--bleeding-edge Test
rsync: connection unexpectedly closed (0 bytes received so far) [sender]
rsync error: error in rsync protocol data stream (code 12) at io.c(235) [sender=3.1.2]
Host key verification failed.
rsync: connection unexpectedly closed (0 bytes received so far) [sender]
rsync error: error in rsync protocol data stream (code 12) at io.c(235) [sender=3.1.2]
Host key verification failed.
Host key verification failed.
Something went wrong. Exiting with code 1
ERROR: Job failed: exit code 1
failed
m68k-coldfire--uclibc--bleeding-edge Test
make: Leaving directory '/opt/buildroot'
==================== END LOG FILE =======================
ERROR: cannot build toolchain
Uploading build log
Host key verification failed.
Host key verification failed.
lost connection
Toolchain build failed, not going further
ERROR: Job failed: exit code 1
failed
microblazebe--glibc--bleeding-edge Test
rsync: connection unexpectedly closed (0 bytes received so far) [sender]
rsync error: error in rsync protocol data stream (code 12) at io.c(235) [sender=3.1.2]
Host key verification failed.
rsync: connection unexpectedly closed (0 bytes received so far) [sender]
rsync error: error in rsync protocol data stream (code 12) at io.c(235) [sender=3.1.2]
Host key verification failed.
Host key verification failed.
Something went wrong. Exiting with code 1
ERROR: Job failed: exit code 1
failed
microblazebe--musl--bleeding-edge Test
rsync: connection unexpectedly closed (0 bytes received so far) [sender]
rsync error: error in rsync protocol data stream (code 12) at io.c(235) [sender=3.1.2]
Host key verification failed.
rsync: connection unexpectedly closed (0 bytes received so far) [sender]
rsync error: error in rsync protocol data stream (code 12) at io.c(235) [sender=3.1.2]
Host key verification failed.
Host key verification failed.
Something went wrong. Exiting with code 1
ERROR: Job failed: exit code 1
failed
microblazeel--glibc--bleeding-edge Test
rsync: connection unexpectedly closed (0 bytes received so far) [sender]
rsync error: error in rsync protocol data stream (code 12) at io.c(235) [sender=3.1.2]
Host key verification failed.
rsync: connection unexpectedly closed (0 bytes received so far) [sender]
rsync error: error in rsync protocol data stream (code 12) at io.c(235) [sender=3.1.2]
Host key verification failed.
Host key verification failed.
Something went wrong. Exiting with code 1
ERROR: Job failed: exit code 1
failed
mips32--glibc--bleeding-edge Test
rsync: connection unexpectedly closed (0 bytes received so far) [sender]
rsync error: unexplained error (code 255) at io.c(235) [sender=3.1.2]
Host key verification failed.
rsync: connection unexpectedly closed (0 bytes received so far) [sender]
rsync error: unexplained error (code 255) at io.c(235) [sender=3.1.2]
Host key verification failed.
Host key verification failed.
Something went wrong. Exiting with code 1
ERROR: Job failed: exit code 1
failed
mips32--musl--bleeding-edge Test
rsync: connection unexpectedly closed (0 bytes received so far) [sender]
rsync error: error in rsync protocol data stream (code 12) at io.c(235) [sender=3.1.2]
Host key verification failed.
rsync: connection unexpectedly closed (0 bytes received so far) [sender]
rsync error: error in rsync protocol data stream (code 12) at io.c(235) [sender=3.1.2]
Host key verification failed.
Host key verification failed.
Something went wrong. Exiting with code 1
ERROR: Job failed: exit code 1
failed
mips32--uclibc--bleeding-edge Test
rsync: connection unexpectedly closed (0 bytes received so far) [sender]
rsync error: error in rsync protocol data stream (code 12) at io.c(235) [sender=3.1.2]
Host key verification failed.
rsync: connection unexpectedly closed (0 bytes received so far) [sender]
rsync error: error in rsync protocol data stream (code 12) at io.c(235) [sender=3.1.2]
Host key verification failed.
Host key verification failed.
Something went wrong. Exiting with code 1
ERROR: Job failed: exit code 1
failed
mips32el--glibc--bleeding-edge Test
rsync: connection unexpectedly closed (0 bytes received so far) [sender]
rsync error: error in rsync protocol data stream (code 12) at io.c(235) [sender=3.1.2]
Host key verification failed.
rsync: connection unexpectedly closed (0 bytes received so far) [sender]
rsync error: error in rsync protocol data stream (code 12) at io.c(235) [sender=3.1.2]
Host key verification failed.
Host key verification failed.
Something went wrong. Exiting with code 1
ERROR: Job failed: exit code 1
failed
mips32el--uclibc--bleeding-edge Test
rsync: connection unexpectedly closed (0 bytes received so far) [sender]
rsync error: unexplained error (code 255) at io.c(235) [sender=3.1.2]
Host key verification failed.
rsync: connection unexpectedly closed (0 bytes received so far) [sender]
rsync error: unexplained error (code 255) at io.c(235) [sender=3.1.2]
Host key verification failed.
Host key verification failed.
Something went wrong. Exiting with code 1
ERROR: Job failed: exit code 1
failed
mips32r5el--glibc--bleeding-edge Test
rsync: connection unexpectedly closed (0 bytes received so far) [sender]
rsync error: error in rsync protocol data stream (code 12) at io.c(235) [sender=3.1.2]
Host key verification failed.
rsync: connection unexpectedly closed (0 bytes received so far) [sender]
rsync error: error in rsync protocol data stream (code 12) at io.c(235) [sender=3.1.2]
Host key verification failed.
Host key verification failed.
Something went wrong. Exiting with code 1
ERROR: Job failed: exit code 1
failed
mips32r5el--musl--bleeding-edge Test
rsync: connection unexpectedly closed (0 bytes received so far) [sender]
rsync error: error in rsync protocol data stream (code 12) at io.c(235) [sender=3.1.2]
Host key verification failed.
rsync: connection unexpectedly closed (0 bytes received so far) [sender]
rsync error: error in rsync protocol data stream (code 12) at io.c(235) [sender=3.1.2]
Host key verification failed.
Host key verification failed.
Something went wrong. Exiting with code 1
ERROR: Job failed: exit code 1
failed
mips32r5el--uclibc--bleeding-edge Test
rsync: connection unexpectedly closed (0 bytes received so far) [sender]
rsync error: error in rsync protocol data stream (code 12) at io.c(235) [sender=3.1.2]
Host key verification failed.
rsync: connection unexpectedly closed (0 bytes received so far) [sender]
rsync error: error in rsync protocol data stream (code 12) at io.c(235) [sender=3.1.2]
Host key verification failed.
Host key verification failed.
Something went wrong. Exiting with code 1
ERROR: Job failed: exit code 1
failed
mips32r6el--glibc--bleeding-edge Test
rsync: connection unexpectedly closed (0 bytes received so far) [sender]
rsync error: unexplained error (code 255) at io.c(235) [sender=3.1.2]
Host key verification failed.
rsync: connection unexpectedly closed (0 bytes received so far) [sender]
rsync error: unexplained error (code 255) at io.c(235) [sender=3.1.2]
Host key verification failed.
Host key verification failed.
Something went wrong. Exiting with code 1
ERROR: Job failed: exit code 1
failed
mips32r6el--musl--bleeding-edge Test
rsync: connection unexpectedly closed (0 bytes received so far) [sender]
rsync error: unexplained error (code 255) at io.c(235) [sender=3.1.2]
Host key verification failed.
rsync: connection unexpectedly closed (0 bytes received so far) [sender]
rsync error: error in rsync protocol data stream (code 12) at io.c(235) [sender=3.1.2]
Host key verification failed.
Host key verification failed.
Something went wrong. Exiting with code 1
ERROR: Job failed: exit code 1
failed
mips32r6el--uclibc--bleeding-edge Test
rsync: connection unexpectedly closed (0 bytes received so far) [sender]
rsync error: error in rsync protocol data stream (code 12) at io.c(235) [sender=3.1.2]
Host key verification failed.
rsync: connection unexpectedly closed (0 bytes received so far) [sender]
rsync error: error in rsync protocol data stream (code 12) at io.c(235) [sender=3.1.2]
Host key verification failed.
Host key verification failed.
Something went wrong. Exiting with code 1
ERROR: Job failed: exit code 1
failed
mips64el-n32--glibc--bleeding-edge Test
rsync: connection unexpectedly closed (0 bytes received so far) [sender]
rsync error: error in rsync protocol data stream (code 12) at io.c(235) [sender=3.1.2]
Host key verification failed.
rsync: connection unexpectedly closed (0 bytes received so far) [sender]
rsync error: error in rsync protocol data stream (code 12) at io.c(235) [sender=3.1.2]
Host key verification failed.
Host key verification failed.
Something went wrong. Exiting with code 1
ERROR: Job failed: exit code 1
failed
mips64el-n32--musl--bleeding-edge Test
rsync: connection unexpectedly closed (0 bytes received so far) [sender]
rsync error: error in rsync protocol data stream (code 12) at io.c(235) [sender=3.1.2]
Host key verification failed.
rsync: connection unexpectedly closed (0 bytes received so far) [sender]
rsync error: error in rsync protocol data stream (code 12) at io.c(235) [sender=3.1.2]
Host key verification failed.
Host key verification failed.
Something went wrong. Exiting with code 1
ERROR: Job failed: exit code 1
failed
mips64el-n32--uclibc--bleeding-edge Test
rsync: connection unexpectedly closed (0 bytes received so far) [sender]
rsync error: error in rsync protocol data stream (code 12) at io.c(235) [sender=3.1.2]
Host key verification failed.
rsync: connection unexpectedly closed (0 bytes received so far) [sender]
rsync error: error in rsync protocol data stream (code 12) at io.c(235) [sender=3.1.2]
Host key verification failed.
Host key verification failed.
Something went wrong. Exiting with code 1
ERROR: Job failed: exit code 1
failed
mips64-n32--glibc--bleeding-edge Test
rsync: connection unexpectedly closed (0 bytes received so far) [sender]
rsync error: error in rsync protocol data stream (code 12) at io.c(235) [sender=3.1.2]
Host key verification failed.
rsync: connection unexpectedly closed (0 bytes received so far) [sender]
rsync error: error in rsync protocol data stream (code 12) at io.c(235) [sender=3.1.2]
Host key verification failed.
Host key verification failed.
Something went wrong. Exiting with code 1
ERROR: Job failed: exit code 1
failed
mips64-n32--musl--bleeding-edge Test
rsync: connection unexpectedly closed (0 bytes received so far) [sender]
rsync error: error in rsync protocol data stream (code 12) at io.c(235) [sender=3.1.2]
Host key verification failed.
rsync: connection unexpectedly closed (0 bytes received so far) [sender]
rsync error: error in rsync protocol data stream (code 12) at io.c(235) [sender=3.1.2]
Host key verification failed.
Host key verification failed.
Something went wrong. Exiting with code 1
ERROR: Job failed: exit code 1
failed
mips64-n32--uclibc--bleeding-edge Test
rsync: connection unexpectedly closed (0 bytes received so far) [sender]
rsync error: error in rsync protocol data stream (code 12) at io.c(235) [sender=3.1.2]
Host key verification failed.
rsync: connection unexpectedly closed (0 bytes received so far) [sender]
rsync error: error in rsync protocol data stream (code 12) at io.c(235) [sender=3.1.2]
Host key verification failed.
Host key verification failed.
Something went wrong. Exiting with code 1
ERROR: Job failed: exit code 1
failed
mips64r6el-n32--glibc--bleeding-edge Test
rsync: connection unexpectedly closed (0 bytes received so far) [sender]
rsync error: error in rsync protocol data stream (code 12) at io.c(235) [sender=3.1.2]
Host key verification failed.
rsync: connection unexpectedly closed (0 bytes received so far) [sender]
rsync error: error in rsync protocol data stream (code 12) at io.c(235) [sender=3.1.2]
Host key verification failed.
Host key verification failed.
Something went wrong. Exiting with code 1
ERROR: Job failed: exit code 1
failed
mips64r6el-n32--musl--bleeding-edge Test
rsync: connection unexpectedly closed (0 bytes received so far) [sender]
rsync error: unexplained error (code 255) at io.c(235) [sender=3.1.2]
Host key verification failed.
rsync: connection unexpectedly closed (0 bytes received so far) [sender]
rsync error: unexplained error (code 255) at io.c(235) [sender=3.1.2]
Host key verification failed.
Host key verification failed.
Something went wrong. Exiting with code 1
ERROR: Job failed: exit code 1
failed
mips64r6el-n32--uclibc--bleeding-edge Test
rsync: connection unexpectedly closed (0 bytes received so far) [sender]
rsync error: error in rsync protocol data stream (code 12) at io.c(235) [sender=3.1.2]
Host key verification failed.
rsync: connection unexpectedly closed (0 bytes received so far) [sender]
rsync error: error in rsync protocol data stream (code 12) at io.c(235) [sender=3.1.2]
Host key verification failed.
Host key verification failed.
Something went wrong. Exiting with code 1
ERROR: Job failed: exit code 1
failed
powerpc64le-power8--glibc--bleeding-edge Test
rsync: connection unexpectedly closed (0 bytes received so far) [sender]
rsync error: unexplained error (code 255) at io.c(235) [sender=3.1.2]
Host key verification failed.
rsync: connection unexpectedly closed (0 bytes received so far) [sender]
rsync error: unexplained error (code 255) at io.c(235) [sender=3.1.2]
Host key verification failed.
Host key verification failed.
Something went wrong. Exiting with code 1
ERROR: Job failed: exit code 1
failed
powerpc64le-power8--musl--bleeding-edge Test
rsync: connection unexpectedly closed (0 bytes received so far) [sender]
rsync error: unexplained error (code 255) at io.c(235) [sender=3.1.2]
Host key verification failed.
rsync: connection unexpectedly closed (0 bytes received so far) [sender]
rsync error: unexplained error (code 255) at io.c(235) [sender=3.1.2]
Host key verification failed.
Host key verification failed.
Something went wrong. Exiting with code 1
ERROR: Job failed: exit code 1
failed
powerpc64-power8--glibc--bleeding-edge Test
rsync: connection unexpectedly closed (0 bytes received so far) [sender]
rsync error: unexplained error (code 255) at io.c(235) [sender=3.1.2]
Host key verification failed.
rsync: connection unexpectedly closed (0 bytes received so far) [sender]
rsync error: unexplained error (code 255) at io.c(235) [sender=3.1.2]
Host key verification failed.
Host key verification failed.
Something went wrong. Exiting with code 1
ERROR: Job failed: exit code 1
failed
powerpc64-power8--musl--bleeding-edge Test
rsync: connection unexpectedly closed (0 bytes received so far) [sender]
rsync error: unexplained error (code 255) at io.c(235) [sender=3.1.2]
Host key verification failed.
rsync: connection unexpectedly closed (0 bytes received so far) [sender]
rsync error: unexplained error (code 255) at io.c(235) [sender=3.1.2]
Host key verification failed.
Host key verification failed.
Something went wrong. Exiting with code 1
ERROR: Job failed: exit code 1
failed
sh-sh4--glibc--bleeding-edge Test
rsync: connection unexpectedly closed (0 bytes received so far) [sender]
rsync error: error in rsync protocol data stream (code 12) at io.c(235) [sender=3.1.2]
Host key verification failed.
rsync: connection unexpectedly closed (0 bytes received so far) [sender]
rsync error: error in rsync protocol data stream (code 12) at io.c(235) [sender=3.1.2]
Host key verification failed.
Host key verification failed.
Something went wrong. Exiting with code 1
ERROR: Job failed: exit code 1
failed
sh-sh4--musl--bleeding-edge Test
rsync: connection unexpectedly closed (0 bytes received so far) [sender]
rsync error: error in rsync protocol data stream (code 12) at io.c(235) [sender=3.1.2]
Host key verification failed.
rsync: connection unexpectedly closed (0 bytes received so far) [sender]
rsync error: error in rsync protocol data stream (code 12) at io.c(235) [sender=3.1.2]
Host key verification failed.
Host key verification failed.
Something went wrong. Exiting with code 1
ERROR: Job failed: exit code 1
failed
sh-sh4--uclibc--bleeding-edge Test
rsync: connection unexpectedly closed (0 bytes received so far) [sender]
rsync error: error in rsync protocol data stream (code 12) at io.c(235) [sender=3.1.2]
Host key verification failed.
rsync: connection unexpectedly closed (0 bytes received so far) [sender]
rsync error: error in rsync protocol data stream (code 12) at io.c(235) [sender=3.1.2]
Host key verification failed.
Host key verification failed.
Something went wrong. Exiting with code 1
ERROR: Job failed: exit code 1
failed
sparc64--glibc--bleeding-edge Test
rsync: connection unexpectedly closed (0 bytes received so far) [sender]
rsync error: unexplained error (code 255) at io.c(235) [sender=3.1.2]
Host key verification failed.
rsync: connection unexpectedly closed (0 bytes received so far) [sender]
rsync error: unexplained error (code 255) at io.c(235) [sender=3.1.2]
Host key verification failed.
Host key verification failed.
Something went wrong. Exiting with code 1
ERROR: Job failed: exit code 1
failed
sparcv8--uclibc--bleeding-edge Test
rsync: connection unexpectedly closed (0 bytes received so far) [sender]
rsync error: error in rsync protocol data stream (code 12) at io.c(235) [sender=3.1.2]
Host key verification failed.
rsync: connection unexpectedly closed (0 bytes received so far) [sender]
rsync error: error in rsync protocol data stream (code 12) at io.c(235) [sender=3.1.2]
Host key verification failed.
Host key verification failed.
Something went wrong. Exiting with code 1
ERROR: Job failed: exit code 1
failed
xtensa-lx60--uclibc--bleeding-edge Test
rsync: connection unexpectedly closed (0 bytes received so far) [sender]
rsync error: unexplained error (code 255) at io.c(235) [sender=3.1.2]
Host key verification failed.
rsync: connection unexpectedly closed (0 bytes received so far) [sender]
rsync error: unexplained error (code 255) at io.c(235) [sender=3.1.2]
Host key verification failed.
Host key verification failed.
Something went wrong. Exiting with code 1
ERROR: Job failed: exit code 1
failed
microblazeel--musl--bleeding-edge Test
rsync: connection unexpectedly closed (0 bytes received so far) [sender]
rsync error: error in rsync protocol data stream (code 12) at io.c(235) [sender=3.1.2]
Host key verification failed.
rsync: connection unexpectedly closed (0 bytes received so far) [sender]
rsync error: error in rsync protocol data stream (code 12) at io.c(235) [sender=3.1.2]
Host key verification failed.
Host key verification failed.
Something went wrong. Exiting with code 1
ERROR: Job failed: exit code 1
failed
mips32el--musl--bleeding-edge Test
rsync: connection unexpectedly closed (0 bytes received so far) [sender]
rsync error: unexplained error (code 255) at io.c(235) [sender=3.1.2]
Host key verification failed.
rsync: connection unexpectedly closed (0 bytes received so far) [sender]
rsync error: unexplained error (code 255) at io.c(235) [sender=3.1.2]
Host key verification failed.
Host key verification failed.
Something went wrong. Exiting with code 1
ERROR: Job failed: exit code 1