{
  "contacts": [
    {
      "id": 2,
      "name": "Rafael",
      "phone": "111111"
    },
    {
      "id": 3,
      "name": "João",
      "phone": "12 345345345"
    },
    {
      "id": 4,
      "name": "Mariana",
      "phone": "12 345345345"
    },
    {
      "id": 5,
      "name": "Amanda Cabulosa",
      "phone": "555555555"
    },
    {
      "id": 6,
      "name": "Gustavo",
      "phone": "12 345345345"
    },
    {
      "name": "Leandro",
      "phone": "31 94949494",
      "id": 7
    },
    {
      "id": 9,
      "name": "Cleitin Maladeza",
      "phone": "988562144"
    },
    {
      "id": 10,
      "name": "Larissa Carolinda",
      "phone": "897"
    }
  ]
}