Take  - negative download times in stub installer pings
We are still getting around  negative values.

+++ This bug was initially created as a clone of Bug #811120 +++

The stub installer ping is in the format




We are seeing a lot of negative download times in the logs. Anurag and I think it is a bug in the code




download-stats.mozilla.org -  -0800] "GET     "-" "NSIS InetBgDL (Mozilla)" "-"
download-stats.mozilla.org -  -0800] "GET     "-" "NSIS InetBgDL (Mozilla)" "-"
download-stats.mozilla.org -  -0800] "GET     "-" "NSIS InetBgDL (Mozilla)" "-"
download-stats.mozilla.org -  -0800] "GET     "-" "NSIS InetBgDL (Mozilla)" "-"
download-stats.mozilla.org -  -0800] "GET     "-" "NSIS InetBgDL (Mozilla)" "-"
download-stats.mozilla.org -  -0800] "GET     "-" "NSIS InetBgDL (Mozilla)" "-"
download-stats.mozilla.org -  -0800] "GET     "-" "NSIS InetBgDL (Mozilla)" "-"
download-stats.mozilla.org -  -0800] "GET     "-" "NSIS InetBgDL (Mozilla)" "-"
download-stats.mozilla.org -  -0800] "GET     "-" "NSIS InetBgDL (Mozilla)" "-"
download-stats.mozilla.org -  -0800] "GET     "-" "NSIS InetBgDL (Mozilla)" "-"
download-stats.mozilla.org -  -0800] "GET     "-" "NSIS InetBgDL (Mozilla)" "-"
download-stats.mozilla.org -  -0800] "GET     "-" "NSIS InetBgDL (Mozilla)" "-"
download-stats.mozilla.org -  -0800] "GET     "-" "NSIS InetBgDL (Mozilla)" "-"
download-stats.mozilla.org -  -0800] "GET     "-" "NSIS InetBgDL (Mozilla)" "-"
download-stats.mozilla.org -  -0800] "GET     "-" "NSIS InetBgDL (Mozilla)" "-"
download-stats.mozilla.org -  -0800] "GET     "-" "NSIS InetBgDL (Mozilla)" "-"
download-stats.mozilla.org -  -0800] "GET     "-" "NSIS InetBgDL (Mozilla)" "-"
download-stats.mozilla.org -  -0800] "GET     "-" "NSIS InetBgDL (Mozilla)" "-"
download-stats.mozilla.org -  -0800] "GET     "-" "NSIS InetBgDL (Mozilla)" "-"
