Session restore broken, background tab title become url instead of title
Regression window(m-c)
Good:

(Windows NT  WOW64; rv:29.0)   ID:20140116172716
Bad:

(Windows NT  WOW64; rv:29.0)   ID:20140116181915
Oushlog:


Regressed by : Bug 
