Permanent failures on Cedar: browser_roundedWindow_open_min.js, browser_roundedWindow_windowSetting_max.js, browser_roundedWindow_windowSetting_mid.js | A promise chain failed to handle a rejection: this.star is null - stack: null
Snipped from the log:

[task   INFO - TEST-START | 
[task   INFO - GECKO(1220) | ++DOCSHELL  ==  [pid =  [id = {56ed8f04-c7d6-4532-a4a2-ba0f136a02a7}]
[task   INFO - GECKO(1220) | ++DOMWINDOW ==  (0x7f0a6d2b6800) [pid =  [serial =  [outer = (nil)]
[task   INFO - GECKO(1220) | ++DOMWINDOW ==  (0x7f0a6d2bf800) [pid =  [serial =  [outer = 
[task   INFO - GECKO(1220) | [1220] WARNING: NS_ENSURE_SUCCESS(rv, rv) failed with result  file  line 
[task   INFO - GECKO(1220) | ++DOMWINDOW ==  (0x7f0a6d2ca000) [pid =  [serial =  [outer = 
[task   INFO - GECKO(1220) | ++DOCSHELL  ==  [pid =  [id = {d6181481-be64-4139-808c-983206dda83c}]
[task   INFO - GECKO(1220) | ++DOMWINDOW ==  (0x7f0a5e52f000) [pid =  [serial =  [outer = (nil)]
[task   INFO - GECKO(1220) | ++DOMWINDOW ==  (0x7f0a5e540800) [pid =  [serial =  [outer = 
[task   INFO - GECKO(1220) | ++DOCSHELL  ==  [pid =  [id = {94082723-ec1a-4ed0-8bbb-a4f484bd04b2}]
[task   INFO - GECKO(1220) | ++DOMWINDOW ==  (0x7f0a5ee6b000) [pid =  [serial =  [outer = (nil)]
[task   INFO - GECKO(1220) | ++DOCSHELL  ==  [pid =  [id = {2c5c00bd-3dfb-4398-8716-338b07ee5b21}]
[task   INFO - GECKO(1220) | ++DOMWINDOW ==  (0x7f0a5f11c000) [pid =  [serial =  [outer = (nil)]
[task   INFO - GECKO(1220) | ++DOMWINDOW ==  (0x7f0a5f4c0000) [pid =  [serial =  [outer = 
[task   INFO - GECKO(1220) | ++DOMWINDOW ==  (0x7f0a62bc9000) [pid =  [serial =  [outer = 
[task   INFO - GECKO(1220) | ++DOMWINDOW ==  (0x7f0a63b2c000) [pid =  [serial =  [outer = 
[task   INFO - GECKO(1220) | ++DOMWINDOW ==  (0x7f0a64749000) [pid =  [serial =  [outer = 
[task   INFO - GECKO(1220) | ++DOCSHELL  ==  [pid =  [id = {f96cff7d-6d57-4a0c-bde4-b44cbbcc3ca9}]
[task   INFO - GECKO(1220) | ++DOMWINDOW ==  (0x7f0a63b3b000) [pid =  [serial =  [outer = (nil)]
[task   INFO - GECKO(1220) | ++DOMWINDOW ==  (0x7f0a63b3c000) [pid =  [serial =  [outer = 
[task   INFO - GECKO(1220) | ++DOCSHELL  ==  [pid =  [id = {e1bdb440-f545-434f-b43c-6881fd0315c6}]
[task   INFO - GECKO(1220) | ++DOMWINDOW ==  (0x7f0a6d4dc000) [pid =  [serial =  [outer = (nil)]
[task   INFO - GECKO(1220) | ++DOCSHELL  ==  [pid =  [id = {c549dfc3-068b-484d-a491-1b7364d8077c}]
[task   INFO - GECKO(1220) | ++DOMWINDOW ==  (0x7f0a6d6d5000) [pid =  [serial =  [outer = (nil)]
[task   INFO - GECKO(1220) | ++DOMWINDOW ==  (0x7f0a6d6e0800) [pid =  [serial =  [outer = 
[task   INFO - GECKO(1220) | --DOCSHELL  ==  [pid =  [id = {94082723-ec1a-4ed0-8bbb-a4f484bd04b2}]
[task   INFO - GECKO(1220) | ++DOMWINDOW ==  (0x7f0a5ee6a800) [pid =  [serial =  [outer = 
[task   INFO - GECKO(1220) | ++DOMWINDOW ==  (0x7f0a64152000) [pid =  [serial =  [outer = 
[task   INFO - GECKO(1220) | ++DOCSHELL  ==  [pid =  [id = {9b6ee72b-b102-4d7d-9cbc-d82547127c00}]
[task   INFO - GECKO(1220) | ++DOMWINDOW ==  (0x7f0a6e01f000) [pid =  [serial =  [outer = (nil)]
[task   INFO - GECKO(1220) | ++DOMWINDOW ==  (0x7f0a6e02d000) [pid =  [serial =  [outer = 
[task   INFO - GECKO(1220) | [1220] WARNING: NS_ENSURE_SUCCESS(rv, rv) failed with result  file  line 
[task   INFO - GECKO(1220) | ++DOMWINDOW ==  (0x7f0a6474e800) [pid =  [serial =  [outer = 
[task   INFO - GECKO(1220) | ++DOCSHELL  ==  [pid =  [id = {51ff7e1c-507c-49e0-a511-9d4be2e3fb8d}]
[task   INFO - GECKO(1220) | ++DOMWINDOW ==  (0x7f0a6d4ea800) [pid =  [serial =  [outer = (nil)]
[task   INFO - GECKO(1220) | ++DOMWINDOW ==  (0x7f0a6d6ce000) [pid =  [serial =  [outer = 
[task   INFO - GECKO(1220) | ++DOMWINDOW ==  (0x7f0a6e1fb000) [pid =  [serial =  [outer = 
[task   INFO - GECKO(1220) | --DOCSHELL  ==  [pid =  [id = {e1bdb440-f545-434f-b43c-6881fd0315c6}]
[task   INFO - GECKO(1220) | ++DOCSHELL  ==  [pid =  [id = {180f3d66-ce2c-467f-b841-87b3fc45d05e}]
[task   INFO - GECKO(1220) | ++DOMWINDOW ==  (0x7f0a63d1e800) [pid =  [serial =  [outer = (nil)]
[task   INFO - GECKO(1220) | ++DOMWINDOW ==  (0x7f0a6dd10800) [pid =  [serial =  [outer = 
[task   INFO - GECKO(1220) | [1220] WARNING: NS_ENSURE_SUCCESS(rv, rv) failed with result  file  line 
[task   INFO - GECKO(1220) | ++DOMWINDOW ==  (0x7f0a6deac800) [pid =  [serial =  [outer = 
[task   INFO - GECKO(1220) | ++DOCSHELL  ==  [pid =  [id = {f72e4d76-5d85-4435-98c5-157723504600}]
[task   INFO - GECKO(1220) | ++DOMWINDOW ==  (0x7f0a6e490000) [pid =  [serial =  [outer = (nil)]
[task   INFO - GECKO(1220) | ++DOMWINDOW ==  (0x7f0a6e491800) [pid =  [serial =  [outer = 
[task   INFO - GECKO(1220) | ++DOCSHELL  ==  [pid =  [id = {5d18ad69-bc51-4baf-8120-681ca3a33936}]
[task   INFO - GECKO(1220) | ++DOMWINDOW ==  (0x7f0a6e64c800) [pid =  [serial =  [outer = (nil)]
[task   INFO - GECKO(1220) | ++DOCSHELL  ==  [pid =  [id = {3ce88c98-0976-4222-9a27-dd82559f1150}]
[task   INFO - GECKO(1220) | ++DOMWINDOW ==  (0x7f0a6e660800) [pid =  [serial =  [outer = (nil)]
[task   INFO - GECKO(1220) | ++DOMWINDOW ==  (0x7f0a6e9ef000) [pid =  [serial =  [outer = 
[task   INFO - GECKO(1220) | ++DOMWINDOW ==  (0x7f0a6d6cd000) [pid =  [serial =  [outer = 
[task   INFO - GECKO(1220) | ++DOMWINDOW ==  (0x7f0a6ecc5800) [pid =  [serial =  [outer = 
[task   INFO - GECKO(1220) | ++DOMWINDOW ==  (0x7f0a6eb8e800) [pid =  [serial =  [outer = 
[task   INFO - GECKO(1220) | JavaScript error:  line  TypeError: this.star is null
[task   INFO - GECKO(1220) | ++DOCSHELL  ==  [pid =  [id = {afc1ea08-afec-460b-891c-6e24fc91bd33}]
[task   INFO - GECKO(1220) | ++DOMWINDOW ==  (0x7f0a6e491000) [pid =  [serial =  [outer = (nil)]
[task   INFO - GECKO(1220) | ++DOMWINDOW ==  (0x7f0a6e655800) [pid =  [serial =  [outer = 
[task   INFO - GECKO(1220) | ++DOCSHELL  ==  [pid =  [id = {03e26828-bda4-48c2-9a31-0732187d4425}]
[task   INFO - GECKO(1220) | ++DOMWINDOW ==  (0x7f0a6ecde000) [pid =  [serial =  [outer = (nil)]
[task   INFO - GECKO(1220) | ++DOCSHELL  ==  [pid =  [id = {e5a4d708-d2d7-421a-b445-6423a52a72c4}]
[task   INFO - GECKO(1220) | ++DOMWINDOW ==  (0x7f0a744af800) [pid =  [serial =  [outer = (nil)]
[task   INFO - GECKO(1220) | ++DOMWINDOW ==  (0x7f0a74fa0800) [pid =  [serial =  [outer = 
[task   INFO - GECKO(1220) | --DOCSHELL  ==  [pid =  [id = {5d18ad69-bc51-4baf-8120-681ca3a33936}]
[task   INFO - GECKO(1220) | ++DOMWINDOW ==  (0x7f0a6dd0e000) [pid =  [serial =  [outer = 
[task   INFO - GECKO(1220) | ++DOMWINDOW ==  (0x7f0a6fa41000) [pid =  [serial =  [outer = 
[task   INFO - GECKO(1220) | ++DOMWINDOW ==  (0x7f0a7836e000) [pid =  [serial =  [outer = 
[task   INFO - GECKO(1220) | JavaScript error:  line  TypeError: this.star is null
[task   INFO - GECKO(1220) | ++DOCSHELL  ==  [pid =  [id = {0ec981c5-ff5e-425e-a3d7-2d45fa34f80f}]
[task   INFO - GECKO(1220) | ++DOMWINDOW ==  (0x7f0a6e651000) [pid =  [serial =  [outer = (nil)]
[task   INFO - GECKO(1220) | ++DOMWINDOW ==  (0x7f0a6fbc1800) [pid =  [serial =  [outer = 
[task   INFO - GECKO(1220) | ++DOCSHELL  ==  [pid =  [id = {aa144676-0c58-47ae-843a-cef77041b6f3}]
[task   INFO - GECKO(1220) | ++DOMWINDOW ==  (0x7f0a744b4000) [pid =  [serial =  [outer = (nil)]
[task   INFO - GECKO(1220) | ++DOCSHELL  ==  [pid =  [id = {11f1e239-62bf-48d3-bb79-59a772a9e468}]
[task   INFO - GECKO(1220) | ++DOMWINDOW ==  (0x7f0a7c124800) [pid =  [serial =  [outer = (nil)]
[task   INFO - GECKO(1220) | ++DOMWINDOW ==  (0x7f0a7c132000) [pid =  [serial =  [outer = 
[task   INFO - GECKO(1220) | --DOCSHELL  ==  [pid =  [id = {03e26828-bda4-48c2-9a31-0732187d4425}]
[task   INFO - GECKO(1220) | ++DOMWINDOW ==  (0x7f0a6ecdd000) [pid =  [serial =  [outer = 
[task   INFO - GECKO(1220) | ++DOMWINDOW ==  (0x7f0a6fd33000) [pid =  [serial =  [outer = 
[task   INFO - GECKO(1220) | ++DOMWINDOW ==  (0x7f0a7d67f000) [pid =  [serial =  [outer = 
[task   INFO - GECKO(1220) | JavaScript error:  line  TypeError: this.star is null
[task   INFO - GECKO(1220) | ++DOCSHELL  ==  [pid =  [id = {2e67a4ee-26ca-4fb7-9b68-1c2f7eeca76f}]
[task   INFO - GECKO(1220) | ++DOMWINDOW ==  (0x7f0a6fd35800) [pid =  [serial =  [outer = (nil)]
[task   INFO - GECKO(1220) | ++DOMWINDOW ==  (0x7f0a79676800) [pid =  [serial =  [outer = 
[task   INFO - GECKO(1220) | ++DOCSHELL  ==  [pid =  [id = {decab890-943f-44ab-b5d0-095df911dcf0}]
[task   INFO - GECKO(1220) | ++DOMWINDOW ==  (0x7f0a7c125800) [pid =  [serial =  [outer = (nil)]
[task   INFO - GECKO(1220) | ++DOCSHELL  ==  [pid =  [id = {d3b9ca36-f5c7-47d4-b3fb-dbd27e204429}]
[task   INFO - GECKO(1220) | ++DOMWINDOW ==  (0x7f0a7f378800) [pid =  [serial =  [outer = (nil)]
[task   INFO - GECKO(1220) | ++DOMWINDOW ==  (0x7f0a7f6d2000) [pid =  [serial =  [outer = 
[task   INFO - GECKO(1220) | --DOCSHELL  ==  [pid =  [id = {aa144676-0c58-47ae-843a-cef77041b6f3}]
[task   INFO - GECKO(1220) | ++DOMWINDOW ==  (0x7f0a744a8800) [pid =  [serial =  [outer = 
[task   INFO - GECKO(1220) | ++DOMWINDOW ==  (0x7f0a79d7a800) [pid =  [serial =  [outer = 
[task   INFO - GECKO(1220) | ++DOMWINDOW ==  (0x7f0a7fbe8800) [pid =  [serial =  [outer = 
[task   INFO - GECKO(1220) | JavaScript error:  line  TypeError: this.star is null
[task   INFO - TEST-INFO | started process screentopng
[task   INFO - TEST-INFO | screentopng: exit 
[task   INFO - Buffered messages logged at 
[task   INFO - Entering test bound setup
[task   INFO - Buffered messages logged at 
[task   INFO - Leaving test bound setup
[task   INFO - Entering test bound test_window_open
[task   INFO - Buffered messages logged at 
[task   INFO - TEST-PASS |  | The screen.width has a correct rounded value -  ==  -
[task   INFO - TEST-PASS |  | The screen.height has a correct rounded value -  ==  -
[task   INFO - TEST-PASS |  | The window.innerWidth has a correct rounded value -  ==  -
[task   INFO - TEST-PASS |  | The window.innerHeight has a correct rounded value -  ==  -
[task   INFO - Console message: [JavaScript Error: "TypeError: this.star is null" {file:  line: 
[task   INFO - Buffered messages logged at 
[task   INFO - TEST-PASS |  | The screen.width has a correct rounded value -  ==  -
[task   INFO - TEST-PASS |  | The screen.height has a correct rounded value -  ==  -
[task   INFO - TEST-PASS |  | The window.innerWidth has a correct rounded value -  ==  -
[task   INFO - TEST-PASS |  | The window.innerHeight has a correct rounded value -  ==  -
[task   INFO - Buffered messages logged at 
[task   INFO - Console message: [JavaScript Error: "TypeError: this.star is null" {file:  line: 
[task   INFO - Buffered messages logged at 
[task   INFO - TEST-PASS |  | The screen.width has a correct rounded value -  ==  -
[task   INFO - TEST-PASS |  | The screen.height has a correct rounded value -  ==  -
[task   INFO - TEST-PASS |  | The window.innerWidth has a correct rounded value -  ==  -
[task   INFO - TEST-PASS |  | The window.innerHeight has a correct rounded value -  ==  -
[task   INFO - Buffered messages logged at 
[task   INFO - Console message: [JavaScript Error: "TypeError: this.star is null" {file:  line: 
[task   INFO - Buffered messages logged at 
[task   INFO - TEST-PASS |  | The screen.width has a correct rounded value -  ==  -
[task   INFO - TEST-PASS |  | The screen.height has a correct rounded value -  ==  -
[task   INFO - TEST-PASS |  | The window.innerWidth has a correct rounded value -  ==  -
[task   INFO - TEST-PASS |  | The window.innerHeight has a correct rounded value -  ==  -
[task   INFO - Buffered messages logged at 
[task   INFO - Console message: [JavaScript Error: "TypeError: this.star is null" {file:  line: 
[task   INFO - Buffered messages finished
[task   INFO - TEST-UNEXPECTED-FAIL |  | A promise chain failed to handle a rejection: this.star is null - stack: null
[task   INFO - Rejection date: Tue Jul    GMT+0000 (UTC) - false == true - JS frame ::  :: assertNoUncaughtRejections :: line 
[task   INFO - Stack trace:
[task   INFO - 
[task   INFO - 
[task   INFO - 
[task   INFO - 
[task   INFO - 
[task   INFO - Not taking screenshot here: see the one that was previously logged
[task   INFO - TEST-UNEXPECTED-FAIL |  | A promise chain failed to handle a rejection: this.star is null - stack: null
[task   INFO - Rejection date: Tue Jul    GMT+0000 (UTC) - false == true - JS frame ::  :: assertNoUncaughtRejections :: line 


Example push: 
