tp5o summary pgo e10s - 4.0% regression windows10-64 (Tue July 18 2017)
https://treeherder.mozilla.org/perf.html#/graphs?series=%5Bmozilla-central,c00763b23b39207671b795a12ba29d38ddc17f06,1,1%5D&series=%5Bmozilla-central,ac46ba40f08bbbf209a6c34b8c054393bf222e67,0,1%5D&series=%5Bautoland,c00763b23b39207671b795a12ba29d38ddc17f06,1,1%5D&selected=%5Bautoland,c00763b23b39207671b795a12ba29d38ddc17f06,228271,298877279,1%5D

My week over week comparison of tp5o summary pgo e10s on Windows 10-64 shows around a 4% regression in the benchmark. The last good push is 18aeda1e84fb on Autoland Mon Jul 17, 17:44:53. Looks like something on the 18th shifted the low values from 233 to 238. Looks similar to 1381804.