crash in mozilla::net::HttpChannelParentListener::OnStartRequest(nsIRequest*, nsISupports*)
This bug was filed from the Socorro interface and is 
report bp-5fded522-462b-442e-9b6e-a13a92150122.
=============================================================
This is completely reproducible for me when I have NoScript 2.6.9.11 enabled in Nightly.