New tab has no favicon
Created attachment 8896402
Screenshot 2017-08-11 14.15.50.png

Firefox Version: 57.0a1 (2017-08-11) (64-bit)
OS: OSX 10.12.4



The new tab page is missing a favicon in the tab, so it looks weird.  Attached a screenshot.