# Fdb version 3
["bibtex Projektarbeit"] 1675862283 "Projektarbeit.aux" "Projektarbeit.bbl" "Projektarbeit" 1675862286
  "Auswertung.aux" 1675862285 4406 bff6799f62904f34f6d0b4ea2fb84881 "pdflatex"
  "C:/Users/maris/AppData/Local/Programs/MiKTeX/bibtex/bst/biblatex/biblatex.bst" 1657609515 65483 3b5a53ada692a06ce416d088de6a391b ""
  "EidesstattlicheErklärung.aux" 1675862286 4037 1a0cb82cb93bd8f64e5f79dcf97506c2 "pdflatex"
  "Projektarbeit-blx.bib" 1675862286 340 25674e554aa25e98ea59ec40797d70f1 "pdflatex"
  "Projektarbeit.aux" 1675862286 13147 62ddf751e84ed6ea2df714824bf5545f "pdflatex"
  "Projektbeschreibung.aux" 1675862285 4019 c05467b7d273618d62844f2225175f4f "pdflatex"
  "Versuchsaufbau.aux" 1675862285 5146 0daa05d9f8539959b2df9cd693b7776e "pdflatex"
  "Vorbereitung.aux" 1675862285 6225 66e04042b844b4e5fa1abec618d21bc6 "pdflatex"
  "bibliography.bib" 1675862069 3544 17c3c988c6b79a8191ecae3500f89dae ""
  (generated)
  "Projektarbeit.bbl"
  "Projektarbeit.blg"
["pdflatex"] 1675862283 "c:/Users/maris/OneDrive/Dokumente/repos/Switch-Versuche/Projektarbeit.tex" "Projektarbeit.pdf" "Projektarbeit" 1675862286
  "Auswertung.aux" 1675862285 4406 bff6799f62904f34f6d0b4ea2fb84881 "pdflatex"
  "Auswertung.tex" 1671180545 291 e67fc3d2167a6cc83388754d4eb1ed26 ""
  "C:/Users/maris/AppData/Local/MiKTeX/fonts/map/pdftex/pdftex.map" 1675257520 82535 0266753fb37a3d673c1d739765ad059f ""
  "C:/Users/maris/AppData/Local/MiKTeX/miktex/data/le/pdftex/pdflatex.fmt" 1667988771 10788010 3f36fc891542fb05beec32d2cabc39e9 ""
  "C:/Users/maris/AppData/Local/Programs/MiKTeX/fonts/enc/dvips/base/8r.enc" 1458473887 4993 80dc9bab7f31fb78a000ccfed0e27cab ""
  "C:/Users/maris/AppData/Local/Programs/MiKTeX/fonts/tfm/adobe/courier/pcrr8r.tfm" 1136765053 1292 bd42be2f344128bff6d35d98474adfe3 ""
  "C:/Users/maris/AppData/Local/Programs/MiKTeX/fonts/tfm/adobe/courier/pcrr8t.tfm" 1136765053 1384 4632f5e54900a7dadbb83f555bc61e56 ""
  "C:/Users/maris/AppData/Local/Programs/MiKTeX/fonts/tfm/adobe/helvetic/phvb8r.tfm" 1136768654 4484 b828043cbd581d289d955903c1339981 ""
  "C:/Users/maris/AppData/Local/Programs/MiKTeX/fonts/tfm/adobe/helvetic/phvb8t.tfm" 1136768654 6628 34c39492c0adc454c1c199922bba8363 ""
  "C:/Users/maris/AppData/Local/Programs/MiKTeX/fonts/tfm/adobe/helvetic/phvr8t.tfm" 1136768654 7040 b2bd27e2bfe6f6948cbc3239cae7444f ""
  "C:/Users/maris/AppData/Local/Programs/MiKTeX/fonts/tfm/adobe/times/ptmb8r.tfm" 1136768654 4524 6bce29db5bc272ba5f332261583fee9c ""
  "C:/Users/maris/AppData/Local/Programs/MiKTeX/fonts/tfm/adobe/times/ptmb8t.tfm" 1136768654 6880 f19b8995b61c334d78fc734065f6b4d4 ""
  "C:/Users/maris/AppData/Local/Programs/MiKTeX/fonts/tfm/adobe/times/ptmr8c.tfm" 1136768654 1352 fa28a7e6d323c65ce7d13d5342ff6be2 ""
  "C:/Users/maris/AppData/Local/Programs/MiKTeX/fonts/tfm/adobe/times/ptmr8r.tfm" 1136768654 4408 25b74d011a4c66b7f212c0cc3c90061b ""
  "C:/Users/maris/AppData/Local/Programs/MiKTeX/fonts/tfm/adobe/times/ptmr8t.tfm" 1136768654 6672 e3ab9e37e925f3045c9005e6d1473d56 ""
  "C:/Users/maris/AppData/Local/Programs/MiKTeX/fonts/tfm/adobe/times/ptmrc8t.tfm" 1136768654 16648 7e91c60ebf91b9c60e16ef52b3070f9c ""
  "C:/Users/maris/AppData/Local/Programs/MiKTeX/fonts/tfm/adobe/times/ptmri8r.tfm" 1136768654 4640 532ca3305aad10cc01d769f3f91f1029 ""
  "C:/Users/maris/AppData/Local/Programs/MiKTeX/fonts/tfm/adobe/times/ptmri8t.tfm" 1136768654 6944 94c55ad86e6ea2826f78ba2240d50df9 ""
  "C:/Users/maris/AppData/Local/Programs/MiKTeX/fonts/tfm/jknappen/ec/ecrm1095.tfm" 993058524 3172 eb6efaa83c6c52473a1c403f376eab0f ""
  "C:/Users/maris/AppData/Local/Programs/MiKTeX/fonts/tfm/public/cm/cmmi10.tfm" 1136765053 1528 abec98dbc43e172678c11b3b9031252a ""
  "C:/Users/maris/AppData/Local/Programs/MiKTeX/fonts/tfm/public/cm/cmmi12.tfm" 1136765053 1524 4414a8315f39513458b80dfc63bff03a ""
  "C:/Users/maris/AppData/Local/Programs/MiKTeX/fonts/tfm/public/cm/cmmi6.tfm" 1136765053 1512 f21f83efb36853c0b70002322c1ab3ad ""
  "C:/Users/maris/AppData/Local/Programs/MiKTeX/fonts/tfm/public/cm/cmmi8.tfm" 1136765053 1520 eccf95517727cb11801f4f1aee3a21b4 ""
  "C:/Users/maris/AppData/Local/Programs/MiKTeX/fonts/tfm/public/cm/cmr10.tfm" 1136765053 1296 45809c5a464d5f32c8f98ba97c1bb47f ""
  "C:/Users/maris/AppData/Local/Programs/MiKTeX/fonts/tfm/public/cm/cmr12.tfm" 1136765053 1288 655e228510b4c2a1abe905c368440826 ""
  "C:/Users/maris/AppData/Local/Programs/MiKTeX/fonts/tfm/public/cm/cmr6.tfm" 1136765053 1300 b62933e007d01cfd073f79b963c01526 ""
  "C:/Users/maris/AppData/Local/Programs/MiKTeX/fonts/tfm/public/cm/cmr8.tfm" 1136765053 1292 21c1c5bfeaebccffdb478fd231a0997d ""
  "C:/Users/maris/AppData/Local/Programs/MiKTeX/fonts/tfm/public/cm/cmsy10.tfm" 1136765053 1124 6c73e740cf17375f03eec0ee63599741 ""
  "C:/Users/maris/AppData/Local/Programs/MiKTeX/fonts/tfm/public/cm/cmsy6.tfm" 1136765053 1116 933a60c408fc0a863a92debe84b2d294 ""
  "C:/Users/maris/AppData/Local/Programs/MiKTeX/fonts/tfm/public/cm/cmsy8.tfm" 1136765053 1120 8b7d695260f3cff42e636090a8002094 ""
  "C:/Users/maris/AppData/Local/Programs/MiKTeX/fonts/type1/urw/courier/ucrr8a.pfb" 1136846148 45758 19968a0990191524e34e1994d4a31cb6 ""
  "C:/Users/maris/AppData/Local/Programs/MiKTeX/fonts/type1/urw/helvetic/uhvb8a.pfb" 1136849748 35941 adef23a721dd8354a4a2bf4434f1c484 ""
  "C:/Users/maris/AppData/Local/Programs/MiKTeX/fonts/type1/urw/times/utmb8a.pfb" 1136849748 44729 fea0975e20ec51c992338362f05f1146 ""
  "C:/Users/maris/AppData/Local/Programs/MiKTeX/fonts/type1/urw/times/utmr8a.pfb" 1136849748 46026 687528a208fbfc1f00832bb96cccebbb ""
  "C:/Users/maris/AppData/Local/Programs/MiKTeX/fonts/type1/urw/times/utmri8a.pfb" 1136849748 45458 504e2b06fa82109d168c7a0afb09e145 ""
  "C:/Users/maris/AppData/Local/Programs/MiKTeX/fonts/vf/adobe/courier/pcrr8t.vf" 1136765053 2184 8475af1b9cfa983db5f46f5ed4b8f9f7 ""
  "C:/Users/maris/AppData/Local/Programs/MiKTeX/fonts/vf/adobe/helvetic/phvb8t.vf" 1136768654 2340 0efed6a948c3c37d870e4e7ddb85c7c3 ""
  "C:/Users/maris/AppData/Local/Programs/MiKTeX/fonts/vf/adobe/times/ptmb8t.vf" 1136768654 2340 df9c920cc5688ebbf16a93f45ce7bdd3 ""
  "C:/Users/maris/AppData/Local/Programs/MiKTeX/fonts/vf/adobe/times/ptmr8c.vf" 1136768654 3556 8a9a6dcbcd146ef985683f677f4758a6 ""
  "C:/Users/maris/AppData/Local/Programs/MiKTeX/fonts/vf/adobe/times/ptmr8t.vf" 1136768654 2348 91706c542228501c410c266421fbe30c ""
  "C:/Users/maris/AppData/Local/Programs/MiKTeX/fonts/vf/adobe/times/ptmrc8t.vf" 1136768654 3608 eb048a634708cbf5eda8def0ce93c7bb ""
  "C:/Users/maris/AppData/Local/Programs/MiKTeX/fonts/vf/adobe/times/ptmri8t.vf" 1136768654 2328 6cd7df782b09b29cfc4d93e55b6b9a59 ""
  "C:/Users/maris/AppData/Local/Programs/MiKTeX/tex/context/base/mkii/supp-pdf.mkii" 1580390158 71627 94eb9990bed73c364d7f53f960cc8c5b ""
  "C:/Users/maris/AppData/Local/Programs/MiKTeX/tex/generic/atbegshi/atbegshi.sty" 1575571100 24708 5584a51a7101caf7e6bbf1fc27d8f7b1 ""
  "C:/Users/maris/AppData/Local/Programs/MiKTeX/tex/generic/babel/babel.sty" 1664892351 152127 31067273495f46936aa2b3653cd6090b ""
  "C:/Users/maris/AppData/Local/Programs/MiKTeX/tex/generic/babel/locale/de/babel-de.ini" 1664892353 4096 fa1802f91144b2c083d61dddf097a6d2 ""
  "C:/Users/maris/AppData/Local/Programs/MiKTeX/tex/generic/babel/locale/de/babel-ngerman.tex" 1664892353 336 b80d4d282e518e78a8b5f9cc543e7f94 ""
  "C:/Users/maris/AppData/Local/Programs/MiKTeX/tex/generic/babel/txtbabel.def" 1664892351 5233 d5e383ed66bf272b71b1a90b596e21c6 ""
  "C:/Users/maris/AppData/Local/Programs/MiKTeX/tex/generic/bigintcalc/bigintcalc.sty" 1576433602 40635 c40361e206be584d448876bba8a64a3b ""
  "C:/Users/maris/AppData/Local/Programs/MiKTeX/tex/generic/bitset/bitset.sty" 1575926576 33961 6b5c75130e435b2bfdb9f480a09a39f9 ""
  "C:/Users/maris/AppData/Local/Programs/MiKTeX/tex/generic/etexcmds/etexcmds.sty" 1576433638 7734 b98cbb34c81f667027c1e3ebdbfce34b ""
  "C:/Users/maris/AppData/Local/Programs/MiKTeX/tex/generic/gettitlestring/gettitlestring.sty" 1576433666 8371 9d55b8bd010bc717624922fb3477d92e ""
  "C:/Users/maris/AppData/Local/Programs/MiKTeX/tex/generic/iftex/iftex.sty" 1643997108 7237 bdd120a32c8fdb4b433cf9ca2e7cd98a ""
  "C:/Users/maris/AppData/Local/Programs/MiKTeX/tex/generic/iftex/ifvtex.sty" 1643997108 1057 525c2192b5febbd8c1f662c9468335bb ""
  "C:/Users/maris/AppData/Local/Programs/MiKTeX/tex/generic/infwarerr/infwarerr.sty" 1575399508 8356 7bbb2c2373aa810be568c29e333da8ed ""
  "C:/Users/maris/AppData/Local/Programs/MiKTeX/tex/generic/intcalc/intcalc.sty" 1576433764 31769 002a487f55041f8e805cfbf6385ffd97 ""
  "C:/Users/maris/AppData/Local/Programs/MiKTeX/tex/generic/kvdefinekeys/kvdefinekeys.sty" 1576763304 5412 d5a2436094cd7be85769db90f29250a6 ""
  "C:/Users/maris/AppData/Local/Programs/MiKTeX/tex/generic/ltxcmds/ltxcmds.sty" 1601732009 18568 4409f8f50cd365c68e684407e5350b1b ""
  "C:/Users/maris/AppData/Local/Programs/MiKTeX/tex/generic/pdfescape/pdfescape.sty" 1575926700 19007 15924f7228aca6c6d184b115f4baa231 ""
  "C:/Users/maris/AppData/Local/Programs/MiKTeX/tex/generic/pdftexcmds/pdftexcmds.sty" 1623001677 20089 80423eac55aa175305d35b49e04fe23b ""
  "C:/Users/maris/AppData/Local/Programs/MiKTeX/tex/generic/uniquecounter/uniquecounter.sty" 1576434012 7008 f92eaa0a3872ed622bbf538217cd2ab7 ""
  "C:/Users/maris/AppData/Local/Programs/MiKTeX/tex/latex/00miktex/epstopdf-sys.cfg" 1616067285 584 2a1075dd71571459f59146da9f7502ad ""
  "C:/Users/maris/AppData/Local/Programs/MiKTeX/tex/latex/arabi/bblopts.cfg" 1139961600 902 c30e5c373bc58bde21f8f63a3091626f ""
  "C:/Users/maris/AppData/Local/Programs/MiKTeX/tex/latex/atveryend/atveryend.sty" 1576101110 19336 ce7ae9438967282886b3b036cfad1e4d ""
  "C:/Users/maris/AppData/Local/Programs/MiKTeX/tex/latex/auxhook/auxhook.sty" 1576538732 3935 57aa3c3e203a5c2effb4d2bd2efbc323 ""
  "C:/Users/maris/AppData/Local/Programs/MiKTeX/tex/latex/babel-german/ngerman.ldf" 1614782471 2289 b1d356015c8fd065cb4437d567449559 ""
  "C:/Users/maris/AppData/Local/Programs/MiKTeX/tex/latex/babel-german/ngermanb.ldf" 1614782471 7752 76871ff65dd4689e1a548995ac96d8c3 ""
  "C:/Users/maris/AppData/Local/Programs/MiKTeX/tex/latex/base/atbegshi-ltx.sty" 1657037832 3122 8df402c6591ccc8ed35ce64c1c49c50b ""
  "C:/Users/maris/AppData/Local/Programs/MiKTeX/tex/latex/base/atveryend-ltx.sty" 1657037832 2462 2ab3964e30f8e7a2977395016edcbbc6 ""
  "C:/Users/maris/AppData/Local/Programs/MiKTeX/tex/latex/base/fontenc.sty" 1657037832 5119 4ce42f43368f652f9c9522d943cce8e4 ""
  "C:/Users/maris/AppData/Local/Programs/MiKTeX/tex/latex/base/ifthen.sty" 1657037832 5319 48d7f3cfa322abd2788e3c09d624b922 ""
  "C:/Users/maris/AppData/Local/Programs/MiKTeX/tex/latex/base/inputenc.sty" 1657037832 5048 84b05796b49b69e2d4257d537721c960 ""
  "C:/Users/maris/AppData/Local/Programs/MiKTeX/tex/latex/biblatex/bbx/numeric.bbx" 1657609515 1818 9ed166ac0a9204a8ebe450ca09db5dde ""
  "C:/Users/maris/AppData/Local/Programs/MiKTeX/tex/latex/biblatex/bbx/standard.bbx" 1657609515 25680 409c3f3d570418bc545e8065bebd0688 ""
  "C:/Users/maris/AppData/Local/Programs/MiKTeX/tex/latex/biblatex/biblatex.cfg" 1657609515 69 249fa6df04d948e51b6d5c67bea30c42 ""
  "C:/Users/maris/AppData/Local/Programs/MiKTeX/tex/latex/biblatex/biblatex.def" 1657609515 92456 21e687f013958a6cb57adaa61a04572a ""
  "C:/Users/maris/AppData/Local/Programs/MiKTeX/tex/latex/biblatex/biblatex.sty" 1657609515 526811 a1f8c6dfa1788c26d4b7587a2e99a625 ""
  "C:/Users/maris/AppData/Local/Programs/MiKTeX/tex/latex/biblatex/blx-bibtex.def" 1657609515 24613 9fabc69e3860a7fb0186ecefade563ce ""
  "C:/Users/maris/AppData/Local/Programs/MiKTeX/tex/latex/biblatex/blx-case-expl3.sty" 1657609515 8433 72f8188742e7214b7068f345cd0287ac ""
  "C:/Users/maris/AppData/Local/Programs/MiKTeX/tex/latex/biblatex/blx-compat.def" 1657609515 13919 5426dbe90e723f089052b4e908b56ef9 ""
  "C:/Users/maris/AppData/Local/Programs/MiKTeX/tex/latex/biblatex/blx-dm.def" 1657609515 32455 8d3e554836db11aab80a8e11be62e1b1 ""
  "C:/Users/maris/AppData/Local/Programs/MiKTeX/tex/latex/biblatex/cbx/numeric.cbx" 1657609515 4578 2d37f6a8c72f47aacef79870545a713d ""
  "C:/Users/maris/AppData/Local/Programs/MiKTeX/tex/latex/biblatex/lbx/german.lbx" 1657609515 33908 9178e63849ed8d931ae427546930e76a ""
  "C:/Users/maris/AppData/Local/Programs/MiKTeX/tex/latex/biblatex/lbx/ngerman.lbx" 1657609515 520 79db3ad588d8a32d9a5aa90a48bd8364 ""
  "C:/Users/maris/AppData/Local/Programs/MiKTeX/tex/latex/bookmark/bkm-pdftex.def" 1604855866 8609 8ac7db65d9617618cf703bd16c1bd0b8 ""
  "C:/Users/maris/AppData/Local/Programs/MiKTeX/tex/latex/bookmark/bookmark.sty" 1604855866 18237 5cbdfe9ef383a557f780a0a1f45cdb1c ""
  "C:/Users/maris/AppData/Local/Programs/MiKTeX/tex/latex/caption/caption-koma.sto" 1647504720 6479 b14d2605e2855473011b0056d59d1409 ""
  "C:/Users/maris/AppData/Local/Programs/MiKTeX/tex/latex/caption/caption.sty" 1647504720 54291 b8e5c600d4aa37b48a740dd2a6c26163 ""
  "C:/Users/maris/AppData/Local/Programs/MiKTeX/tex/latex/caption/caption3.sty" 1647504720 71241 d2cd3a1c5acef9cb31f945b93c0bb6e3 ""
  "C:/Users/maris/AppData/Local/Programs/MiKTeX/tex/latex/csquotes/csquotes.cfg" 1663129846 7068 06f8d141725d114847527a66439066b6 ""
  "C:/Users/maris/AppData/Local/Programs/MiKTeX/tex/latex/csquotes/csquotes.def" 1663129846 21994 2bc2a882df92d97dbce35c06bb1d3541 ""
  "C:/Users/maris/AppData/Local/Programs/MiKTeX/tex/latex/csquotes/csquotes.sty" 1663129846 62761 3c92d495a9e03d7254b9a3266aa17164 ""
  "C:/Users/maris/AppData/Local/Programs/MiKTeX/tex/latex/epstopdf-pkg/epstopdf-base.sty" 1622999586 13886 d1306dcf79a944f6988e688c1785f9ce ""
  "C:/Users/maris/AppData/Local/Programs/MiKTeX/tex/latex/etoolbox/etoolbox.sty" 1601894156 46845 3b58f70c6e861a13d927bff09d35ecbc ""
  "C:/Users/maris/AppData/Local/Programs/MiKTeX/tex/latex/float/float.sty" 1469020353 6916 16d2656a1984957e674b149555f1ea1d ""
  "C:/Users/maris/AppData/Local/Programs/MiKTeX/tex/latex/footmisc/footmisc.sty" 1646818468 21361 67512b0642debcd4503e59fcbbb767f1 ""
  "C:/Users/maris/AppData/Local/Programs/MiKTeX/tex/latex/geometry/geometry.cfg" 1578053545 1104 7ac475a4e3466b0b43e138e9356bda83 ""
  "C:/Users/maris/AppData/Local/Programs/MiKTeX/tex/latex/geometry/geometry.sty" 1578053545 42759 9cf6c5257b1bc7af01a58859749dd37a ""
  "C:/Users/maris/AppData/Local/Programs/MiKTeX/tex/latex/graphics-cfg/graphics.cfg" 1465890692 1224 978390e9c2234eab29404bc21b268d1e ""
  "C:/Users/maris/AppData/Local/Programs/MiKTeX/tex/latex/graphics-def/pdftex.def" 1663915090 19448 1e988b341dda20961a6b931bcde55519 ""
  "C:/Users/maris/AppData/Local/Programs/MiKTeX/tex/latex/graphics/graphics.sty" 1665063979 18387 8f900a490197ebaf93c02ae9476d4b09 ""
  "C:/Users/maris/AppData/Local/Programs/MiKTeX/tex/latex/graphics/graphicx.sty" 1665063979 8010 a8d949cbdbc5c983593827c9eec252e1 ""
  "C:/Users/maris/AppData/Local/Programs/MiKTeX/tex/latex/graphics/keyval.sty" 1665063979 2671 7e67d78d9b88c845599a85b2d41f2e39 ""
  "C:/Users/maris/AppData/Local/Programs/MiKTeX/tex/latex/graphics/trig.sty" 1665063979 4023 293ea1c16429fc0c4cf605f4da1791a9 ""
  "C:/Users/maris/AppData/Local/Programs/MiKTeX/tex/latex/grfext/grfext.sty" 1575399474 7133 b94bbacbee6e4fdccdc7f810b2aec370 ""
  "C:/Users/maris/AppData/Local/Programs/MiKTeX/tex/latex/hycolor/hycolor.sty" 1580380792 18571 4c28a13fc3d975e6e81c9bea1d697276 ""
  "C:/Users/maris/AppData/Local/Programs/MiKTeX/tex/latex/hyperref/hpdftex.def" 1663874908 48197 fc0156fb060f4e3367a06bf2259f0a54 ""
  "C:/Users/maris/AppData/Local/Programs/MiKTeX/tex/latex/hyperref/hyperref.sty" 1663874908 222717 db0002f5ce98ef1fbf091c8625b33d7e ""
  "C:/Users/maris/AppData/Local/Programs/MiKTeX/tex/latex/hyperref/nameref.sty" 1663874908 12951 45609f529c67717a6d5046d7f3d77f03 ""
  "C:/Users/maris/AppData/Local/Programs/MiKTeX/tex/latex/hyperref/pd1enc.def" 1663874908 14249 ef956b0ffc2684335723dc9cc40c5ce7 ""
  "C:/Users/maris/AppData/Local/Programs/MiKTeX/tex/latex/hyperref/puenc.def" 1663874908 117125 ae375b0a1c0bb31bb9fee2337fb337fc ""
  "C:/Users/maris/AppData/Local/Programs/MiKTeX/tex/latex/koma-script/scrartcl.cls" 1665567292 240051 52be5a65d1a39f57f513a0719c603922 ""
  "C:/Users/maris/AppData/Local/Programs/MiKTeX/tex/latex/koma-script/scrbase.sty" 1665567292 100782 f6b410b31620fc8f716ac3eb9e120b80 ""
  "C:/Users/maris/AppData/Local/Programs/MiKTeX/tex/latex/koma-script/scrkbase.sty" 1665567292 21688 ee91fd87ef130de7080c2c1931a84180 ""
  "C:/Users/maris/AppData/Local/Programs/MiKTeX/tex/latex/koma-script/scrlayer-scrpage.sty" 1665567292 59991 ccce617e38ca4bdafdfd19d92a46532d ""
  "C:/Users/maris/AppData/Local/Programs/MiKTeX/tex/latex/koma-script/scrlayer.sty" 1665567292 87043 857800f2e5ee6f594d687c0a14a376fb ""
  "C:/Users/maris/AppData/Local/Programs/MiKTeX/tex/latex/koma-script/scrlfile-hook.sty" 1665567292 11185 5a5577e7689f2d10465f1705f5f9a83c ""
  "C:/Users/maris/AppData/Local/Programs/MiKTeX/tex/latex/koma-script/scrlfile.sty" 1665567292 3328 af45d3c431d75fd0ea188117a814e3bc ""
  "C:/Users/maris/AppData/Local/Programs/MiKTeX/tex/latex/koma-script/scrlogo.sty" 1665567292 2162 ddd7d923e5d10cf2c18186479dc1a2f8 ""
  "C:/Users/maris/AppData/Local/Programs/MiKTeX/tex/latex/koma-script/scrsize11pt.clo" 1665567292 6786 60bebd42d11cd57b8eec5b4ad0177b49 ""
  "C:/Users/maris/AppData/Local/Programs/MiKTeX/tex/latex/koma-script/tocbasic.sty" 1665567292 106928 6dd237f471caedea7b48b56947bada51 ""
  "C:/Users/maris/AppData/Local/Programs/MiKTeX/tex/latex/koma-script/typearea.sty" 1665567292 57034 2a2a4fda574723afa04a496aec518189 ""
  "C:/Users/maris/AppData/Local/Programs/MiKTeX/tex/latex/kvoptions/kvoptions.sty" 1656232881 22555 6d8e155cfef6d82c3d5c742fea7c992e ""
  "C:/Users/maris/AppData/Local/Programs/MiKTeX/tex/latex/kvsetkeys/kvsetkeys.sty" 1665062733 13815 760b0c02f691ea230f5359c4e1de23a7 ""
  "C:/Users/maris/AppData/Local/Programs/MiKTeX/tex/latex/l3backend/l3backend-pdftex.def" 1664385028 30426 b4bd1ea7df6c51902df8edf551809fb7 ""
  "C:/Users/maris/AppData/Local/Programs/MiKTeX/tex/latex/l3kernel/expl3.sty" 1664385690 6107 fa5d25e84c05db068aed042b51a24d3b ""
  "C:/Users/maris/AppData/Local/Programs/MiKTeX/tex/latex/l3packages/xparse/xparse.sty" 1655909660 6812 d2f733947d73940b228845829d585700 ""
  "C:/Users/maris/AppData/Local/Programs/MiKTeX/tex/latex/letltxmacro/letltxmacro.sty" 1575399536 5766 13a9e8766c47f30327caf893ece86ac8 ""
  "C:/Users/maris/AppData/Local/Programs/MiKTeX/tex/latex/logreq/logreq.def" 1280937415 1620 fb1c32b818f2058eca187e5c41dfae77 ""
  "C:/Users/maris/AppData/Local/Programs/MiKTeX/tex/latex/logreq/logreq.sty" 1280937415 6187 b27afc771af565d3a9ff1ca7d16d0d46 ""
  "C:/Users/maris/AppData/Local/Programs/MiKTeX/tex/latex/psnfss/t1pcr.fd" 1585253778 835 d5895e9edc628f2be019beb2c0ec66df ""
  "C:/Users/maris/AppData/Local/Programs/MiKTeX/tex/latex/psnfss/t1phv.fd" 1585253778 1536 47067fbe7c3ffed1ede7aaa7b8549d7a ""
  "C:/Users/maris/AppData/Local/Programs/MiKTeX/tex/latex/psnfss/t1ptm.fd" 1585253778 817 61d7da1e9f9e74989b196d147e623736 ""
  "C:/Users/maris/AppData/Local/Programs/MiKTeX/tex/latex/psnfss/times.sty" 1585923171 888 8e0e5c8cca7b18e0400f97f5a2b90a99 ""
  "C:/Users/maris/AppData/Local/Programs/MiKTeX/tex/latex/psnfss/ts1ptm.fd" 1585253778 653 96f56dc5d1ef1fe1121f1cfeec70ee0c ""
  "C:/Users/maris/AppData/Local/Programs/MiKTeX/tex/latex/refcount/refcount.sty" 1576433952 9878 9e94e8fa600d95f9c7731bb21dfb67a4 ""
  "C:/Users/maris/AppData/Local/Programs/MiKTeX/tex/latex/rerunfilecheck/rerunfilecheck.sty" 1657797096 9714 ba3194bd52c8499b3f1e3eb91d409670 ""
  "C:/Users/maris/AppData/Local/Programs/MiKTeX/tex/latex/setspace/setspace.sty" 1324294077 22913 a27d7908fc6f0385466454a966a316eb ""
  "C:/Users/maris/AppData/Local/Programs/MiKTeX/tex/latex/url/url.sty" 1388490452 12796 8edb7d69a20b857904dd0ea757c14ec9 ""
  "EidesstattlicheErklärung.aux" 1675862286 4037 1a0cb82cb93bd8f64e5f79dcf97506c2 "pdflatex"
  "EidesstattlicheErklärung.tex" 1671181286 468 340ecedf2fc46a945c18d88df524d820 ""
  "Projektarbeit.aux" 1675862286 13147 62ddf751e84ed6ea2df714824bf5545f "pdflatex"
  "Projektarbeit.bbl" 1675862283 9435 be4cd5fe06566ea1f5b41850d90654ae "bibtex Projektarbeit"
  "Projektarbeit.lof" 1675862286 358 0160b36af6a56ce780ab57d1347da693 "pdflatex"
  "Projektarbeit.out" 0 -1 0 "pdflatex"
  "Projektarbeit.run.xml" 1675862286 2635 8951b7de8573c11edd512148a5680a2c "pdflatex"
  "Projektarbeit.tex" 1675861843 3071 0e70fab4f8eca978ca06b7ca4420801d ""
  "Projektarbeit.toc" 1675862286 2970 a91d385f6fede639c8ff983c3af9aa65 "pdflatex"
  "Projektbeschreibung.aux" 1675862285 4019 c05467b7d273618d62844f2225175f4f "pdflatex"
  "Projektbeschreibung.tex" 1675256656 152 0f28baa542f45311f55e3d9af6303175 ""
  "Versuchsaufbau.aux" 1675862285 5146 0daa05d9f8539959b2df9cd693b7776e "pdflatex"
  "Versuchsaufbau.tex" 1675858826 1043 89fd840e7f3ff38d8cda28e232a2ba24 ""
  "Vorbereitung.aux" 1675862285 6225 66e04042b844b4e5fa1abec618d21bc6 "pdflatex"
  "Vorbereitung.tex" 1675862279 12883 5cc1256f7c857c63f39780edfcfece34 ""
  "bszet-lgo.png" 1668071716 9266 80fbc9262f4baf473066ead74d7bbfb7 ""
  "c:/Users/maris/OneDrive/Dokumente/repos/Switch-Versuche/Projektarbeit.tex" 1675861843 3071 0e70fab4f8eca978ca06b7ca4420801d ""
  "images/VLAN.png" 1675861548 668598 a16e17b66446175e359ba10a971b9190 ""
  (generated)
  "Auswertung.aux"
  "EidesstattlicheErklärung.aux"
  "Projektarbeit-blx.bib"
  "Projektarbeit.aux"
  "Projektarbeit.lof"
  "Projektarbeit.log"
  "Projektarbeit.out"
  "Projektarbeit.pdf"
  "Projektarbeit.run.xml"
  "Projektarbeit.toc"
  "Projektbeschreibung.aux"
  "Versuchsaufbau.aux"
  "Vorbereitung.aux"
