{
    "id": "com.modxvm.xvm.export",
    "name": "XVM Export (obsolete)",
    "description": "",

    "version": "XVM_VERSION",
    "dependencies": [],
    "dependencies_optional": [],

    "url": "https://modxvm.com/",
    "url_update": "https://modxvm.com/",

    "wot_version_min": "WOT_VERSION",
    "wot_version_exactmatch": false,

    "features": ["python"]
}
