<svg width="640" height="480" viewBox="0 0 640 480" fill="none" xmlns="http://www.w3.org/2000/svg">
<g id="Illustration 23">
<g id="Background">
<g id="Background Object / Cloud / 1">
<g id="Group 3">
<path id="Fill 1" fill-rule="evenodd" clip-rule="evenodd" d="M259.098 90.1573H124.167C124.167 90.1573 136.879 71.5813 147.329 71.2906C159.801 70.9438 165.417 84.6857 177.394 84.6857C189.374 84.6857 197.394 51.0726 219.567 51.0726C243.236 51.0726 259.098 90.1573 259.098 90.1573Z" fill="#ECF6FF"/>
</g>
</g>
<g id="Background Object / Tree / 2">
<g id="Group 14">
<path id="Fill 1_2" fill-rule="evenodd" clip-rule="evenodd" d="M321.701 264.495C320.246 260.129 312.269 260.868 312.268 248.694C312.266 230.363 337.461 232.455 338.947 218.643C340.433 204.831 324.243 205.161 323.741 193.512C323.24 181.862 335.551 157.824 354.229 157.824C368.957 157.824 356.759 176.372 368.645 184.666C380.531 192.961 394.107 182.335 400.825 195.378C410.08 213.344 386.415 234.921 388.75 248.694C391.084 262.467 404.957 259.21 405.382 274.343C405.807 289.477 385.654 292.14 387.553 305.117C388.75 313.297 401.503 310.565 402.172 326.695C402.739 340.352 358.919 357.25 326.003 329.46C293.086 301.67 327.256 281.159 321.701 264.495Z" fill="#CCE3FF"/>
<path id="Stroke 4 (Stroke)" fill-rule="evenodd" clip-rule="evenodd" d="M359.514 229.88V367.166H356.448V229.88H359.514Z" fill="#ECF6FF"/>
<path id="Stroke 6 (Stroke)" fill-rule="evenodd" clip-rule="evenodd" d="M378.05 305.044L358.67 324.463L356.502 322.291L375.882 302.872L378.05 305.044Z" fill="#ECF6FF"/>
<path id="Stroke 8 (Stroke)" fill-rule="evenodd" clip-rule="evenodd" d="M369.818 264.398L358.9 275.338L356.732 273.166L367.65 262.226L369.818 264.398Z" fill="#ECF6FF"/>
<path id="Stroke 10 (Stroke)" fill-rule="evenodd" clip-rule="evenodd" d="M343.336 276.76L359.229 292.684L357.061 294.856L341.168 278.932L343.336 276.76Z" fill="#ECF6FF"/>
<path id="Stroke 12 (Stroke)" fill-rule="evenodd" clip-rule="evenodd" d="M350.709 241.37L359.545 250.223L357.377 252.396L348.541 243.542L350.709 241.37Z" fill="#ECF6FF"/>
</g>
</g>
<g id="Background Object / Tree / 5">
<g id="Group 12">
<path id="Fill 1_3" fill-rule="evenodd" clip-rule="evenodd" d="M186.072 282.896C186.072 309.286 168.884 324.009 146.498 324.009C124.11 324.009 106.922 309.286 106.922 282.896C106.922 227.333 132.182 163.277 146.498 163.277C160.813 163.277 186.072 227.333 186.072 282.896Z" fill="#CCE3FF"/>
<path id="Stroke 4 (Stroke)_2" fill-rule="evenodd" clip-rule="evenodd" d="M148.03 242.107V366.984H144.964V242.107H148.03Z" fill="#ECF6FF"/>
<path id="Stroke 6 (Stroke)_2" fill-rule="evenodd" clip-rule="evenodd" d="M163.145 294.134L146.971 310.341L144.803 308.169L160.977 291.962L163.145 294.134Z" fill="#ECF6FF"/>
<path id="Stroke 8 (Stroke)_2" fill-rule="evenodd" clip-rule="evenodd" d="M133.863 267.771L147.493 281.428L145.325 283.6L131.695 269.943L133.863 267.771Z" fill="#ECF6FF"/>
<path id="Stroke 10 (Stroke)_2" fill-rule="evenodd" clip-rule="evenodd" d="M158.105 254.67L147.187 265.609L145.02 263.437L155.937 252.498L158.105 254.67Z" fill="#ECF6FF"/>
</g>
</g>
<g id="Background Object / Tree / 3">
<g id="Group 12_2">
<path id="Fill 1_4" fill-rule="evenodd" clip-rule="evenodd" d="M328.262 270.923C328.262 301.232 303.764 325.802 273.544 325.802C243.324 325.802 218.826 301.232 218.826 270.923C218.826 240.615 243.324 216.045 273.544 216.045C303.764 216.045 328.262 240.615 328.262 270.923Z" fill="#ECF6FF"/>
<path id="Stroke 4 (Stroke)_3" fill-rule="evenodd" clip-rule="evenodd" d="M272.011 367.31V255.063H275.077V367.31H272.011Z" fill="#B6D4FF"/>
<path id="Stroke 6 (Stroke)_3" fill-rule="evenodd" clip-rule="evenodd" d="M286.809 295.977L274.628 308.194L272.459 306.023L284.64 293.806L286.809 295.977Z" fill="#B6D4FF"/>
<path id="Stroke 8 (Stroke)_3" fill-rule="evenodd" clip-rule="evenodd" d="M281.36 265.234L275.088 271.524L272.919 269.353L279.191 263.063L281.36 265.234Z" fill="#B6D4FF"/>
<path id="Stroke 10 (Stroke)_3" fill-rule="evenodd" clip-rule="evenodd" d="M262.955 276.089L274.628 287.797L272.459 289.968L260.786 278.26L262.955 276.089Z" fill="#B6D4FF"/>
</g>
</g>
<g id="Background Object / Streetlight / 2">
<g id="Group 13">
<path id="Fill 1_5" fill-rule="evenodd" clip-rule="evenodd" d="M460.564 68.7231H456.909C455.151 68.7231 453.725 70.1511 453.725 71.9133V336.029H463.748V71.9133C463.748 70.1511 462.322 68.7231 460.564 68.7231Z" fill="#D7EBFF"/>
<path id="Fill 3" fill-rule="evenodd" clip-rule="evenodd" d="M450.719 360.323H466.754V333.084H450.719V360.323Z" fill="#CCE3FF"/>
<path id="Fill 5" fill-rule="evenodd" clip-rule="evenodd" d="M446.367 425.085H471.106V345.477H446.367V425.085Z" fill="#D7EBFF"/>
<path id="Fill 6" fill-rule="evenodd" clip-rule="evenodd" d="M469.048 414.539H448.425C444.257 414.539 440.878 417.924 440.878 422.1V425.423H476.595V422.1C476.595 417.924 473.216 414.539 469.048 414.539Z" fill="#CCE3FF"/>
<path id="Fill 7" fill-rule="evenodd" clip-rule="evenodd" d="M471.104 344.728H446.369C444.319 344.728 442.657 346.393 442.657 348.447V348.905C442.657 350.96 444.319 352.625 446.369 352.625H471.104C473.154 352.625 474.816 350.96 474.816 348.905V348.447C474.816 346.393 473.154 344.728 471.104 344.728Z" fill="#CCE3FF"/>
<path id="Fill 8" fill-rule="evenodd" clip-rule="evenodd" d="M458.737 54.5282C455.052 54.5282 452.064 57.5215 452.064 61.2136V62.0377C452.064 65.7299 455.052 68.7231 458.737 68.7231C462.422 68.7231 465.409 65.7299 465.409 62.0377V61.2136C465.409 57.5215 462.422 54.5282 458.737 54.5282Z" fill="#CCE3FF"/>
<path id="Fill 9" fill-rule="evenodd" clip-rule="evenodd" d="M468.601 132.492H448.873C446.823 132.492 445.161 134.157 445.161 136.211V136.669C445.161 138.724 446.823 140.389 448.873 140.389H468.601C470.651 140.389 472.313 138.724 472.313 136.669V136.211C472.313 134.157 470.651 132.492 468.601 132.492Z" fill="#CCE3FF"/>
<path id="Fill 10" fill-rule="evenodd" clip-rule="evenodd" d="M465.907 140.389H451.566C450.22 140.389 449.129 141.482 449.129 142.83V143.131C449.129 144.48 450.22 145.573 451.566 145.573H465.907C467.254 145.573 468.344 144.48 468.344 143.131V142.83C468.344 141.482 467.254 140.389 465.907 140.389Z" fill="#CCE3FF"/>
<path id="Fill 11" fill-rule="evenodd" clip-rule="evenodd" d="M477.68 80.1654L466.845 132.491H450.633L439.793 80.1654H477.68Z" fill="#ECF6FF"/>
<path id="Fill 12" fill-rule="evenodd" clip-rule="evenodd" d="M480.97 82.9388L476.219 73.573H441.253L436.503 82.9388H480.97Z" fill="#CCE3FF"/>
</g>
</g>
</g>
<g id="Person / Man / 2">
<g id="Man / Head / 1">
<g id="Group 30">
<path id="Fill 1_6" fill-rule="evenodd" clip-rule="evenodd" d="M288.597 142.109C288.597 147.614 285.065 152.077 280.707 152.077C276.35 152.077 272.817 147.614 272.817 142.109C272.817 136.604 276.35 132.142 280.707 132.142C285.065 132.142 288.597 136.604 288.597 142.109Z" fill="#19141E"/>
<g id="Face color">
<path id="Face" d="M269.926 181.596L269.596 170.148C269.596 170.148 283.449 171.255 286.412 169.709C286.412 169.709 290.034 150.969 285.714 140.592L285.627 140.188L256.393 136.754L254.754 153.6C253.77 150.683 245.642 147.376 243.518 151.553C238.914 160.604 255.376 166.698 255.376 166.698L253.704 181.733" fill="#E576C6"/>
</g>
<path id="Fill 5_2" opacity="0.398926" fill-rule="evenodd" clip-rule="evenodd" d="M269.596 170.147L260.254 168.136L269.551 174.443L269.596 170.147Z" fill="black"/>
<path id="Fill 7_2" fill-rule="evenodd" clip-rule="evenodd" d="M277.063 153.386L280.291 161.311L276.423 161.361L277.063 153.386Z" fill="#405FD3"/>
<path id="Fill 9_2" fill-rule="evenodd" clip-rule="evenodd" d="M273.621 153.691C273.813 154.758 273.108 155.78 272.045 155.973C270.982 156.166 269.965 155.457 269.773 154.39C269.58 153.323 270.286 152.301 271.349 152.108C272.412 151.915 273.429 152.624 273.621 153.691Z" fill="#0D0B6D"/>
<path id="Fill 11_2" fill-rule="evenodd" clip-rule="evenodd" d="M284.468 153.691C284.66 154.758 283.954 155.78 282.892 155.973C281.829 156.166 280.812 155.457 280.619 154.39C280.427 153.323 281.133 152.301 282.196 152.108C283.258 151.915 284.275 152.624 284.468 153.691Z" fill="#0D0B6D"/>
<path id="Hair" d="M256.925 156.475C254.153 151.711 250.143 150.259 248.343 149.833C247.625 147.749 247.078 145.332 246.693 142.762C245.662 135.883 250.642 129.606 254.665 127.804C258.738 125.98 265.759 123.453 276.037 126.884C282.947 129.192 287.364 123.666 291.43 126.026C298.378 130.06 291.915 147.721 274.297 143.234C261.695 140.025 261.371 140.83 261.263 143.163C260.914 150.704 259.743 155.14 256.925 156.475Z" fill="#2F2F3D"/>
<g id="Group 21">
<path id="Fill 18" fill-rule="evenodd" clip-rule="evenodd" d="M271.689 161.655C271.689 161.655 272.931 163.921 275.615 163.868L271.689 161.655Z" fill="white"/>
<path id="Stroke 20 (Stroke)" fill-rule="evenodd" clip-rule="evenodd" d="M271.018 162.025C271.017 162.025 271.017 162.025 271.689 161.655C272.361 161.285 272.361 161.285 272.361 161.285L272.36 161.284L272.36 161.283L272.359 161.282C272.359 161.282 272.359 161.282 272.359 161.282C272.359 161.282 272.359 161.282 272.359 161.282L272.364 161.291C272.37 161.3 272.38 161.317 272.395 161.341C272.424 161.388 272.472 161.459 272.538 161.548C272.671 161.725 272.874 161.964 273.147 162.201C273.69 162.671 274.495 163.122 275.6 163.1L275.631 164.636C274.052 164.667 272.893 164.011 272.144 163.362C271.771 163.039 271.496 162.715 271.312 162.469C271.22 162.346 271.149 162.241 271.101 162.164C271.076 162.126 271.057 162.094 271.043 162.07C271.036 162.059 271.031 162.049 271.026 162.041L271.021 162.031L271.019 162.028L271.018 162.026L271.018 162.025Z" fill="#252535"/>
</g>
<path id="Stroke 22 (Stroke)" fill-rule="evenodd" clip-rule="evenodd" d="M271.652 150.061C269.606 150.061 267.945 151.727 267.945 153.786C267.945 155.844 269.606 157.51 271.652 157.51C273.698 157.51 275.359 155.844 275.359 153.786C275.359 151.727 273.698 150.061 271.652 150.061ZM266.412 153.786C266.412 150.882 268.756 148.525 271.652 148.525C274.547 148.525 276.892 150.882 276.892 153.786C276.892 156.69 274.547 159.046 271.652 159.046C268.756 159.046 266.412 156.69 266.412 153.786Z" fill="#252535"/>
<path id="Stroke 24 (Stroke)" fill-rule="evenodd" clip-rule="evenodd" d="M282.917 150.061C280.871 150.061 279.209 151.727 279.209 153.786C279.209 155.844 280.871 157.51 282.917 157.51C284.962 157.51 286.624 155.844 286.624 153.786C286.624 151.727 284.962 150.061 282.917 150.061ZM277.676 153.786C277.676 150.882 280.021 148.525 282.917 148.525C285.812 148.525 288.157 150.882 288.157 153.786C288.157 156.69 285.812 159.046 282.917 159.046C280.021 159.046 277.676 156.69 277.676 153.786Z" fill="#252535"/>
<path id="Stroke 26 (Stroke)" fill-rule="evenodd" clip-rule="evenodd" d="M276.144 153.226H278.078V154.762H276.144V153.226Z" fill="#252535"/>
<path id="Stroke 28 (Stroke)" fill-rule="evenodd" clip-rule="evenodd" d="M256.126 153.018H267.178V154.554H256.126V153.018Z" fill="#252535"/>
</g>
</g>
<g id="Man / Legs / 1">
<g id="Group 23">
<g id="Shoes">
<path id="Shoes_2" fill-rule="evenodd" clip-rule="evenodd" d="M281.43 438.899L281.539 429.51L269.466 423.413L267.714 450.253H309.542C302.425 442.215 281.43 438.899 281.43 438.899ZM227.85 439.265L227.959 428.72L220.088 435.146L213.754 438.682L211.664 450.253H240.293C236.693 440.423 227.85 439.265 227.85 439.265Z" fill="#0D0B6D"/>
</g>
<g id="Leg skin">
<path id="Skin" fill-rule="evenodd" clip-rule="evenodd" d="M227.96 428.72L215.887 425.082L213.754 438.682L227.851 439.265L227.96 428.72ZM281.54 429.51L269.467 425.873L268.493 438.316L281.431 438.899L281.54 429.51Z" fill="#E576C6"/>
</g>
<g id="Pants">
<path id="Pants_2" d="M283.269 426.432L282.991 435.146H267.065L267.345 426.406C265.561 425.688 264.286 423.962 264.242 421.923L261.679 291.405L233.981 423.174C233.591 425.028 232.22 426.467 230.478 426.998L229.437 435.146H212.739L214.176 426.15C212.786 425.069 211.98 423.292 212.257 421.393L237.758 246.75L260.802 246.75L260.801 246.683H288.712L287.039 421.679C287.015 423.98 285.419 425.905 283.269 426.432Z" fill="#2F2F3D"/>
</g>
<path id="Fill 15" opacity="0.197824" fill-rule="evenodd" clip-rule="evenodd" d="M261.538 293.473L266.425 271.75L262.748 337.609L261.538 293.473Z" fill="black"/>
<g id="Pants line">
<path id="Pants line_2" d="M243.72 246.914L246.395 247.351L217.227 425.325L214.544 424.876L243.72 246.914Z" fill="#EFEFEF"/>
</g>
</g>
</g>
<g id="Man / Body / 5">
<g id="Man / Body / 7">
<g id="Group 29">
<g id="T-shirt">
<path id="T-Shirt" d="M297.915 212.051L290.53 216.002L288.702 246.995H237.737L236.882 215.726L220.767 203.58C220.767 203.58 228.367 188.22 241.369 182.106C244.757 180.517 249.019 179.672 253.277 179.269C261.815 178.458 270.326 179.399 271.71 179.568L271.905 179.591C272.147 179.664 272.389 179.737 272.622 179.81C272.626 179.81 272.63 179.814 272.633 179.814C273.323 180.029 273.975 180.236 274.596 180.44C283.222 183.285 285.951 185.589 290.784 192.409C295.378 198.891 297.915 212.051 297.915 212.051Z" fill="#FCBDA4"/>
</g>
<path id="Stroke 6" opacity="0.200219" d="M236.882 215.724L240.969 218.513L250.796 207.012" stroke="black"/>
<path id="Fill 16" fill-rule="evenodd" clip-rule="evenodd" d="M277.094 237.944C277.094 237.944 278.704 238.355 278.734 239.369C278.734 239.657 268.927 241.515 268.927 241.515L271.062 241.642L273.281 241.534C273.281 241.534 274.435 241.749 274.5 242.709C274.523 243.089 272.48 243.497 270.104 243.808C266.41 244.295 263.754 243.865 261.155 243.155C260.937 243.093 260.726 243.04 260.523 242.986L262.635 229.381C263.344 230.03 264.685 231.182 270.457 232.625C271.614 232.913 275.5 232.967 275.5 232.967C276.642 233.132 279.041 233.355 279.206 234.703C279.248 235.037 278.83 235.398 278.83 235.398C278.83 235.398 280.336 235.502 280.428 236.869C280.467 237.406 277.094 237.944 277.094 237.944Z" fill="#18181C"/>
<path id="Fill 18_2" fill-rule="evenodd" clip-rule="evenodd" d="M293.809 256.89H258.156L266.152 207.581H301.805L293.809 256.89Z" fill="#18181C"/>
<path id="Fill 20" fill-rule="evenodd" clip-rule="evenodd" d="M295.725 256.89H260.073L268.068 207.581H303.721L295.725 256.89Z" fill="#5E93D1"/>
<g id="Skin color">
<path id="Skin_2" fill-rule="evenodd" clip-rule="evenodd" d="M253.277 179.269C254.533 181.254 258.492 186.204 266.988 186.707C277.136 187.302 274.834 181.035 274.596 180.44C274.581 180.409 274.573 180.394 274.573 180.394C274.573 180.394 273.818 180.14 272.633 179.814C272.632 179.814 272.63 179.813 272.628 179.812C272.626 179.811 272.624 179.81 272.622 179.81C272.343 179.733 272.036 179.653 271.71 179.568C270.326 179.399 261.815 178.458 253.277 179.269ZM251.925 227.437L254.399 226.589C254.399 226.589 255.986 225.967 258.665 225.472C259.655 225.289 260.484 225.256 261.353 225.221H261.353H261.353C261.961 225.197 262.588 225.173 263.302 225.095L262.712 228.893C262.601 228.974 262.501 229.07 262.405 229.173C262.459 229.219 262.513 229.269 262.572 229.323L262.572 229.323L262.635 229.381C263.344 230.03 264.685 231.182 270.457 232.625C271.614 232.913 275.5 232.967 275.5 232.967C275.585 232.979 275.676 232.992 275.773 233.005L275.774 233.005C276.986 233.172 279.053 233.455 279.206 234.703C279.248 235.037 278.83 235.398 278.83 235.398C278.83 235.398 280.336 235.502 280.428 236.869C280.467 237.406 277.094 237.944 277.094 237.944C277.094 237.944 278.704 238.355 278.735 239.369C278.735 239.657 268.928 241.515 268.928 241.515L271.063 241.642L273.281 241.534C273.281 241.534 274.435 241.749 274.5 242.709C274.523 243.089 272.48 243.497 270.104 243.808C266.41 244.295 263.754 243.865 261.156 243.155C260.996 243.11 260.841 243.069 260.69 243.03L260.524 242.986C260.139 242.885 259.785 242.796 259.451 242.711L259.45 242.711C257.459 242.209 256.161 241.882 253.215 240.275C252.897 240.101 252.547 239.891 252.183 239.661C243.351 240.501 216.581 242.567 213.897 237.041C208.591 226.111 222.556 204.961 222.556 204.961L238.014 215.792L233.102 224.154L251.925 227.437ZM287.425 256.733H295.634L297.475 245.376L301.25 261.534C303.579 264.212 306.269 267.373 306.676 268.151C307.413 269.562 308.777 276.548 308.711 277.928C308.646 279.308 304.398 285.51 304.398 285.51C301.762 284.88 303.484 281.678 303.484 281.678C303.484 281.678 301.123 283.623 300.141 283.59C290.897 283.283 291.392 278.723 291.611 278.152C292.102 276.869 294.569 278.336 294.569 278.336C294.569 278.336 290.284 269.864 290.84 263.391C289.88 261.574 288.699 259.293 287.425 256.733Z" fill="#E576C6"/>
</g>
<path id="Stroke 11" opacity="0.199382" d="M296.549 265.977C296.549 265.977 297.846 270.752 302.298 272.24C303.854 272.76 303.465 278.901 307.281 278.166" stroke="black" stroke-width="3"/>
<path id="Fill 27" fill-rule="evenodd" clip-rule="evenodd" d="M271.398 211.559C271.238 212.375 270.766 212.97 270.342 212.887C269.919 212.804 269.705 212.074 269.864 211.258C270.024 210.442 270.496 209.847 270.92 209.93C271.343 210.013 271.557 210.742 271.398 211.559Z" fill="#020101"/>
</g>
</g>
</g>
</g>
</g>
</svg>
