<svg width="642" height="372" viewBox="0 0 642 372" fill="none" xmlns="http://www.w3.org/2000/svg">
<g id="Illustration 22">
<g id="Background">
<g id="Background Object / Window / 1">
<g id="Group 25">
<path id="Stroke 1 (Stroke)" fill-rule="evenodd" clip-rule="evenodd" d="M477.249 181.529V33.6976H483.231V181.529H477.249Z" fill="#ECF6FF"/>
<path id="Stroke 3 (Stroke)" fill-rule="evenodd" clip-rule="evenodd" d="M475.735 182.007V28.3972H480.358V182.007H475.735Z" fill="#DCEEFF"/>
<path id="Stroke 5 (Stroke)" fill-rule="evenodd" clip-rule="evenodd" d="M525.236 182.38V27.7365H530.674V182.38H525.236Z" fill="#B6D4FF"/>
<path id="Stroke 8 (Stroke)" fill-rule="evenodd" clip-rule="evenodd" d="M431.019 181.001V29.0003H437.001V181.001H431.019Z" fill="#ECF6FF"/>
<path id="Fill 11" fill-rule="evenodd" clip-rule="evenodd" d="M428.279 182.38H526.272V27.7363H428.279V182.38ZM434.262 176.398H520.29V33.7191H434.262V176.398Z" fill="#DCEEFF"/>
<path id="Fill 12" fill-rule="evenodd" clip-rule="evenodd" d="M409.254 190.003H530.632V182.38H409.254V190.003Z" fill="#CCE3FF"/>
<path id="Fill 13" fill-rule="evenodd" clip-rule="evenodd" d="M502.407 190.003H532.473V182.38H502.407V190.003Z" fill="#B6D4FF"/>
<path id="Stroke 14 (Stroke)" fill-rule="evenodd" clip-rule="evenodd" d="M526.272 84.1077H435.719V79.4849H526.272V84.1077Z" fill="#DCEEFF"/>
<path id="Stroke 16 (Stroke)" fill-rule="evenodd" clip-rule="evenodd" d="M526.272 132.143H435.719V127.52H526.272V132.143Z" fill="#DCEEFF"/>
<path id="Fill 18" fill-rule="evenodd" clip-rule="evenodd" d="M497.521 173.505C497.096 177.07 495.291 180.213 492.653 182.38H475.405C472.767 180.213 470.961 177.07 470.534 173.505H497.521Z" fill="#B6D4FF"/>
<path id="Fill 20" fill-rule="evenodd" clip-rule="evenodd" d="M497.521 166.095C496.718 172.833 490.983 178.06 484.028 178.06C477.073 178.06 471.338 172.833 470.535 166.095H497.521Z" fill="#B6D4FF"/>
<path id="Fill 22" fill-rule="evenodd" clip-rule="evenodd" d="M446.89 176.79L449.818 148.254H458.975L461.904 176.79C462.21 179.781 459.864 182.38 456.858 182.38H451.936C448.93 182.38 446.583 179.781 446.89 176.79Z" fill="#CCE3FF"/>
</g>
</g>
<g id="Background Object / Window / 1_2">
<g id="Group 25_2">
<path id="Stroke 1 (Stroke)_2" fill-rule="evenodd" clip-rule="evenodd" d="M135.68 181.529V33.6976H129.698V181.529H135.68Z" fill="#ECF6FF"/>
<path id="Stroke 3 (Stroke)_2" fill-rule="evenodd" clip-rule="evenodd" d="M137.194 182.007V28.3972H132.571V182.007H137.194Z" fill="#DCEEFF"/>
<path id="Stroke 5 (Stroke)_2" fill-rule="evenodd" clip-rule="evenodd" d="M87.6936 182.38V27.7365H82.255V182.38H87.6936Z" fill="#B6D4FF"/>
<path id="Stroke 8 (Stroke)_2" fill-rule="evenodd" clip-rule="evenodd" d="M181.91 181.001V29.0003H175.928V181.001H181.91Z" fill="#ECF6FF"/>
<path id="Fill 11_2" fill-rule="evenodd" clip-rule="evenodd" d="M184.65 182.38H86.6569V27.7363H184.65V182.38ZM178.668 176.398H92.6394V33.7191H178.668V176.398Z" fill="#DCEEFF"/>
<path id="Fill 12_2" fill-rule="evenodd" clip-rule="evenodd" d="M203.675 190.003H82.297V182.38H203.675V190.003Z" fill="#CCE3FF"/>
<path id="Fill 13_2" fill-rule="evenodd" clip-rule="evenodd" d="M110.522 190.003H80.4563V182.38H110.522V190.003Z" fill="#B6D4FF"/>
<path id="Stroke 14 (Stroke)_2" fill-rule="evenodd" clip-rule="evenodd" d="M86.657 84.1077H177.21V79.4849H86.657V84.1077Z" fill="#DCEEFF"/>
<path id="Stroke 16 (Stroke)_2" fill-rule="evenodd" clip-rule="evenodd" d="M86.657 132.143H177.21V127.52H86.657V132.143Z" fill="#DCEEFF"/>
<path id="Fill 18_2" fill-rule="evenodd" clip-rule="evenodd" d="M115.408 173.505C115.833 177.07 117.638 180.213 120.276 182.38H137.525C140.162 180.213 141.968 177.07 142.395 173.505H115.408Z" fill="#B6D4FF"/>
<path id="Fill 20_2" fill-rule="evenodd" clip-rule="evenodd" d="M115.409 166.095C116.212 172.833 121.946 178.06 128.901 178.06C135.856 178.06 141.591 172.833 142.394 166.095H115.409Z" fill="#B6D4FF"/>
<path id="Fill 22_2" fill-rule="evenodd" clip-rule="evenodd" d="M166.039 176.79L163.111 148.254H153.954L151.026 176.79C150.719 179.781 153.065 182.38 156.072 182.38H160.993C163.999 182.38 166.346 179.781 166.039 176.79Z" fill="#CCE3FF"/>
</g>
</g>
<g id="Background Object / Pluteus / 5">
<g id="Group 42">
<path id="Fill 1" fill-rule="evenodd" clip-rule="evenodd" d="M310.146 167.83H343.268L347.74 123.132H314.619L310.146 167.83Z" fill="#DCEEFF"/>
<path id="Stroke 2 (Stroke)" fill-rule="evenodd" clip-rule="evenodd" d="M314.004 122.452H348.492L343.883 168.51H309.395L314.004 122.452ZM315.234 123.812L310.897 167.15H342.653L346.989 123.812H315.234Z" fill="#DCEEFF"/>
<path id="Fill 4" fill-rule="evenodd" clip-rule="evenodd" d="M308.358 167.83H342.096L346.569 123.132H312.831L308.358 167.83Z" fill="white"/>
<path id="Stroke 5 (Stroke)_3" fill-rule="evenodd" clip-rule="evenodd" d="M312.215 122.452H347.32L342.711 168.51H307.607L312.215 122.452ZM313.446 123.812L309.109 167.15H341.481L345.817 123.812H313.446Z" fill="#DCEEFF"/>
<path id="Fill 7" fill-rule="evenodd" clip-rule="evenodd" d="M314.82 161.928H336.815L340.107 129.034H318.111L314.82 161.928Z" fill="#DCEEFF"/>
<path id="Fill 8" fill-rule="evenodd" clip-rule="evenodd" d="M288.884 159.208H287.394C280.446 159.208 274.813 153.573 274.813 146.622H301.464C301.464 153.573 295.831 159.208 288.884 159.208Z" fill="#ECF6FF"/>
<path id="Fill 10" fill-rule="evenodd" clip-rule="evenodd" d="M275.23 159.208C275.23 160.71 276.447 161.928 277.949 161.928H302.416V156.487H277.949C276.447 156.487 275.23 157.705 275.23 159.208Z" fill="#DCEEFF"/>
<path id="Fill 12_3" fill-rule="evenodd" clip-rule="evenodd" d="M291.686 159.208C291.686 160.078 292.391 160.783 293.26 160.783H302.35C302.387 160.783 302.416 160.753 302.416 160.717V157.698C302.416 157.662 302.387 157.633 302.35 157.633H293.26C292.391 157.633 291.686 158.338 291.686 159.208Z" fill="#ECF6FF"/>
<path id="Fill 14" fill-rule="evenodd" clip-rule="evenodd" d="M271.815 161.928V167.369H298.52C300.022 167.369 301.24 166.151 301.24 164.648C301.24 163.146 300.022 161.928 298.52 161.928H271.815Z" fill="#DCEEFF"/>
<path id="Fill 16" fill-rule="evenodd" clip-rule="evenodd" d="M271.815 163.089V166.208H282.795C283.656 166.208 284.354 165.51 284.354 164.648C284.354 163.787 283.656 163.089 282.795 163.089H271.815Z" fill="#ECF6FF"/>
<path id="Fill 18_3" fill-rule="evenodd" clip-rule="evenodd" d="M271.815 265.283H344.901V190.036H271.815V265.283Z" fill="#CCE3FF"/>
<path id="Fill 20_3" fill-rule="evenodd" clip-rule="evenodd" d="M340.195 265.283H350.618V192.179H340.195V265.283Z" fill="#DCEEFF"/>
<path id="Fill 21" fill-rule="evenodd" clip-rule="evenodd" d="M262.788 193.34H350.618V173.855H262.788V193.34Z" fill="#DCEEFF"/>
<path id="Fill 22_3" fill-rule="evenodd" clip-rule="evenodd" d="M252.46 173.855H362.062V167.177H252.46V173.855Z" fill="#CCE3FF"/>
<path id="Fill 23" fill-rule="evenodd" clip-rule="evenodd" d="M350.618 265.283H355.703V173.855H350.618V265.283Z" fill="#B6D4FF"/>
<path id="Fill 24" fill-rule="evenodd" clip-rule="evenodd" d="M273.21 265.283H276.521V193.413H273.21V265.283Z" fill="#B6D4FF"/>
<path id="Fill 25" fill-rule="evenodd" clip-rule="evenodd" d="M354.672 173.855H365.203V167.177H354.672V173.855Z" fill="#B6D4FF"/>
<path id="Fill 26" fill-rule="evenodd" clip-rule="evenodd" d="M262.788 265.283H273.21V189.947H262.788V265.283Z" fill="#DCEEFF"/>
<path id="Fill 27" fill-rule="evenodd" clip-rule="evenodd" d="M259.872 265.283H273.21V246.859H259.872V265.283Z" fill="#DCEEFF"/>
<path id="Fill 28" fill-rule="evenodd" clip-rule="evenodd" d="M340.195 265.283H353.643V246.859H340.195V265.283Z" fill="#DCEEFF"/>
<path id="Fill 29" fill-rule="evenodd" clip-rule="evenodd" d="M295.03 262.442C295.03 262.442 283.032 255.405 297.491 234.933C297.491 234.933 304.933 243.627 307.799 233.326C307.799 233.326 315.91 246.19 310.644 253.959" fill="#ECF6FF"/>
<path id="Fill 30" fill-rule="evenodd" clip-rule="evenodd" d="M321.629 263.156C321.629 263.156 332.431 254.485 323.685 237.031C323.685 237.031 311.146 250.423 307.977 225.603C307.977 225.603 298.82 244.342 304.573 253.336" fill="#ECF6FF"/>
<path id="Fill 31" fill-rule="evenodd" clip-rule="evenodd" d="M292.191 265.283H324.873V258.505H292.191V265.283Z" fill="#DCEEFF"/>
<path id="Fill 32" fill-rule="evenodd" clip-rule="evenodd" d="M323.273 254.668L321.032 248.304L294.284 258.5L296.526 264.864L323.273 254.668Z" fill="#DCEEFF"/>
<path id="Fill 33" fill-rule="evenodd" clip-rule="evenodd" d="M321.645 265.155L323.991 258.061L297.832 248.699L295.486 255.793L321.645 265.155Z" fill="#DCEEFF"/>
<path id="Fill 34" fill-rule="evenodd" clip-rule="evenodd" d="M352.861 265.283H358.703V246.859H352.861V265.283Z" fill="#B6D4FF"/>
<path id="Stroke 35 (Stroke)" fill-rule="evenodd" clip-rule="evenodd" d="M283.331 207.579H292.946V264.461H283.331V207.579ZM284.69 208.938V263.101H291.587V208.938H284.69Z" fill="#B6D4FF"/>
<path id="Stroke 36 (Stroke)" fill-rule="evenodd" clip-rule="evenodd" d="M291.587 207.579H301.203V264.461H291.587V207.579ZM292.947 208.938V263.101H299.843V208.938H292.947Z" fill="#B6D4FF"/>
<path id="Stroke 37 (Stroke)" fill-rule="evenodd" clip-rule="evenodd" d="M299.843 207.579H309.459V264.461H299.843V207.579ZM301.203 208.938V263.101H308.099V208.938H301.203Z" fill="#B6D4FF"/>
<path id="Stroke 38 (Stroke)" fill-rule="evenodd" clip-rule="evenodd" d="M308.099 207.579H317.715V264.461H308.099V207.579ZM309.459 208.938V263.101H316.355V208.938H309.459Z" fill="#B6D4FF"/>
<path id="Stroke 39 (Stroke)" fill-rule="evenodd" clip-rule="evenodd" d="M316.355 207.579H325.971V264.461H316.355V207.579ZM317.715 208.938V263.101H324.611V208.938H317.715Z" fill="#B6D4FF"/>
<path id="Stroke 40 (Stroke)" fill-rule="evenodd" clip-rule="evenodd" d="M324.611 207.579H334.227V264.461H324.611V207.579ZM325.971 208.938V263.101H332.867V208.938H325.971Z" fill="#B6D4FF"/>
</g>
</g>
<g id="Background Object / Chair / 1">
<g id="Group 14">
<path id="Fill 1_2" fill-rule="evenodd" clip-rule="evenodd" d="M182.912 228.949V229.4C182.912 233.166 179.99 236.217 176.389 236.217H125.292C117.411 236.217 111.345 228.655 112.433 220.182L118.202 172.969C118.701 169.059 121.78 166.149 125.417 166.149H140.561C144.196 166.149 147.274 169.059 147.777 172.969L153.546 220.182C153.59 220.519 153.621 220.856 153.639 221.191L153.67 221.185C153.67 221.185 154.738 228.949 164.656 228.949H182.912Z" fill="#DCEEFF"/>
<path id="Fill 4_2" fill-rule="evenodd" clip-rule="evenodd" d="M128.516 289.399C128.516 291.807 126.563 293.759 124.155 293.759C121.747 293.759 119.795 291.807 119.795 289.399C119.795 286.991 121.747 285.039 124.155 285.039C126.563 285.039 128.516 286.991 128.516 289.399Z" fill="#B6D4FF"/>
<path id="Fill 6" fill-rule="evenodd" clip-rule="evenodd" d="M168.303 290.273H125.213C123.563 290.273 122.212 288.923 122.212 287.273C122.212 285.622 123.563 284.272 125.213 284.272H168.303C169.954 284.272 171.304 285.622 171.304 287.273C171.304 288.923 169.954 290.273 168.303 290.273Z" fill="#CCE3FF"/>
<path id="Fill 8_2" fill-rule="evenodd" clip-rule="evenodd" d="M144.547 288.846H148.969V236.035H144.547V288.846Z" fill="#CCE3FF"/>
<path id="Fill 10_2" fill-rule="evenodd" clip-rule="evenodd" d="M161.91 236.035L146.758 242.936L131.606 236.035H161.91Z" fill="#CCE3FF"/>
<path id="Fill 11_3" fill-rule="evenodd" clip-rule="evenodd" d="M147.093 290.273H141.502C139.851 290.273 138.501 288.923 138.501 287.273C138.501 285.622 139.851 284.272 141.502 284.272H147.093C148.744 284.272 150.094 285.622 150.094 287.273C150.094 288.923 148.744 290.273 147.093 290.273Z" fill="#B6D4FF"/>
<path id="Fill 12_4" fill-rule="evenodd" clip-rule="evenodd" d="M143.426 289.399C143.426 291.807 141.473 293.759 139.065 293.759C136.657 293.759 134.705 291.807 134.705 289.399C134.705 286.991 136.657 285.039 139.065 285.039C141.473 285.039 143.426 286.991 143.426 289.399Z" fill="#B6D4FF"/>
<path id="Fill 13_3" fill-rule="evenodd" clip-rule="evenodd" d="M174.01 289.399C174.01 291.807 172.058 293.759 169.65 293.759C167.242 293.759 165.29 291.807 165.29 289.399C165.29 286.991 167.242 285.039 169.65 285.039C172.058 285.039 174.01 286.991 174.01 289.399Z" fill="#B6D4FF"/>
</g>
</g>
<g id="Background Object / Flower / 1">
<g id="Group 24">
<path id="Fill 1_3" fill-rule="evenodd" clip-rule="evenodd" d="M84.6551 232.04C84.6551 237.03 81.6237 241.076 77.8841 241.076C74.1445 241.076 71.113 237.03 71.113 232.04C71.113 227.049 74.1445 223.003 77.8841 223.003C81.6237 223.003 84.6551 227.049 84.6551 232.04Z" fill="#CCE3FF"/>
<path id="Stroke 3 (Stroke)_3" fill-rule="evenodd" clip-rule="evenodd" d="M79.1586 232.499V279.502H76.7112V232.499H79.1586Z" fill="#DCEEFF"/>
<path id="Fill 5" fill-rule="evenodd" clip-rule="evenodd" d="M70.6427 245.314C73.8401 248.514 74.4882 253.055 72.0901 255.455C69.692 257.855 65.1559 257.207 61.9583 254.006C58.7609 250.806 58.113 246.265 60.511 243.865C62.9092 241.465 67.4452 242.113 70.6427 245.314Z" fill="#CCE3FF"/>
<path id="Fill 8_3" fill-rule="evenodd" clip-rule="evenodd" d="M93.4734 251.889C96.0517 254.47 95.3551 259.352 91.9172 262.793C88.4794 266.234 83.6023 266.931 81.0239 264.35" fill="#CCE3FF"/>
<path id="Stroke 10 (Stroke)" fill-rule="evenodd" clip-rule="evenodd" d="M77.2683 267.481L89.1328 255.572L90.8667 257.299L79.0021 269.209L77.2683 267.481Z" fill="#DCEEFF"/>
<path id="Stroke 12 (Stroke)" fill-rule="evenodd" clip-rule="evenodd" d="M77.0403 252.753L85.7108 244.177L87.4319 245.916L78.7614 254.493L77.0403 252.753Z" fill="#DCEEFF"/>
<path id="Stroke 14 (Stroke)_3" fill-rule="evenodd" clip-rule="evenodd" d="M77.0856 273.901L68.0276 264.733L69.7686 263.013L78.8266 272.181L77.0856 273.901Z" fill="#DCEEFF"/>
<path id="Stroke 16 (Stroke)_3" fill-rule="evenodd" clip-rule="evenodd" d="M77.0135 262.32L64.905 250.056L66.6466 248.337L78.755 260.601L77.0135 262.32Z" fill="#DCEEFF"/>
<path id="Fill 18_4" fill-rule="evenodd" clip-rule="evenodd" d="M81.5657 295.645H74.304C68.7264 295.645 64.1631 291.077 64.1631 285.494V275.943H91.7066V285.494C91.7066 291.077 87.1432 295.645 81.5657 295.645Z" fill="#ECF6FF"/>
<path id="Stroke 20 (Stroke)" fill-rule="evenodd" clip-rule="evenodd" d="M64.1631 280.028H91.7066V282.475H64.1631V280.028Z" fill="#DCEEFF"/>
<path id="Stroke 22 (Stroke)" fill-rule="evenodd" clip-rule="evenodd" d="M64.1631 285.353H91.7066V287.8H64.1631V285.353Z" fill="#DCEEFF"/>
</g>
</g>
<g id="Background Object / Flower / 2">
<g id="Group 33">
<path id="Fill 1_4" fill-rule="evenodd" clip-rule="evenodd" d="M517.668 247.013C518.342 251.574 516.053 255.464 516.053 255.464C516.053 255.464 512.673 251.959 512 247.398C511.326 242.837 513.615 238.947 513.615 238.947C513.615 238.947 516.995 242.452 517.668 247.013Z" fill="#E9F6FF"/>
<path id="Fill 3" fill-rule="evenodd" clip-rule="evenodd" d="M516.683 249.992C519.694 254.095 519.585 258.284 519.585 258.284C519.585 258.284 514.595 255.819 511.584 251.716C508.573 247.613 508.682 243.425 508.682 243.425C508.682 243.425 513.673 245.889 516.683 249.992Z" fill="#E9F6FF"/>
<path id="Fill 5_2" fill-rule="evenodd" clip-rule="evenodd" d="M520.463 247.509C519.664 252.06 516.187 255.521 516.187 255.521C516.187 255.521 514.007 251.602 514.806 247.051C515.606 242.499 519.083 239.038 519.083 239.038C519.083 239.038 521.263 242.957 520.463 247.509Z" fill="#E9F6FF"/>
<path id="Fill 7_2" fill-rule="evenodd" clip-rule="evenodd" d="M522.971 250.806C520.451 255.059 515.766 257.785 515.766 257.785C515.766 257.785 515.165 253.616 517.685 249.363C520.205 245.11 524.89 242.384 524.89 242.384C524.89 242.384 525.49 246.553 522.971 250.806Z" fill="#E9F6FF"/>
<path id="Fill 9" fill-rule="evenodd" clip-rule="evenodd" d="M540.482 264.378C540.482 273.39 529.887 280.697 516.817 280.697C503.747 280.697 493.152 273.39 493.152 264.378C493.152 255.365 503.747 248.058 516.817 248.058C529.887 248.058 540.482 255.365 540.482 264.378Z" fill="#CCE3FF"/>
<path id="Fill 11_4" fill-rule="evenodd" clip-rule="evenodd" d="M531.476 293.468H504.558C500.427 293.468 497.078 290.116 497.078 285.981V284.691C497.078 280.556 500.427 277.204 504.558 277.204H531.476C535.607 277.204 538.956 280.556 538.956 284.691V285.981C538.956 290.116 535.607 293.468 531.476 293.468Z" fill="#DCEEFF"/>
<path id="Stroke 13 (Stroke)" fill-rule="evenodd" clip-rule="evenodd" d="M499.682 248.511L504.044 251.895L502.544 253.828L498.182 250.444L499.682 248.511Z" fill="#B6D4FF"/>
<path id="Stroke 15 (Stroke)" fill-rule="evenodd" clip-rule="evenodd" d="M492.46 272.053L496.386 269.361L497.77 271.38L493.843 274.071L492.46 272.053Z" fill="#B6D4FF"/>
<path id="Stroke 17 (Stroke)" fill-rule="evenodd" clip-rule="evenodd" d="M515.067 271.211L508.292 270.11L508.684 267.695L515.459 268.795L515.067 271.211Z" fill="#B6D4FF"/>
<path id="Stroke 19 (Stroke)" fill-rule="evenodd" clip-rule="evenodd" d="M530.853 248.052L526.763 253.083L524.864 251.539L528.954 246.508L530.853 248.052Z" fill="#B6D4FF"/>
<path id="Stroke 21 (Stroke)" fill-rule="evenodd" clip-rule="evenodd" d="M538.414 255.967L533.942 258.817L532.627 256.753L537.098 253.904L538.414 255.967Z" fill="#B6D4FF"/>
<path id="Stroke 23 (Stroke)" fill-rule="evenodd" clip-rule="evenodd" d="M537.75 276.269L533.496 273.54L534.818 271.48L539.071 274.209L537.75 276.269Z" fill="#B6D4FF"/>
<path id="Stroke 25 (Stroke)" fill-rule="evenodd" clip-rule="evenodd" d="M509.554 253.744L511.578 258.427L509.331 259.398L507.308 254.715L509.554 253.744Z" fill="white"/>
<path id="Stroke 27 (Stroke)" fill-rule="evenodd" clip-rule="evenodd" d="M524.428 265.219L529.292 262.914L530.34 265.126L525.477 267.431L524.428 265.219Z" fill="white"/>
<path id="Stroke 29 (Stroke)" fill-rule="evenodd" clip-rule="evenodd" d="M502.335 257.255L506.965 260.321L505.614 262.362L500.984 259.296L502.335 257.255Z" fill="white"/>
<path id="Stroke 31 (Stroke)" fill-rule="evenodd" clip-rule="evenodd" d="M513.828 282.389L522.203 285.657L530.579 282.389L539.4 285.83L538.511 288.11L530.579 285.016L522.203 288.284L513.828 285.016L505.453 288.284L496.633 284.842L497.522 282.562L505.453 285.657L513.828 282.389Z" fill="#B6D4FF"/>
</g>
</g>
<g id="Background Object / Flower / 3">
<g id="Group 16">
<path id="Fill 1_5" fill-rule="evenodd" clip-rule="evenodd" d="M576.226 228.909C576.226 228.909 563.716 256.547 562.222 286.596C562.222 286.596 569.224 256.145 576.226 228.909Z" fill="#DCEEFF"/>
<path id="Fill 3_2" fill-rule="evenodd" clip-rule="evenodd" d="M553.843 250.148C553.843 250.148 562.847 250.383 564.218 280.432C564.218 280.432 560.376 257.753 553.843 250.148Z" fill="#DCEEFF"/>
<path id="Fill 5_3" fill-rule="evenodd" clip-rule="evenodd" d="M563.038 219.903C563.038 219.903 568.294 251.695 563.12 284.046C563.12 284.046 563.428 250.258 563.038 219.903Z" fill="#DCEEFF"/>
<path id="Fill 8_4" fill-rule="evenodd" clip-rule="evenodd" d="M570.128 292.553H557.128C557.031 292.553 556.933 292.551 556.836 292.548C550.909 292.326 547.611 284.821 550.968 279.407L553.946 274.604H573.31L576.288 279.407C579.645 284.821 576.348 292.326 570.42 292.548C570.323 292.551 570.226 292.553 570.128 292.553Z" fill="#ECF6FF"/>
<path id="Stroke 11 (Stroke)" fill-rule="evenodd" clip-rule="evenodd" d="M577.632 286.874H549.625V284.426H577.632V286.874Z" fill="#B6D4FF"/>
<path id="Stroke 14 (Stroke)_4" fill-rule="evenodd" clip-rule="evenodd" d="M577.072 282.232H550.275V279.785H577.072V282.232Z" fill="#B6D4FF"/>
</g>
</g>
<g id="Background Object / Clock">
<g id="Group 14_2">
<path id="Fill 1_6" fill-rule="evenodd" clip-rule="evenodd" d="M329.688 47.7952C329.688 58.4225 321.073 67.0378 310.445 67.0378C299.818 67.0378 291.203 58.4225 291.203 47.7952C291.203 37.1677 299.818 28.5526 310.445 28.5526C321.073 28.5526 329.688 37.1677 329.688 47.7952Z" fill="#CCE3FF"/>
<path id="Fill 4_3" fill-rule="evenodd" clip-rule="evenodd" d="M325.915 47.7952C325.915 58.4225 317.299 67.0378 306.672 67.0378C296.045 67.0378 287.43 58.4225 287.43 47.7952C287.43 37.1677 296.045 28.5526 306.672 28.5526C317.299 28.5526 325.915 37.1677 325.915 47.7952Z" fill="#DCEEFF"/>
<path id="Fill 6_2" fill-rule="evenodd" clip-rule="evenodd" d="M321.254 47.7938C321.254 55.305 315.577 61.4882 308.282 62.2895C307.753 62.348 307.218 62.3771 306.674 62.3771C298.619 62.3771 292.09 55.8489 292.09 47.7938C292.09 39.7417 298.619 33.2132 306.674 33.2132C307.218 33.2132 307.753 33.2425 308.282 33.301C315.577 34.1024 321.254 40.2855 321.254 47.7938Z" fill="#CCE3FF"/>
<path id="Fill 8_5" fill-rule="evenodd" clip-rule="evenodd" d="M321.254 47.7938C321.254 55.305 315.577 61.4881 308.282 62.2895C300.985 61.4881 295.308 55.305 295.308 47.7938C295.308 40.2855 300.985 34.1024 308.282 33.301C315.577 34.1024 321.254 40.2855 321.254 47.7938Z" fill="#ECF6FF"/>
<path id="Stroke 10 (Stroke)_2" fill-rule="evenodd" clip-rule="evenodd" d="M311.041 50.4443L306.316 40.1395L308.293 39.2328L313.018 49.5376L311.041 50.4443Z" fill="#CCE3FF"/>
<path id="Stroke 12 (Stroke)_2" fill-rule="evenodd" clip-rule="evenodd" d="M301.329 56.1842L311.679 44.9344L313.28 46.4073L302.93 57.6571L301.329 56.1842Z" fill="#CCE3FF"/>
</g>
</g>
</g>
<g id="Person / Woman / 3">
<g id="Man / Legs / 1">
<g id="Group 15">
<g id="Shoes">
<path id="Shoes_2" fill-rule="evenodd" clip-rule="evenodd" d="M206.786 296.386L206.863 289.211L198.234 284.551L196.982 305.063H226.878C221.791 298.92 206.786 296.386 206.786 296.386ZM158.911 296.102L158.993 287.568L149.674 287.094L148.826 295.631L146.659 304.995H168.328C165.604 297.039 158.911 296.102 158.911 296.102Z" fill="#0D0B6D"/>
</g>
<g id="Skin legs">
<path id="Skin" fill-rule="evenodd" clip-rule="evenodd" d="M158.993 287.568L149.855 284.623L148.826 295.63L158.911 296.102L158.993 287.568ZM206.863 289.211L198.234 286.431L197.539 295.941L206.786 296.386L206.863 289.211Z" fill="#E576C6"/>
</g>
<g id="Pants">
<path id="Pants_2" fill-rule="evenodd" clip-rule="evenodd" d="M149.012 213.737H123.728V220.475C123.728 228.849 130.572 235.636 139.015 235.636H146.514H150.162L147.502 292.24H163.22L169.065 235.636H196.368L195.632 292.24H211.618L219.169 234.181C220.521 223.324 212.064 213.737 201.135 213.737H158.042H149.012Z" fill="#19141E"/>
</g>
<g id="Overlay">
<path id="Mask" opacity="0.101632" fill-rule="evenodd" clip-rule="evenodd" d="M123.728 213.737H158.042C165.131 213.737 170.673 219.802 169.978 226.798L163.22 292.24H147.502L150.162 235.636H139.015C130.572 235.636 123.728 228.849 123.728 220.475V213.737Z" fill="white"/>
</g>
</g>
</g>
<g id="Man / Body / 7">
<g id="Group 29">
<g id="T-shirt">
<path id="T-Shirt" d="M166.523 189.05L161.283 191.848L159.986 213.795H123.822L123.215 191.652L111.781 183.051C111.781 183.051 117.173 172.174 126.399 167.845C128.803 166.719 131.827 166.121 134.849 165.835C140.907 165.261 146.946 165.928 147.928 166.047L148.067 166.064C148.238 166.115 148.41 166.167 148.575 166.219C148.578 166.219 148.581 166.221 148.583 166.221C149.073 166.374 149.535 166.52 149.976 166.665C156.097 168.68 158.033 170.311 161.462 175.141C164.723 179.731 166.523 189.05 166.523 189.05Z" fill="#FCBDA4"/>
</g>
<path id="Stroke 6" opacity="0.200219" d="M123.215 191.651L126.116 193.626L133.089 185.482" stroke="black" stroke-width="5"/>
<path id="Fill 16_2" fill-rule="evenodd" clip-rule="evenodd" d="M151.749 207.386C151.749 207.386 152.891 207.677 152.913 208.395C152.913 208.599 145.954 209.915 145.954 209.915L147.469 210.005L149.043 209.929C149.043 209.929 149.862 210.081 149.908 210.761C149.924 211.03 148.475 211.318 146.789 211.538C144.167 211.884 142.283 211.579 140.439 211.076C140.284 211.033 140.135 210.995 139.991 210.956L141.489 201.322C141.992 201.782 142.944 202.597 147.039 203.62C147.86 203.824 150.617 203.862 150.617 203.862C151.428 203.979 153.13 204.136 153.247 205.091C153.277 205.328 152.981 205.583 152.981 205.583C152.981 205.583 154.049 205.657 154.114 206.625C154.142 207.005 151.749 207.386 151.749 207.386Z" fill="#18181C"/>
<path id="Fill 18_5" fill-rule="evenodd" clip-rule="evenodd" d="M163.609 220.803H138.311L143.985 185.885H169.283L163.609 220.803Z" fill="#18181C"/>
<path id="Fill 20_4" fill-rule="evenodd" clip-rule="evenodd" d="M164.969 220.803H139.671L145.344 185.885H170.642L164.969 220.803Z" fill="#5E93D1"/>
<g id="Skin color">
<path id="Skin_2" fill-rule="evenodd" clip-rule="evenodd" d="M134.849 165.835C135.74 167.241 138.549 170.746 144.578 171.102C151.779 171.524 150.145 167.086 149.976 166.665L149.959 166.632C149.959 166.632 149.424 166.452 148.584 166.221C148.582 166.221 148.581 166.221 148.58 166.22C148.578 166.219 148.577 166.219 148.575 166.219C148.377 166.164 148.16 166.107 147.928 166.047C146.946 165.928 140.907 165.261 134.849 165.835ZM133.889 199.945L135.645 199.345C135.645 199.345 136.771 198.905 138.672 198.554C139.374 198.424 139.963 198.401 140.579 198.377H140.58H140.58C141.011 198.36 141.455 198.342 141.962 198.287L141.544 200.977C141.465 201.034 141.394 201.102 141.326 201.175C141.364 201.208 141.403 201.243 141.445 201.281L141.445 201.281L141.489 201.322C141.992 201.782 142.944 202.597 147.039 203.62C147.86 203.824 150.618 203.862 150.618 203.862C150.678 203.871 150.743 203.879 150.812 203.889L150.812 203.889C151.672 204.007 153.139 204.207 153.247 205.091C153.277 205.328 152.981 205.583 152.981 205.583C152.981 205.583 154.049 205.657 154.115 206.625C154.142 207.005 151.749 207.386 151.749 207.386C151.749 207.386 152.891 207.677 152.913 208.395C152.913 208.599 145.954 209.915 145.954 209.915L147.469 210.005L149.043 209.929C149.043 209.929 149.862 210.081 149.908 210.761C149.924 211.03 148.475 211.318 146.789 211.538C144.167 211.884 142.283 211.579 140.439 211.076C140.326 211.044 140.216 211.016 140.109 210.988L139.991 210.957C139.718 210.885 139.466 210.822 139.229 210.762C137.816 210.407 136.896 210.175 134.805 209.037C134.579 208.914 134.331 208.765 134.073 208.602C127.806 209.197 108.81 210.66 106.906 206.746C103.141 199.007 113.05 184.029 113.05 184.029L124.019 191.7L120.533 197.621L133.889 199.945ZM159.079 219.604H164.904L166.211 211.562L168.889 223.004C170.542 224.9 172.45 227.139 172.739 227.69C173.262 228.689 174.229 233.636 174.183 234.613C174.137 235.59 171.123 239.982 171.123 239.982C169.252 239.536 170.474 237.269 170.474 237.269C170.474 237.269 168.799 238.646 168.102 238.623C161.543 238.406 161.894 235.176 162.049 234.772C162.398 233.863 164.148 234.902 164.148 234.902C164.148 234.902 161.108 228.903 161.502 224.318C160.821 223.032 159.983 221.417 159.079 219.604Z" fill="#E576C6"/>
</g>
<path id="Stroke 11" opacity="0.199382" d="M165.553 227.238C165.553 227.238 166.473 230.619 169.632 231.673C170.737 232.041 170.461 236.39 173.168 235.87" stroke="black" stroke-width="3"/>
<path id="Fill 27_2" fill-rule="evenodd" clip-rule="evenodd" d="M147.706 188.701C147.593 189.279 147.258 189.701 146.958 189.642C146.657 189.583 146.505 189.067 146.618 188.488C146.732 187.91 147.067 187.489 147.367 187.548C147.668 187.607 147.82 188.123 147.706 188.701Z" fill="#020101"/>
</g>
</g>
<g id="Man / Head / 1">
<g id="Group 30">
<path id="Fill 1_7" fill-rule="evenodd" clip-rule="evenodd" d="M161.459 138.433C161.459 142.331 158.952 145.492 155.86 145.492C152.768 145.492 150.261 142.331 150.261 138.433C150.261 134.535 152.768 131.374 155.86 131.374C158.952 131.374 161.459 134.535 161.459 138.433Z" fill="#19141E"/>
<g id="Face color">
<path id="Face" d="M148.21 166.396L147.976 158.288C147.976 158.288 157.805 159.073 159.908 157.978C159.908 157.978 162.478 144.707 159.413 137.358L159.351 137.072L138.608 134.641L137.445 146.57C136.746 144.505 130.979 142.162 129.472 145.12C126.205 151.53 137.885 155.845 137.885 155.845L136.699 166.493" fill="#E576C6"/>
</g>
<path id="Fill 5_4" opacity="0.398926" fill-rule="evenodd" clip-rule="evenodd" d="M147.976 158.288L141.347 156.864L147.944 161.33L147.976 158.288Z" fill="black"/>
<path id="Fill 7_3" fill-rule="evenodd" clip-rule="evenodd" d="M153.274 146.419L155.565 152.031L152.82 152.066L153.274 146.419Z" fill="#405FD3"/>
<path id="Fill 9_2" fill-rule="evenodd" clip-rule="evenodd" d="M150.832 146.635C150.968 147.391 150.468 148.114 149.714 148.25C148.959 148.387 148.238 147.885 148.101 147.13C147.965 146.374 148.465 145.651 149.22 145.514C149.974 145.377 150.695 145.879 150.832 146.635Z" fill="#0D0B6D"/>
<path id="Fill 11_5" fill-rule="evenodd" clip-rule="evenodd" d="M158.528 146.635C158.665 147.391 158.164 148.114 157.41 148.25C156.656 148.387 155.934 147.885 155.798 147.13C155.661 146.374 156.162 145.651 156.916 145.514C157.67 145.377 158.392 145.879 158.528 146.635Z" fill="#0D0B6D"/>
<path id="Hair" d="M138.985 148.606C137.018 145.233 134.173 144.204 132.895 143.902C132.386 142.427 131.998 140.715 131.725 138.895C130.993 134.024 134.527 129.579 137.382 128.303C140.271 127.011 145.253 125.221 152.546 127.651C157.449 129.285 160.583 125.372 163.468 127.044C168.398 129.9 163.813 142.407 151.312 139.23C142.37 136.957 142.14 137.527 142.063 139.179C141.815 144.519 140.984 147.661 138.985 148.606Z" fill="#2F2F3D"/>
<g id="Group 21">
<path id="Fill 18_6" fill-rule="evenodd" clip-rule="evenodd" d="M149.461 152.274C149.461 152.274 150.342 153.879 152.247 153.841L149.461 152.274Z" fill="white"/>
<path id="Stroke 20 (Stroke)_2" fill-rule="evenodd" clip-rule="evenodd" d="M148.985 152.537C148.984 152.536 148.984 152.536 149.461 152.274C149.938 152.013 149.938 152.012 149.938 152.012L149.937 152.012L149.937 152.011L149.937 152.01C149.936 152.01 149.936 152.01 149.936 152.01C149.936 152.01 149.936 152.01 149.936 152.01L149.94 152.016C149.944 152.023 149.951 152.035 149.962 152.052C149.983 152.085 150.017 152.136 150.064 152.198C150.158 152.324 150.302 152.493 150.496 152.661C150.881 152.994 151.452 153.313 152.236 153.298L152.258 154.385C151.138 154.407 150.316 153.943 149.784 153.484C149.52 153.255 149.324 153.025 149.193 152.851C149.128 152.764 149.078 152.689 149.044 152.635C149.026 152.608 149.013 152.585 149.003 152.569C148.998 152.56 148.994 152.553 148.991 152.548L148.987 152.541L148.985 152.538L148.985 152.537L148.985 152.537Z" fill="#252535"/>
</g>
<path id="Stroke 22 (Stroke)_2" fill-rule="evenodd" clip-rule="evenodd" d="M149.434 144.064C147.983 144.064 146.804 145.244 146.804 146.702C146.804 148.16 147.983 149.339 149.434 149.339C150.886 149.339 152.065 148.16 152.065 146.702C152.065 145.244 150.886 144.064 149.434 144.064ZM145.716 146.702C145.716 144.646 147.38 142.977 149.434 142.977C151.489 142.977 153.153 144.646 153.153 146.702C153.153 148.758 151.489 150.427 149.434 150.427C147.38 150.427 145.716 148.758 145.716 146.702Z" fill="#252535"/>
<path id="Stroke 24 (Stroke)" fill-rule="evenodd" clip-rule="evenodd" d="M157.428 144.064C155.976 144.064 154.797 145.244 154.797 146.702C154.797 148.16 155.976 149.339 157.428 149.339C158.879 149.339 160.058 148.16 160.058 146.702C160.058 145.244 158.879 144.064 157.428 144.064ZM153.709 146.702C153.709 144.646 155.373 142.977 157.428 142.977C159.482 142.977 161.146 144.646 161.146 146.702C161.146 148.758 159.482 150.427 157.428 150.427C155.373 150.427 153.709 148.758 153.709 146.702Z" fill="#252535"/>
<path id="Stroke 26 (Stroke)" fill-rule="evenodd" clip-rule="evenodd" d="M152.622 146.305H153.993V147.392H152.622V146.305Z" fill="#252535"/>
<path id="Stroke 28 (Stroke)" fill-rule="evenodd" clip-rule="evenodd" d="M138.418 146.158H146.26V147.246H138.418V146.158Z" fill="#252535"/>
</g>
</g>
</g>
</g>
</svg>
