<svg width="390" height="255" viewBox="0 0 390 255" fill="none" xmlns="http://www.w3.org/2000/svg">
<path d="M60.5785 219.206L48.7101 226.134C32.5863 235.545 29.1522 235.56 12.6246 226.286L0.549713 219.511C-6.02005 216.11 -13.7721 215.859 -20.5474 218.828L-22.1047 219.511L-34.009 226.422C-45.3147 232.984 -46.2696 233.304 -52.9567 232.776C-58.4906 232.34 -61.5848 231.171 -67.403 227.317C-75.4405 221.994 -84.1266 218.906 -91.1224 218.881C-96.5716 218.862 -102.345 224.497 -102.345 229.835C-102.345 234.855 -96.5612 240.808 -91.7024 240.788C-89.3299 240.779 -83.1776 243.388 -75.7352 247.563C-64.4376 253.9 -62.9688 254.386 -53.792 254.818C-42.1359 255.368 -37.2957 253.99 -26.3543 247.004C-20.4584 243.24 -16.4849 241.644 -11.8524 241.186C-5.88567 240.594 -4.71971 240.997 6.13007 247.378C17.0819 253.82 18.2989 254.233 27.8609 254.757C39.7015 255.408 45.6334 253.671 56.7593 246.298C63.2144 242.02 64.9674 241.45 71.6476 241.45C78.4739 241.45 80.0193 241.983 87.341 246.858C97.4518 253.593 103.865 255.407 115.497 254.817C123.822 254.395 125.68 253.753 136.981 247.396C148.536 240.896 149.764 240.484 155.578 241.152C159.719 241.626 163.822 243.249 167.838 245.997C177.708 252.753 184.368 255 194.522 255C204.838 255 210.105 253.281 220.446 246.541C225.302 243.374 229.639 241.621 233.798 241.144C239.531 240.486 240.815 240.918 252.33 247.396C263.631 253.753 265.489 254.395 273.814 254.817C285.446 255.407 291.859 253.593 301.97 246.858C309.282 241.988 310.842 241.45 317.632 241.45C324.27 241.45 326.006 242.015 332.134 246.17C342.867 253.449 349.572 255.41 361.45 254.748C371.008 254.214 372.234 253.797 383.181 247.35C394.056 240.944 395.182 240.557 401.163 241.167C405.79 241.639 409.776 243.251 415.665 247.03C425.929 253.618 432.365 255.397 443.821 254.817C452.108 254.396 454.032 253.739 465.044 247.563C472.487 243.389 478.641 240.779 481.013 240.788C485.872 240.808 491.655 234.855 491.655 229.835C491.655 224.497 485.883 218.862 480.433 218.881C473.438 218.906 464.751 221.994 456.714 227.317C450.896 231.171 447.802 232.34 442.268 232.776C435.593 233.304 434.615 232.977 423.521 226.538C412.927 220.388 410.952 219.689 402.719 219.169C392.189 218.504 383.37 221.196 373.335 228.135C368.649 231.376 365.69 232.424 360.111 232.819C353.265 233.304 352.353 232.993 340.828 226.267L328.732 219.206C324.659 217.456 314.88 214.874 308.347 218.543L293.726 226.747C283.109 232.962 282.064 233.308 275.352 232.833C269.887 232.446 266.837 231.369 262.196 228.193C252.044 221.245 243.044 218.507 232.545 219.169C224.313 219.689 222.337 220.388 211.743 226.538C200.653 232.976 199.668 233.304 192.996 232.78C187.436 232.344 184.49 231.225 178.993 227.46C162.024 215.839 144.811 216.082 127.115 228.193C122.474 231.369 119.424 232.446 113.958 232.833C107.247 233.308 106.202 232.962 95.5851 226.747L80.9636 218.543C72.1677 213.638 63.7086 216.942 60.5785 219.206Z" fill="#71C1EB"/>
<path d="M60.5785 165.206L48.7101 172.134C32.5863 181.545 29.1522 181.56 12.6246 172.286L0.549713 165.511C-6.02005 162.11 -13.7721 161.859 -20.5474 164.828L-22.1047 165.511L-34.009 172.422C-45.3147 178.984 -46.2696 179.304 -52.9567 178.776C-58.4906 178.34 -61.5848 177.171 -67.403 173.317C-75.4405 167.994 -84.1266 164.906 -91.1224 164.881C-96.5716 164.862 -102.345 170.497 -102.345 175.835C-102.345 180.855 -96.5612 186.808 -91.7024 186.788C-89.3299 186.779 -83.1776 189.388 -75.7352 193.563C-64.4376 199.9 -62.9688 200.386 -53.792 200.818C-42.1359 201.368 -37.2957 199.99 -26.3543 193.004C-20.4584 189.24 -16.4849 187.644 -11.8524 187.186C-5.88567 186.594 -4.71971 186.997 6.13007 193.378C17.0819 199.82 18.2989 200.233 27.8609 200.757C39.7015 201.408 45.6334 199.671 56.7593 192.298C63.2144 188.02 64.9674 187.45 71.6476 187.45C78.4739 187.45 80.0193 187.983 87.341 192.858C97.4518 199.593 103.865 201.407 115.497 200.817C123.822 200.395 125.68 199.753 136.981 193.396C148.536 186.896 149.764 186.484 155.578 187.152C159.719 187.626 163.822 189.249 167.838 191.997C177.708 198.753 184.368 201 194.522 201C204.838 201 210.105 199.281 220.446 192.541C225.302 189.374 229.639 187.621 233.798 187.144C239.531 186.486 240.815 186.918 252.33 193.396C263.631 199.753 265.489 200.395 273.814 200.817C285.446 201.407 291.859 199.593 301.97 192.858C309.282 187.988 310.842 187.45 317.632 187.45C324.27 187.45 326.006 188.015 332.134 192.17C342.867 199.449 349.572 201.41 361.45 200.748C371.008 200.214 372.234 199.797 383.181 193.35C394.056 186.944 395.182 186.557 401.163 187.167C405.79 187.639 409.776 189.251 415.665 193.03C425.929 199.618 432.365 201.397 443.821 200.817C452.108 200.396 454.032 199.739 465.044 193.563C472.487 189.389 478.641 186.779 481.013 186.788C485.872 186.808 491.655 180.855 491.655 175.835C491.655 170.497 485.883 164.862 480.433 164.881C473.438 164.906 464.751 167.994 456.714 173.317C450.896 177.171 447.802 178.34 442.268 178.776C435.593 179.304 434.615 178.977 423.521 172.538C412.927 166.388 410.952 165.689 402.719 165.169C392.189 164.504 383.37 167.196 373.335 174.135C368.649 177.376 365.69 178.424 360.111 178.819C353.265 179.304 352.353 178.993 340.828 172.267L328.732 165.206C324.659 163.456 314.88 160.874 308.347 164.543L293.726 172.747C283.109 178.962 282.064 179.308 275.352 178.833C269.887 178.446 266.837 177.369 262.196 174.193C252.044 167.245 243.044 164.507 232.545 165.169C224.313 165.689 222.337 166.388 211.743 172.538C200.653 178.976 199.668 179.304 192.996 178.78C187.436 178.344 184.49 177.225 178.993 173.46C162.024 161.839 144.811 162.082 127.115 174.193C122.474 177.369 119.424 178.446 113.958 178.833C107.247 179.308 106.202 178.962 95.5851 172.747L80.9636 164.543C72.1677 159.638 63.7086 162.942 60.5785 165.206Z" fill="#71C1EB"/>
<path d="M60.5785 111.206L48.7101 118.134C32.5863 127.545 29.1522 127.56 12.6246 118.286L0.549713 111.511C-6.02005 108.11 -13.7721 107.859 -20.5474 110.828L-22.1047 111.511L-34.009 118.422C-45.3147 124.984 -46.2696 125.304 -52.9567 124.776C-58.4906 124.34 -61.5848 123.171 -67.403 119.317C-75.4405 113.994 -84.1266 110.906 -91.1224 110.881C-96.5716 110.862 -102.345 116.497 -102.345 121.835C-102.345 126.855 -96.5612 132.808 -91.7024 132.788C-89.3299 132.779 -83.1776 135.388 -75.7352 139.563C-64.4376 145.9 -62.9688 146.386 -53.792 146.818C-42.1359 147.368 -37.2957 145.99 -26.3543 139.004C-20.4584 135.24 -16.4849 133.644 -11.8524 133.186C-5.88567 132.594 -4.71971 132.997 6.13007 139.378C17.0819 145.82 18.2989 146.233 27.8609 146.757C39.7015 147.408 45.6334 145.671 56.7593 138.298C63.2144 134.02 64.9674 133.45 71.6476 133.45C78.4739 133.45 80.0193 133.983 87.341 138.858C97.4518 145.593 103.865 147.407 115.497 146.817C123.822 146.395 125.68 145.753 136.981 139.396C148.536 132.896 149.764 132.484 155.578 133.152C159.719 133.626 163.822 135.249 167.838 137.997C177.708 144.753 184.368 147 194.522 147C204.838 147 210.105 145.281 220.446 138.541C225.302 135.374 229.639 133.621 233.798 133.144C239.531 132.486 240.815 132.918 252.33 139.396C263.631 145.753 265.489 146.395 273.814 146.817C285.446 147.407 291.859 145.593 301.97 138.858C309.282 133.988 310.842 133.45 317.632 133.45C324.27 133.45 326.006 134.015 332.134 138.17C342.867 145.449 349.572 147.41 361.45 146.748C371.008 146.214 372.234 145.797 383.181 139.35C394.056 132.944 395.182 132.557 401.163 133.167C405.79 133.639 409.776 135.251 415.665 139.03C425.929 145.618 432.365 147.397 443.821 146.817C452.108 146.396 454.032 145.739 465.044 139.563C472.487 135.389 478.641 132.779 481.013 132.788C485.872 132.808 491.655 126.855 491.655 121.835C491.655 116.497 485.883 110.862 480.433 110.881C473.438 110.906 464.751 113.994 456.714 119.317C450.896 123.171 447.802 124.34 442.268 124.776C435.593 125.304 434.615 124.977 423.521 118.538C412.927 112.388 410.952 111.689 402.719 111.169C392.189 110.504 383.37 113.196 373.335 120.135C368.649 123.376 365.69 124.424 360.111 124.819C353.265 125.304 352.353 124.993 340.828 118.267L328.732 111.206C324.659 109.456 314.88 106.874 308.347 110.543L293.726 118.747C283.109 124.962 282.064 125.308 275.352 124.833C269.887 124.446 266.837 123.369 262.196 120.193C252.044 113.245 243.044 110.507 232.545 111.169C224.313 111.689 222.337 112.388 211.743 118.538C200.653 124.976 199.668 125.304 192.996 124.78C187.436 124.344 184.49 123.225 178.993 119.46C162.024 107.839 144.811 108.082 127.115 120.193C122.474 123.369 119.424 124.446 113.958 124.833C107.247 125.308 106.202 124.962 95.5851 118.747L80.9636 110.543C72.1677 105.638 63.7086 108.942 60.5785 111.206Z" fill="#71C1EB"/>
<path d="M60.5785 57.2063L48.7101 64.1338C32.5863 73.5455 29.1522 73.5597 12.6246 64.2861L0.549713 57.5109C-6.02005 54.1096 -13.7721 53.8588 -20.5474 56.8283L-22.1047 57.5109L-34.009 64.4216C-45.3147 70.9838 -46.2696 71.3039 -52.9567 70.776C-58.4906 70.3398 -61.5848 69.1707 -67.403 65.3172C-75.4405 59.9939 -84.1266 56.9056 -91.1224 56.8811C-96.5716 56.8618 -102.345 62.4975 -102.345 67.835C-102.345 72.8551 -96.5612 78.8082 -91.7024 78.7876C-89.3299 78.7785 -83.1776 81.3879 -75.7352 85.5627C-64.4376 91.9004 -62.9688 92.3857 -53.792 92.818C-42.1359 93.3678 -37.2957 91.9895 -26.3543 85.004C-20.4584 81.2395 -16.4849 79.6445 -11.8524 79.1863C-5.88567 78.594 -4.71971 78.9967 6.13007 85.3783C17.0819 91.8205 18.2989 92.2334 27.8609 92.7574C39.7015 93.4078 45.6334 91.6707 56.7593 84.298C63.2144 80.02 64.9674 79.4496 71.6476 79.4496C78.4739 79.4496 80.0193 79.9826 87.341 84.8582C97.4518 91.5933 103.865 93.4065 115.497 92.8167C123.822 92.3947 125.68 91.7533 136.981 85.3963C148.536 78.896 149.764 78.4843 155.578 79.1515C159.719 79.6264 163.822 81.2486 167.838 83.9974C177.708 90.7532 184.368 93 194.522 93C204.838 93 210.105 91.2811 220.446 84.5407C225.302 81.3738 229.639 79.6213 233.798 79.1438C239.531 78.4856 240.815 78.9179 252.33 85.3963C263.631 91.7533 265.489 92.3947 273.814 92.8167C285.446 93.4065 291.859 91.5933 301.97 84.8582C309.282 79.9878 310.842 79.4496 317.632 79.4496C324.27 79.4496 326.006 80.0149 332.134 84.1703C342.867 91.4488 349.572 93.4104 361.45 92.7484C371.008 92.2141 372.234 91.7972 383.181 85.3498C394.056 78.9437 395.182 78.5566 401.163 79.167C405.79 79.6393 409.776 81.2512 415.665 85.0298C425.929 91.6179 432.365 93.3975 443.821 92.8167C452.108 92.396 454.032 91.7391 465.044 85.5627C472.487 81.3892 478.641 78.7785 481.013 78.7876C485.872 78.8082 491.655 72.8551 491.655 67.835C491.655 62.4975 485.883 56.8618 480.433 56.8811C473.438 56.9057 464.751 59.9939 456.714 65.3172C450.896 69.1707 447.802 70.3399 442.268 70.776C435.593 71.3039 434.615 70.9774 423.521 64.5378C412.927 58.3885 410.952 57.689 402.719 57.1689C392.189 56.5043 383.37 59.1963 373.335 66.1354C368.649 69.3759 365.69 70.4238 360.111 70.8187C353.265 71.3039 352.353 70.9929 340.828 64.2667L328.732 57.2063C324.659 55.4563 314.88 52.8736 308.347 56.543L293.726 64.7468C283.109 70.9619 282.064 71.3078 275.352 70.8329C269.887 70.4457 266.837 69.3694 262.196 66.1935C252.044 59.2453 243.044 56.5068 232.545 57.1689C224.313 57.689 222.337 58.3885 211.743 64.5378C200.653 70.9761 199.668 71.3039 192.996 70.78C187.436 70.3438 184.49 69.2249 178.993 65.4605C162.024 53.8394 144.811 54.082 127.115 66.1935C122.474 69.3694 119.424 70.4457 113.958 70.8329C107.247 71.3078 106.202 70.9619 95.5851 64.7468L80.9636 56.543C72.1677 51.6384 63.7086 54.9416 60.5785 57.2063Z" fill="#71C1EB"/>
<path d="M60.5785 3.20633L48.7101 10.1338C32.5863 19.5455 29.1522 19.5597 12.6246 10.2861L0.549713 3.51086C-6.02005 0.109562 -13.7721 -0.141228 -20.5474 2.82834L-22.1047 3.51086L-34.009 10.4216C-45.3147 16.9838 -46.2696 17.3039 -52.9567 16.776C-58.4906 16.3398 -61.5848 15.1707 -67.403 11.3172C-75.4405 5.99388 -84.1266 2.90565 -91.1224 2.88113C-96.5716 2.86177 -102.345 8.49747 -102.345 13.835C-102.345 18.8551 -96.5612 24.8082 -91.7024 24.7876C-89.3299 24.7785 -83.1776 27.3879 -75.7352 31.5627C-64.4376 37.9004 -62.9688 38.3857 -53.792 38.818C-42.1359 39.3678 -37.2957 37.9895 -26.3543 31.004C-20.4584 27.2395 -16.4849 25.6445 -11.8524 25.1863C-5.88567 24.594 -4.71971 24.9967 6.13007 31.3783C17.0819 37.8205 18.2989 38.2334 27.8609 38.7574C39.7015 39.4078 45.6334 37.6707 56.7593 30.298C63.2144 26.02 64.9674 25.4496 71.6476 25.4496C78.4739 25.4496 80.0193 25.9826 87.341 30.8582C97.4518 37.5933 103.865 39.4065 115.497 38.8167C123.822 38.3947 125.68 37.7533 136.981 31.3963C148.536 24.896 149.764 24.4843 155.578 25.1515C159.719 25.6264 163.822 27.2486 167.838 29.9974C177.708 36.7532 184.368 39 194.522 39C204.838 39 210.105 37.2811 220.446 30.5407C225.302 27.3738 229.639 25.6213 233.798 25.1438C239.531 24.4856 240.815 24.9179 252.33 31.3963C263.631 37.7533 265.489 38.3947 273.814 38.8167C285.446 39.4065 291.859 37.5933 301.97 30.8582C309.282 25.9878 310.842 25.4496 317.632 25.4496C324.27 25.4496 326.006 26.0149 332.134 30.1703C342.867 37.4488 349.572 39.4104 361.45 38.7484C371.008 38.2141 372.234 37.7972 383.181 31.3498C394.056 24.9437 395.182 24.5566 401.163 25.167C405.79 25.6393 409.776 27.2512 415.665 31.0298C425.929 37.6179 432.365 39.3975 443.821 38.8167C452.108 38.396 454.032 37.7391 465.044 31.5627C472.487 27.3892 478.641 24.7785 481.013 24.7876C485.872 24.8082 491.655 18.8551 491.655 13.835C491.655 8.49747 485.883 2.86177 480.433 2.88113C473.438 2.90565 464.751 5.99388 456.714 11.3172C450.896 15.1707 447.802 16.3399 442.268 16.776C435.593 17.3039 434.615 16.9774 423.521 10.5378C412.927 4.38846 410.952 3.68895 402.719 3.16888C392.189 2.50426 383.37 5.19632 373.335 12.1354C368.649 15.3759 365.69 16.4238 360.111 16.8187C353.265 17.3039 352.353 16.9929 340.828 10.2667L328.732 3.20633C324.659 1.4563 314.88 -1.1264 308.347 2.54301L293.726 10.7468C283.109 16.9619 282.064 17.3078 275.352 16.8329C269.887 16.4457 266.837 15.3694 262.196 12.1935C252.044 5.24534 243.044 2.50684 232.545 3.16888C224.313 3.68895 222.337 4.38846 211.743 10.5378C200.653 16.9761 199.668 17.3039 192.996 16.78C187.436 16.3438 184.49 15.2249 178.993 11.4605C162.024 -0.160599 144.81 0.0819992 127.115 12.1935C122.474 15.3694 119.424 16.4457 113.958 16.8329C107.247 17.3078 106.202 16.9619 95.5851 10.7468L80.9636 2.54301C72.1677 -2.36164 63.7086 0.941616 60.5785 3.20633Z" fill="#71C1EB"/>
</svg>
