<svg width="157" height="142" viewBox="0 0 157 142" fill="none" xmlns="http://www.w3.org/2000/svg">
<path d="M2.47283 12.4447C0 17.3201 0 23.7025 0 36.4672V142H157V36.4672C157 23.7025 157 17.3201 154.527 12.4447C152.352 8.15607 148.881 4.66933 144.612 2.48418C139.759 0 133.406 0 120.699 0H36.3006C23.5942 0 17.241 0 12.3878 2.48418C8.11879 4.66933 4.64799 8.15607 2.47283 12.4447Z" fill="#212121"/>
<path d="M10.2208 21.6669C8 26.2376 8 32.2211 8 44.188V142H149V44.188C149 32.2213 149 26.2376 146.779 21.6669C144.826 17.6463 141.709 14.3775 137.875 12.3289C133.516 10 127.81 10 116.399 10H40.6012C29.1897 10 23.4839 10 19.1253 12.3289C15.2914 14.3775 12.1743 17.6463 10.2208 21.6669Z" fill="#F8F8F8"/>
<path d="M88.5248 52.1514L87.4662 53.7591C90.36 55.6645 91.1288 59.3973 89.2508 62.4244L90.8584 63.483C93.5598 59.7305 92.5166 54.6645 88.5248 52.1514ZM86.3018 55.5275L85.2432 57.1352C86.1019 57.9311 86.349 59.1309 85.8746 60.2014L87.4823 61.26C88.7526 59.3308 88.2584 56.9311 86.3018 55.5275ZM78.5532 44.8941L65.2219 47.6396C63.7554 47.9416 62.8027 49.3885 63.1047 50.8549L68.0465 74.8513C68.3485 76.3178 69.7954 77.2705 71.2619 76.9685L84.5932 74.2231C86.0597 73.9211 87.0124 72.4742 86.7104 71.0077L81.7686 47.0113C81.4666 45.5448 80.0197 44.5921 78.5532 44.8941ZM83.7696 70.2237L70.4382 72.9691L66.0455 51.639L79.3769 48.8935L83.7696 70.2237Z" fill="#212121"/>
<path d="M31.1016 101.141V103.824H30.1523V101.141H27.6504V100.191H30.1523V97.5723H31.1016V100.191H33.6035V101.141H31.1016ZM35.4375 104L39.2637 96.5059V96.4824H34.7109V95.5449H40.3066V96.5234L36.5449 104H35.4375ZM43.6055 105.799C42.4961 104.389 41.9414 102.68 41.9414 100.672C41.9414 98.6641 42.4961 96.9551 43.6055 95.5449H44.4609C44.043 96.0293 43.6914 96.7656 43.4062 97.7539C43.1211 98.7422 42.9785 99.7148 42.9785 100.672C42.9785 101.629 43.1211 102.602 43.4062 103.59C43.6914 104.578 44.043 105.314 44.4609 105.799H43.6055ZM48.2871 104.141C47.3926 104.141 46.6582 103.914 46.084 103.461C45.5098 103.004 45.2227 102.422 45.2227 101.715C45.2227 101.188 45.3887 100.725 45.7207 100.326C46.0527 99.9277 46.4922 99.666 47.0391 99.541V99.5176C46.582 99.377 46.2207 99.1387 45.9551 98.8027C45.6895 98.4629 45.5566 98.0703 45.5566 97.625C45.5566 96.9883 45.8145 96.459 46.3301 96.0371C46.8496 95.6152 47.502 95.4043 48.2871 95.4043C49.0762 95.4043 49.7266 95.6152 50.2383 96.0371C50.7539 96.4551 51.0117 96.9863 51.0117 97.6309C51.0117 98.0723 50.8809 98.4609 50.6191 98.7969C50.3574 99.1328 49.9961 99.373 49.5352 99.5176V99.541C50.082 99.6699 50.5215 99.9336 50.8535 100.332C51.1895 100.73 51.3574 101.191 51.3574 101.715C51.3574 102.422 51.0703 103.004 50.4961 103.461C49.9219 103.914 49.1855 104.141 48.2871 104.141ZM48.2871 103.221C48.8691 103.221 49.3457 103.072 49.7168 102.775C50.0918 102.479 50.2793 102.1 50.2793 101.639C50.2793 101.174 50.0918 100.793 49.7168 100.496C49.3457 100.199 48.8691 100.051 48.2871 100.051C47.7051 100.051 47.2266 100.201 46.8516 100.502C46.4805 100.799 46.2949 101.178 46.2949 101.639C46.2949 102.1 46.4824 102.479 46.8574 102.775C47.2324 103.072 47.709 103.221 48.2871 103.221ZM48.2871 99.125C48.7793 99.125 49.1816 98.9941 49.4941 98.7324C49.8105 98.4707 49.9688 98.1348 49.9688 97.7246C49.9688 97.3105 49.8125 96.9727 49.5 96.7109C49.1875 96.4453 48.7832 96.3125 48.2871 96.3125C47.791 96.3125 47.3867 96.4453 47.0742 96.7109C46.7617 96.9727 46.6055 97.3105 46.6055 97.7246C46.6055 98.1348 46.7617 98.4707 47.0742 98.7324C47.3867 98.9941 47.791 99.125 48.2871 99.125ZM55.2656 104.141C54.5469 104.141 53.9316 103.941 53.4199 103.543C52.9082 103.145 52.5879 102.613 52.459 101.949H53.5312C53.6445 102.332 53.8594 102.641 54.1758 102.875C54.4922 103.105 54.8594 103.221 55.2773 103.221C55.9805 103.221 56.5254 102.916 56.9121 102.307C57.3027 101.693 57.5059 100.824 57.5215 99.6992H57.5156H57.5039C57.3242 100.117 57.0195 100.453 56.5898 100.707C56.1641 100.957 55.6816 101.082 55.1426 101.082C54.3379 101.082 53.668 100.816 53.1328 100.285C52.6016 99.7539 52.3359 99.0879 52.3359 98.2871C52.3359 97.4512 52.6172 96.7617 53.1797 96.2188C53.7461 95.6719 54.4629 95.3984 55.3301 95.3984C55.9668 95.3984 56.5273 95.5645 57.0117 95.8965C57.4961 96.2246 57.8672 96.6914 58.125 97.2969C58.4023 97.9375 58.541 98.7148 58.541 99.6289C58.541 101.055 58.2539 102.164 57.6797 102.957C57.1055 103.746 56.3008 104.141 55.2656 104.141ZM55.3242 100.156C55.8828 100.156 56.3477 99.9785 56.7188 99.623C57.0898 99.2676 57.2754 98.8203 57.2754 98.2812C57.2754 97.7383 57.0879 97.2812 56.7129 96.9102C56.3418 96.5352 55.8848 96.3477 55.3418 96.3477C54.7988 96.3477 54.3398 96.5332 53.9648 96.9043C53.5898 97.2715 53.4023 97.7207 53.4023 98.252C53.4023 98.8027 53.584 99.2578 53.9473 99.6172C54.3105 99.9766 54.7695 100.156 55.3242 100.156ZM59.5898 97.9824C59.5898 97.2441 59.8555 96.6309 60.3867 96.1426C60.918 95.6504 61.582 95.4043 62.3789 95.4043C63.1328 95.4043 63.7715 95.6289 64.2949 96.0781C64.8184 96.5273 65.0801 97.0762 65.0801 97.7246C65.0801 98.1934 64.9512 98.6445 64.6934 99.0781C64.4355 99.5117 63.9512 100.096 63.2402 100.83L61.1016 103.039V103.062H65.2207V104H59.6426V103.273L62.6191 100.139C63.1855 99.541 63.5605 99.0879 63.7441 98.7793C63.9316 98.4707 64.0254 98.1406 64.0254 97.7891C64.0254 97.3828 63.8613 97.0371 63.5332 96.752C63.209 96.4668 62.8145 96.3242 62.3496 96.3242C61.8535 96.3242 61.4395 96.4824 61.1074 96.7988C60.7754 97.1152 60.6094 97.5098 60.6094 97.9824V97.9883H59.5898V97.9824ZM68.3613 98.9023C68.459 99.4453 68.5078 100.035 68.5078 100.672C68.5078 101.309 68.459 101.9 68.3613 102.447C68.2676 102.99 68.1328 103.471 67.957 103.889C67.7812 104.307 67.6074 104.656 67.4355 104.938C67.2676 105.223 67.0703 105.51 66.8438 105.799H65.9883C66.1328 105.631 66.2832 105.398 66.4395 105.102C66.5996 104.809 66.7598 104.447 66.9199 104.018C67.0801 103.592 67.2109 103.084 67.3125 102.494C67.418 101.904 67.4707 101.297 67.4707 100.672C67.4707 100.047 67.418 99.4395 67.3125 98.8496C67.2109 98.2559 67.0781 97.7461 66.9141 97.3203C66.7539 96.8945 66.5957 96.5352 66.4395 96.2422C66.2832 95.9453 66.1328 95.7129 65.9883 95.5449H66.8438C67.0703 95.834 67.2676 96.1211 67.4355 96.4062C67.6074 96.6875 67.7812 97.0371 67.957 97.4551C68.1328 97.873 68.2676 98.3555 68.3613 98.9023ZM70.2539 97.9824C70.2539 97.2441 70.5195 96.6309 71.0508 96.1426C71.582 95.6504 72.2461 95.4043 73.043 95.4043C73.7969 95.4043 74.4355 95.6289 74.959 96.0781C75.4824 96.5273 75.7441 97.0762 75.7441 97.7246C75.7441 98.1934 75.6152 98.6445 75.3574 99.0781C75.0996 99.5117 74.6152 100.096 73.9043 100.83L71.7656 103.039V103.062H75.8848V104H70.3066V103.273L73.2832 100.139C73.8496 99.541 74.2246 99.0879 74.4082 98.7793C74.5957 98.4707 74.6895 98.1406 74.6895 97.7891C74.6895 97.3828 74.5254 97.0371 74.1973 96.752C73.873 96.4668 73.4785 96.3242 73.0137 96.3242C72.5176 96.3242 72.1035 96.4824 71.7715 96.7988C71.4395 97.1152 71.2734 97.5098 71.2734 97.9824V97.9883H70.2539V97.9824ZM78.8262 100.098V99.207H79.8398C80.3242 99.207 80.7207 99.0684 81.0293 98.791C81.3379 98.5098 81.4922 98.1543 81.4922 97.7246C81.4922 97.2949 81.3496 96.9531 81.0645 96.6992C80.7793 96.4453 80.375 96.3184 79.8516 96.3184C79.3672 96.3184 78.9727 96.4473 78.668 96.7051C78.3633 96.9629 78.1875 97.3145 78.1406 97.7598H77.127C77.1855 97.041 77.4629 96.4688 77.959 96.043C78.459 95.6172 79.1055 95.4043 79.8984 95.4043C80.6602 95.4043 81.293 95.6094 81.7969 96.0195C82.3008 96.4297 82.5527 96.9512 82.5527 97.584C82.5527 98.1113 82.3965 98.5547 82.084 98.9141C81.7715 99.2734 81.3496 99.5 80.8184 99.5938V99.6172C81.459 99.6562 81.9688 99.8613 82.3477 100.232C82.7266 100.6 82.916 101.08 82.916 101.674C82.916 102.146 82.7832 102.572 82.5176 102.951C82.252 103.33 81.8926 103.623 81.4395 103.83C80.9863 104.037 80.4844 104.141 79.9336 104.141C79.0586 104.141 78.3535 103.922 77.8184 103.484C77.2832 103.047 76.9961 102.473 76.957 101.762H77.9707C78.0176 102.203 78.2148 102.559 78.5625 102.828C78.9102 103.094 79.3633 103.227 79.9219 103.227C80.4805 103.227 80.9395 103.084 81.2988 102.799C81.6621 102.514 81.8438 102.15 81.8438 101.709C81.8438 101.213 81.668 100.82 81.3164 100.531C80.9688 100.242 80.4922 100.098 79.8867 100.098H78.8262ZM86.3613 104V96.6641H86.3379L84.0996 98.2754V97.1621L86.3496 95.5449H87.3809V104H86.3613ZM93.334 101.047H89.4902V100.098H93.334V101.047ZM113.713 101.047H109.869V100.098H113.713V101.047Z" fill="#212121"/>
<path d="M94.248 104L97.125 99.7637V99.7227L94.2832 95.5449H95.5547L97.8105 98.9434H97.8516L100.137 95.5449H101.338L98.4199 99.7754V99.8105L101.273 104H100.008L97.7637 100.631H97.7227L95.4434 104H94.248ZM101.865 104L104.742 99.7637V99.7227L101.9 95.5449H103.172L105.428 98.9434H105.469L107.754 95.5449H108.955L106.037 99.7754V99.8105L108.891 104H107.625L105.381 100.631H105.34L103.061 104H101.865ZM114.627 104L117.504 99.7637V99.7227L114.662 95.5449H115.934L118.189 98.9434H118.23L120.516 95.5449H121.717L118.799 99.7754V99.8105L121.652 104H120.387L118.143 100.631H118.102L115.822 104H114.627ZM122.244 104L125.121 99.7637V99.7227L122.279 95.5449H123.551L125.807 98.9434H125.848L128.133 95.5449H129.334L126.416 99.7754V99.8105L129.27 104H128.004L125.76 100.631H125.719L123.439 104H122.244Z" fill="#EBEBEB" fill-opacity="0.7"/>
<rect x="60" y="15" width="22" height="4" rx="2" fill="#212121"/>
<rect x="87" y="15" width="8" height="4" rx="2" fill="#212121"/>
</svg>
