{
    "allowed_origins": [
        "*"
    ],
    "token_hmac_secret_key": "my_secret",
    "api_key": "my_api_key",
    "admin_password": "password",
    "admin_secret": "secret",
    "admin": true,
    "debug": true,
    "namespaces": [
        {
            "name": "users",
            "history_size": 10,
            "history_ttl": "10m",
            "recover": true
        },
        {
            "name": "chats",
            "history_size": 50,
            "history_ttl": "10m",
            "recover": true
        }
    ]
}
