<svg width="24" height="24" viewBox="0 0 24 24" fill="none" xmlns="http://www.w3.org/2000/svg">
<path d="M23.6719 20.7516L18.9984 16.0781C18.7875 15.8672 18.5016 15.75 18.2016 15.75H17.4375C18.7313 14.0953 19.5 12.0141 19.5 9.75C19.5 4.36406 15.1359 0 9.75 0C4.36406 0 0 4.36406 0 9.75C0 15.1359 4.36406 19.5 9.75 19.5C12.0141 19.5 14.0953 18.7313 15.75 17.4375V18.2016C15.75 18.5016 15.8672 18.7875 16.0781 18.9984L20.7516 23.6719C21.1922 24.1125 21.9047 24.1125 22.3406 23.6719L23.6672 22.3453C24.1078 21.9047 24.1078 21.1922 23.6719 20.7516ZM9.75 15.75C6.43594 15.75 3.75 13.0688 3.75 9.75C3.75 6.43594 6.43125 3.75 9.75 3.75C13.0641 3.75 15.75 6.43125 15.75 9.75C15.75 13.0641 13.0688 15.75 9.75 15.75Z" fill="#007AFF"/>
</svg>
