adm:104,1000
cdrom:1000
sudo:1000
audio:117,122
dip:1000
plugdev:1000
ssl-cert:132
lpadmin:1000
scanner:119
sambashare:1000
mongodb:123
developers:1001,1002,1003,1004,1005
informationManagers:1006,1007,1008
analysts:1009,1010,1011,1012

/bin/bash - 3
/usr/sbin/nologin - 18
/bin/sync - 1
/bin/false - 29
/sbin/nologin - 1
/bin/sh - 12
