{
    "metadata": {
        "generator": "io_three",
        "version": 4.4,
        "type": "Object"
    },
    "images": [{
        "url": "rock-01.jpg",
        "name": "rock-01.jpg",
        "uuid": "B7523451-46D9-3590-AD68-D2FA8058CBB4"
    }],
    "materials": [{
        "depthTest": true,
        "name": "Standard",
        "vertexColors": false,
        "blending": "NormalBlending",
        "shininess": 50,
        "depthWrite": true,
        "bumpScale": 1,
        "ambient": 11579568,
        "specular": 197379,
        "emissive": 0,
        "uuid": "93831B89-11B9-31B1-A879-E029ECAF81F2",
        "color": 11579568,
        "bumpMap": "795E9253-1C97-320C-855B-7014FD8CE481",
        "map": "795E9253-1C97-320C-855B-7014FD8CE481",
        "type": "MeshPhongMaterial"
    }],
    "object": {
        "type": "Scene",
        "uuid": "6CB4878C-780A-4770-8746-E665C1F18996",
        "children": [{
            "name": "Box",
            "uuid": "DDA9AE26-14F9-3E6A-9BDD-AF02F6D2F286",
            "matrix": [-1,0,0,0,0,0,1,0,0,1,0,0,0,0,0,1],
            "visible": true,
            "type": "Mesh",
            "material": "93831B89-11B9-31B1-A879-E029ECAF81F2",
            "castShadow": true,
            "receiveShadow": true,
            "geometry": "15641190-4052-3871-BF5E-F046F6B1B496"
        }],
        "matrix": [1,0,0,0,0,1,0,0,0,0,1,0,0,0,0,1]
    },
    "textures": [{
        "anisotropy": 1,
        "name": "rock_01_jpg",
        "uuid": "795E9253-1C97-320C-855B-7014FD8CE481",
        "wrap": [1000,1000],
        "repeat": [1,1],
        "mapping": 300,
        "image": "B7523451-46D9-3590-AD68-D2FA8058CBB4",
        "minFilter": 1008,
        "magFilter": 1006
    },{
        "anisotropy": 1,
        "name": "rock_01_jpg",
        "uuid": "795E9253-1C97-320C-855B-7014FD8CE481",
        "wrap": [1000,1000],
        "repeat": [1,1],
        "mapping": 300,
        "image": "B7523451-46D9-3590-AD68-D2FA8058CBB4",
        "minFilter": 1008,
        "magFilter": 1006
    }],
    "geometries": [{
        "data": {
            "skinIndices": [],
            "skinWeights": [],
            "name": "BoxGeometry",
            "influencesPerVertex": 2,
            "metadata": {
                "generator": "io_three",
                "bones": 0,
                "normals": 68,
                "version": 3,
                "materials": 1,
                "vertices": 68,
                "morphTargets": 0,
                "uvs": 1,
                "faces": 66
            },
            "vertices": [0.273794,-0.265581,0.467918,0.245375,-0.05618,0.486918,0.249945,0.124661,0.511917,0.250227,0.27273,0.497455,0.389195,-0.432224,0.291462,0.416282,-0.123947,0.200493,0.410077,0.129382,0.229665,0.436369,0.44908,0.225576,0.515056,-0.459525,0.036994,0.526981,-0.148037,-0.03643,0.465818,0.120533,-0.012341,0.540475,0.552425,0.032254,0.394468,-0.389991,-0.204914,0.411904,-0.131364,-0.197068,0.469699,0.144981,-0.264688,0.494041,0.41392,-0.257676,0.288916,-0.267908,-0.498035,0.27512,-0.063851,-0.556778,0.351751,0.055958,-0.529984,0.236918,0.253416,-0.559918,-0.294407,0.24563,0.473492,-0.282091,0.11588,0.476533,-0.25531,-0.06069,0.475669,-0.314504,-0.349878,0.515923,-0.3892,0.42063,0.277651,-0.464676,0.132261,0.215802,-0.473111,-0.15219,0.286275,-0.414796,-0.483177,0.226359,-0.473023,0.499536,-0.012529,-0.480875,0.18094,0.003776,-0.512558,-0.11552,-0.023431,-0.558657,-0.513454,-0.023053,-0.433906,0.412593,-0.247379,-0.399901,0.200037,-0.272276,-0.414393,-0.198131,-0.289576,-0.41115,-0.448587,-0.252527,-0.344491,0.348642,-0.469816,-0.345036,0.13008,-0.549918,-0.275501,-0.096983,-0.499329,-0.309868,-0.237459,-0.517105,-0.053348,0.304087,0.512945,0.118838,0.279998,0.557378,-0.090452,0.152266,0.493865,0.103804,0.129866,0.533759,-0.15182,-0.123354,0.552267,0.040882,-0.07954,0.443664,-0.128897,-0.305585,0.547416,0.147833,-0.259735,0.554975,-0.13773,-0.245928,-0.487972,0.085172,-0.294932,-0.536921,-0.141419,-0.098756,-0.498879,0.13275,-0.06223,-0.544542,-0.083119,0.060118,-0.530007,0.049645,0.133522,-0.468165,-0.116734,0.274947,-0.552282,0.130457,0.263868,-0.453606,-0.092572,-0.492238,0.294066,0.117795,-0.413459,0.245432,-0.2013,-0.441545,0.039188,0.180837,-0.530045,0.00786,-0.150107,-0.424117,-0.291677,0.090078,-0.455838,-0.227399,0.094618,0.395937,0.27393,-0.172946,0.439626,0.248149,0.225102,0.524358,-0.011999,-0.157734,0.488378,0.048806,0.173695,0.459061,-0.218501,-0.164521,0.455806,-0.226146],
            "bones": [],
            "normals": [0.47673,-0.317057,0.819849,0.552202,-0.615467,0.562334,0.900449,0.046144,0.432478,0.505234,-0.015351,0.862819,0.904324,-0.039186,0.42497,0.532579,-0.117771,0.83813,0.598315,0.567492,0.56563,0.479385,0.408795,0.776543,0.786096,-0.617512,0.026154,0.998657,-0.002106,-0.051698,0.995025,-0.047945,0.087008,0.703757,0.702567,0.10535,0.631825,-0.591479,-0.50087,0.920713,-0.111301,-0.373943,0.937773,-0.078616,-0.338206,0.700888,0.539628,-0.466353,0.563921,-0.447157,-0.694266,0.435255,-0.02295,-0.899991,0.597186,-0.044496,-0.800836,0.097354,0.352092,-0.930876,-0.4897,0.305032,0.816767,-0.596759,0.639607,0.484481,-0.930357,0.082522,0.357189,-0.540117,0.061007,0.839351,-0.897519,0.016602,0.440596,-0.556688,0.086703,0.826136,-0.541429,-0.767479,0.343242,-0.490249,-0.411969,0.768029,-0.684988,0.728172,-0.022095,-0.997101,0.064089,-0.040651,-0.994629,0.044221,-0.093478,-0.736961,-0.667776,-0.104617,-0.705039,0.599963,-0.378063,-0.955229,-0.013306,-0.29548,-0.915922,0.023469,-0.400586,-0.491409,-0.71221,-0.501236,-0.522446,0.547258,-0.653829,-0.583239,-0.035585,-0.811487,-0.478744,-0.090091,-0.873318,-0.449843,-0.293893,-0.843349,-0.102329,-0.03885,0.993988,-0.102542,0.535661,0.83816,0.036164,-0.140172,0.989441,0.040986,0.441115,0.896481,-0.110904,0.136113,0.984436,0.114078,0.05591,0.991882,-0.004303,-0.380169,0.924894,0.166906,-0.280435,0.945219,-0.02121,-0.045289,-0.998718,-0.063662,-0.452437,-0.889492,-0.045198,0.075838,-0.996063,-0.01236,-0.540941,-0.840938,0.073428,0.003662,-0.997284,0.074587,0.0253,-0.996887,0.106021,0.44966,-0.886868,-0.037538,0.54796,-0.835627,0.081515,-0.945891,0.314035,0.079257,-0.927335,0.365703,0.037599,-0.997436,-0.060457,0.049684,-0.997742,-0.045076,-0.043977,-0.911588,-0.408704,0.007447,-0.93347,-0.358562,0.019318,0.91464,0.40376,-0.030396,0.912076,0.408826,-0.037507,0.999268,0.007141,-0.019929,0.996643,0.079043,-0.004669,0.913785,-0.40611,0.005646,0.938536,-0.345042],
            "faces": [43,0,4,5,1,0,0,1,2,3,0,1,2,3,43,1,5,6,2,0,3,2,4,5,3,2,4,5,43,2,6,7,3,0,5,4,6,7,5,4,6,7,43,4,8,9,5,0,1,8,9,2,1,8,9,2,43,5,9,10,6,0,2,9,10,4,2,9,10,4,43,6,10,11,7,0,4,10,11,6,4,10,11,6,43,8,12,13,9,0,8,12,13,9,8,12,13,9,43,9,13,14,10,0,9,13,14,10,9,13,14,10,43,10,14,15,11,0,10,14,15,11,10,14,15,11,43,12,16,17,13,0,12,16,17,13,12,16,17,13,43,13,17,18,14,0,13,17,18,14,13,17,18,14,43,14,18,19,15,0,14,18,19,15,14,18,19,15,43,20,24,25,21,0,0,1,2,3,20,21,22,23,43,21,25,26,22,0,3,2,4,5,23,22,24,25,43,22,26,27,23,0,5,4,6,7,25,24,26,27,43,24,28,29,25,0,1,8,9,2,21,28,29,22,43,25,29,30,26,0,2,9,10,4,22,29,30,24,43,26,30,31,27,0,4,10,11,6,24,30,31,26,43,28,32,33,29,0,8,12,13,9,28,32,33,29,43,29,33,34,30,0,9,13,14,10,29,33,34,30,43,30,34,35,31,0,10,14,15,11,30,34,35,31,43,32,36,37,33,0,12,16,17,13,32,36,37,33,43,33,37,38,34,0,13,17,18,14,33,37,38,34,43,34,38,39,35,0,14,18,19,15,34,38,39,35,43,20,21,42,40,0,0,20,21,3,20,23,40,41,43,40,42,43,41,0,3,21,22,5,41,40,42,43,43,41,43,2,3,0,5,22,23,7,43,42,5,7,43,21,22,44,42,0,20,24,25,21,23,25,44,40,43,42,44,45,43,0,21,25,26,22,40,44,45,42,43,43,45,1,2,0,22,26,27,23,42,45,3,5,43,22,23,46,44,0,24,16,17,25,25,27,46,44,43,44,46,47,45,0,25,17,18,26,44,46,47,45,43,0,1,45,47,0,19,27,26,18,0,3,45,47,43,39,38,50,48,0,0,20,21,3,39,38,48,49,43,48,50,51,49,0,3,21,22,5,49,48,50,51,43,49,51,17,16,0,5,22,23,7,51,50,17,16,43,38,37,52,50,0,20,24,25,21,38,37,52,48,43,50,52,53,51,0,21,25,26,22,48,52,53,50,43,51,53,18,17,0,22,26,27,23,50,53,18,17,43,37,36,54,52,0,24,16,17,25,37,36,54,52,43,52,54,55,53,0,25,17,18,26,52,54,55,53,43,53,55,19,18,0,26,18,19,27,53,55,19,18,43,23,27,56,46,0,0,1,2,3,27,26,56,46,43,46,56,57,47,0,3,2,4,5,46,56,57,47,43,4,0,47,57,0,6,7,5,4,1,0,47,57,43,27,31,58,56,0,1,8,9,2,26,31,58,56,43,56,58,59,57,0,2,9,10,4,56,58,59,57,43,57,59,8,4,0,4,10,11,6,57,59,8,1,43,31,35,60,58,0,8,12,13,9,31,35,60,58,43,58,60,61,59,0,9,13,14,10,58,60,61,59,43,59,61,12,8,0,10,14,15,11,59,61,12,8,43,35,39,48,60,0,12,16,17,13,35,39,49,60,43,60,48,49,61,0,13,17,18,14,60,49,51,61,43,61,49,16,12,0,14,18,19,15,61,51,16,12,43,3,7,62,41,0,0,1,2,3,7,6,62,43,43,41,62,63,40,0,3,2,4,5,43,62,63,41,43,40,63,24,20,0,5,4,6,7,41,63,21,20,43,7,11,64,62,0,1,8,9,2,6,11,64,62,43,62,64,65,63,0,2,9,10,4,62,64,65,63,43,63,65,28,24,0,4,10,11,6,63,65,28,21,43,11,15,66,64,0,8,12,13,9,11,15,66,64,43,64,66,67,65,0,9,13,14,10,64,66,67,65,43,65,67,32,28,0,10,14,15,11,65,67,32,28,43,15,19,55,66,0,12,16,17,13,15,19,55,66,43,66,55,54,67,0,13,17,18,14,66,55,54,67,43,67,54,36,32,0,14,18,19,15,67,54,36,32],
            "morphTargets": [],
            "uvs": [[0,1,0,0.75,0.333333,0.75,0.333333,1,0.666667,0.75,0.666667,1,1,0.75,1,1,0,0.5,0.333333,0.5,0.666667,0.5,1,0.5,0,0.25,0.333333,0.25,0.666667,0.25,1,0.25,0,0,0.333333,0,0.666667,0,1,0,0,0.666667,0.333333,0.666667,0.666667,0.666667,1,0.666667,0,0.333333,0.333333,0.333333,0.666667,0.333333,1,0.333333]],
            "animations": []
        },
        "uuid": "15641190-4052-3871-BF5E-F046F6B1B496",
        "materials": [{
            "depthTest": true,
            "colorAmbient": [0.690196,0.690196,0.690196],
            "DbgColor": 15658734,
            "specularCoef": 50,
            "opacity": 1,
            "colorEmissive": [0,0,0],
            "depthWrite": true,
            "DbgName": "Standard",
            "mapBumpScale": 1,
            "mapDiffuseWrap": ["RepeatWrapping","RepeatWrapping"],
            "mapBumpWrap": ["RepeatWrapping","RepeatWrapping"],
            "mapDiffuseRepeat": [1,1],
            "DbgIndex": 0,
            "colorDiffuse": [0.690196,0.690196,0.690196],
            "shading": "phong",
            "mapBumpRepeat": [1,1],
            "blending": "NormalBlending",
            "mapBump": "rock-01.jpg",
            "wireframe": false,
            "visible": true,
            "transparent": false,
            "colorSpecular": [0.012549,0.012549,0.012549],
            "mapBumpAnisotropy": 1,
            "mapDiffuseAnisotropy": 1,
            "mapDiffuse": "rock-01.jpg"
        }],
        "type": "Geometry"
    }],
    "animations": [{
        "fps": 29,
        "name": "default",
        "tracks": []
    }]
}