{
  "version": 1,
  "title": "Top pages",
  "type": "DataTable",
  "data": {
    "type": "cube_analytics",
    "query": {
      "measures": ["TrackedEvents.pageViewsCount"],
      "dimensions": ["TrackedEvents.docPath"],
      "limit": 100,
      "timezone": "UTC",
      "filters": [],
      "timeDimensions": []
    }
  },
  "options": {}
}
