[
    {
        "event_tag": "session",
        "time_keys": "start, end",
        "primary_keys": "session_name"
    },
    {
        "event_tag": "enter",
        "time_keys": "start",
        "primary_keys": "id"
    },
    {
        "event_tag": "out",
        "time_keys": "time",
        "primary_keys": "",
    }
]
