{
  "watch": ["./"],
  "ext": ".ts,.js,.json,.env",
  "ignore": ["node_modules", "tsconfig.json"],
  "exec": "TS_NODE_FILES=true node -r dotenv/config -r ts-node/register -r tsconfig-paths/register --inspect=:9229 ./lib/index.ts"
}