%YAML 1.1
%TAG !u! tag:unity3d.com,2011:
--- !u!114 &11400000
MonoBehaviour:
  m_ObjectHideFlags: 0
  m_CorrespondingSourceObject: {fileID: 0}
  m_PrefabInstance: {fileID: 0}
  m_PrefabAsset: {fileID: 0}
  m_GameObject: {fileID: 0}
  m_Enabled: 1
  m_EditorHideFlags: 0
  m_Script: {fileID: 11500000, guid: 182eb47472f64de388dd50183c0411d8, type: 3}
  m_Name: SO_Infocard_132512
  m_EditorClassIdentifier: 
  <Key>k__BackingField: 132512
  <Value>k__BackingField: 'We have information indicating that the centuries-long
    terraforming operations run by Planetform will never succeed. A top secret government
    report obtained by the Green Front asserts that the planets will lose their nascent
    atmospheres within several hundred years of completion of the process due to
    uncontrolled outgassing. Planets without a natural atmosphere just don''t have
    the density to retain one. Planetform is selling a bill of goods, and Bretonia
    knows this. But if Liberty also knew, the lawsuits would bankrupt Planetform
    and cripple Bretonia''s economy, so that report stayed buried. <br>


'
