%YAML 1.1
%TAG !u! tag:unity3d.com,2011:
--- !u!114 &11400000
MonoBehaviour:
  m_ObjectHideFlags: 0
  m_CorrespondingSourceObject: {fileID: 0}
  m_PrefabInstance: {fileID: 0}
  m_PrefabAsset: {fileID: 0}
  m_GameObject: {fileID: 0}
  m_Enabled: 1
  m_EditorHideFlags: 0
  m_Script: {fileID: 11500000, guid: 182eb47472f64de388dd50183c0411d8, type: 3}
  m_Name: SO_Infocard_132884
  m_EditorClassIdentifier: 
  <Key>k__BackingField: 132884
  <Value>k__BackingField: 'Kishiro competes directly with Samura in the New York-New
    Tokyo Luxury Goods and Niobium trade. We both suffer equally in Libertonian space
    at the hands of the Rogues and Xenos. Once we enter Kusari, we are targeted by
    different kinds of pirates. The Blood Dragons attack Samura mercilessly. We Kishiro
    merchants are targeted by the Farmer''s Alliance. The Farmers will never forgive
    us for turning our backs on the monarchy.<br>


'
