%YAML 1.1
%TAG !u! tag:unity3d.com,2011:
--- !u!114 &11400000
MonoBehaviour:
  m_ObjectHideFlags: 0
  m_CorrespondingSourceObject: {fileID: 0}
  m_PrefabInstance: {fileID: 0}
  m_PrefabAsset: {fileID: 0}
  m_GameObject: {fileID: 0}
  m_Enabled: 1
  m_EditorHideFlags: 0
  m_Script: {fileID: 11500000, guid: 182eb47472f64de388dd50183c0411d8, type: 3}
  m_Name: SO_Infocard_133249
  m_EditorClassIdentifier: 
  <Key>k__BackingField: 133249
  <Value>k__BackingField: 'We traveled to Sirius on a sleeper ship like everyone
    else. Our ship, the <i>Hispania</i>, fell victim to sabotage en route. We were
    forced to abandon her and make our way through the void. We found this planet
    with barely enough supplies to feed half of us. Few crops would grow in these
    infertile sands, and our numbers dwindled to almost nothing. <br><nbsp><br>


'
