%YAML 1.1
%TAG !u! tag:unity3d.com,2011:
--- !u!114 &11400000
MonoBehaviour:
  m_ObjectHideFlags: 0
  m_CorrespondingSourceObject: {fileID: 0}
  m_PrefabInstance: {fileID: 0}
  m_PrefabAsset: {fileID: 0}
  m_GameObject: {fileID: 0}
  m_Enabled: 1
  m_EditorHideFlags: 0
  m_Script: {fileID: 11500000, guid: b271f90cda31432883e1182aa0b8027c, type: 3}
  m_Name: SO_Faction_CrayterRepublic
  m_EditorClassIdentifier: 
  serializationData:
    SerializedFormat: 2
    SerializedBytes: 
    ReferencedUnityObjects:
    - {fileID: 11400000, guid: e75c52bfa34aa4d398da5af6de7da4ac, type: 2}
    - {fileID: 11400000, guid: 4663d8a4cf7844409ae4c9aedce5a497, type: 2}
    - {fileID: 11400000, guid: 4b2d9a80867584acea33efe59c397764, type: 2}
    - {fileID: 11400000, guid: 447a49d7c8e51492793ced160f8d42cb, type: 2}
    - {fileID: 11400000, guid: 095c5c4e3c074457c942014f226e6293, type: 2}
    - {fileID: 11400000, guid: 5ddc301b56cfb4344a71e27badc22f8a, type: 2}
    - {fileID: 11400000, guid: 42ace5e27ed2e4d45b6ba3eec1febb3b, type: 2}
    - {fileID: 11400000, guid: a70b59cc9080e4dde8635e2b48d833ae, type: 2}
    - {fileID: 11400000, guid: ba2aebfd30f7549c583823c825b13fb2, type: 2}
    - {fileID: 11400000, guid: feb985b5dcaff413f9bf2b8d56b77006, type: 2}
    - {fileID: 11400000, guid: 3c97090660d274d72a13819e37ff5c3e, type: 2}
    - {fileID: 11400000, guid: 811beb3ff1e3244508d2f3b576da2d4e, type: 2}
    - {fileID: 11400000, guid: 321c3cee18aed4f36a71e1637406e8e3, type: 2}
    - {fileID: 11400000, guid: 9f1fe5ebfab8c441eb4e132055568dd4, type: 2}
    - {fileID: 11400000, guid: 67ffa408a1a9447749bb5ff7ee243b9b, type: 2}
    - {fileID: 11400000, guid: cdf28eab446214afc9cdde5c5b1fdc56, type: 2}
    - {fileID: 11400000, guid: 4d255a13a9aa74a5bbc933f6612cfbd8, type: 2}
    - {fileID: 11400000, guid: fa4eae277dff14ddeaf77f2e6d8733e9, type: 2}
    - {fileID: 11400000, guid: 31bcdaa44a39e41cf8d8f96c4be0eb8b, type: 2}
    - {fileID: 11400000, guid: 0b7372911ddca4c41afc4a519e8789cc, type: 2}
    - {fileID: 11400000, guid: 03837e36b34bb4cc397529402f904f02, type: 2}
    - {fileID: 11400000, guid: b912e9a9dd9d341c082b652f078bb0c9, type: 2}
    - {fileID: 11400000, guid: 722352bd79f0c4e7b995d5bbe260f142, type: 2}
    - {fileID: 11400000, guid: fbf1acf641a64433881d9709856dc56e, type: 2}
    - {fileID: 11400000, guid: b8d151a1645634f029ba5f8526c03c84, type: 2}
    - {fileID: 11400000, guid: 1cfbce05a548d4ba7ac6c1e2a3422e92, type: 2}
    - {fileID: 11400000, guid: cb549f2c48dc04ba7b9cb3f8fb1781ea, type: 2}
    - {fileID: 11400000, guid: a41ae297b9f1a4efd947a1fc33bdea07, type: 2}
    - {fileID: 11400000, guid: 7dade53f9d9ab4406b3306688f497d19, type: 2}
    - {fileID: 11400000, guid: b645be6987fed4fcabc6a64ebff080ce, type: 2}
    - {fileID: 11400000, guid: 03a3820ec673a420ca33bbddd4f1a9b5, type: 2}
    - {fileID: 11400000, guid: 9ae47aa9a9c0d4e70a27b82838df6e07, type: 2}
    - {fileID: 11400000, guid: 98e99277912a248b6899f7e55e52e7f7, type: 2}
    - {fileID: 11400000, guid: 8318430b7fcbe4142bc3ec7632dd9dd0, type: 2}
    - {fileID: 11400000, guid: e119e7ef8b4284daf97d4a763511c0dc, type: 2}
    - {fileID: 11400000, guid: 5d26794f7b64a4d319b44cc08e28c7e3, type: 2}
    - {fileID: 11400000, guid: 43091503a940845579406a5a7b8235b5, type: 2}
    - {fileID: 11400000, guid: 9f533706adeab4058933c394114bed7f, type: 2}
    - {fileID: 11400000, guid: a9a49ff9e69534d6f9f02bec6a00481c, type: 2}
    - {fileID: 11400000, guid: 971b3ce4211784b14bd6b1c5f1352169, type: 2}
    - {fileID: 11400000, guid: 4cc553f1f49264fc5a0ae61edab1682d, type: 2}
    - {fileID: 11400000, guid: 4d98b6455ee2040ed9edbf8d0e3040f4, type: 2}
    - {fileID: 11400000, guid: d497157d2c4ea4483a4ab971712a2337, type: 2}
    - {fileID: 11400000, guid: 6ccb7e0aad76a4a9ea73d2f8ce62f515, type: 2}
    - {fileID: 11400000, guid: acc470f2ff8124ae6ba1de8124865f42, type: 2}
    - {fileID: 11400000, guid: 0101dde6501c043fd8afeae0757ff484, type: 2}
    - {fileID: 11400000, guid: a462f364906b84a8f8c9d4727221b1e1, type: 2}
    - {fileID: 11400000, guid: 31a991ba5f8744098b14eb746798813b, type: 2}
    - {fileID: 11400000, guid: f172ed5dc60714374b3ad575f68ee6da, type: 2}
    - {fileID: 11400000, guid: dd7945856c36b4c41ada0a2f534592d1, type: 2}
    - {fileID: 11400000, guid: 2470566b8c44044a989c45367c17c9d5, type: 2}
    - {fileID: 11400000, guid: caab24e5a2ef44a01a665e3a35bf6e20, type: 2}
    - {fileID: 11400000, guid: 1347a80b0d70f4fffa98426a4cf378ce, type: 2}
    - {fileID: 11400000, guid: 2602db9c5df2e42a0816030001fd6ec9, type: 2}
    - {fileID: 11400000, guid: 4eddcb15ff6ce434a8fb814f0559e5d8, type: 2}
    - {fileID: 11400000, guid: 8d439331eda7f4eeb9af066efa4dde47, type: 2}
    - {fileID: 11400000, guid: 2d19e98150525400281bd5c72b2a4e50, type: 2}
    - {fileID: 11400000, guid: 9f4cb2220d2e04fe1991d339021c5fb5, type: 2}
    - {fileID: 11400000, guid: ff663f1749a98402cacb5aa74496f2c8, type: 2}
    - {fileID: 11400000, guid: 39a508687043e47d48900407d38fcb8f, type: 2}
    - {fileID: 11400000, guid: de50268155c94491e804fb0c02a27b99, type: 2}
    - {fileID: 11400000, guid: a932471a9361f4fbab38116fabe2724a, type: 2}
    - {fileID: 11400000, guid: 17f219bbfd17e4091be0d0c41099dec1, type: 2}
    - {fileID: 11400000, guid: bfd277dbbd3ec474284c571dbea3f95d, type: 2}
    - {fileID: 11400000, guid: c2ba6a7d09d904769b2fb7bbbb094193, type: 2}
    - {fileID: 11400000, guid: ac6a37c295e92445092afc1b30b0f1dc, type: 2}
    - {fileID: 11400000, guid: c9dd56820af964a71b58257caf13fa53, type: 2}
    - {fileID: 11400000, guid: d9962d10f0e4d4beb8ab451c2c405d69, type: 2}
    - {fileID: 11400000, guid: c863045e842ea4357a5c1677926a46db, type: 2}
    - {fileID: 11400000, guid: 3afe7e76667b14a359b02720506d24c0, type: 2}
    - {fileID: 11400000, guid: bd490e6a94a5d44b1b0f40395d9593c1, type: 2}
    - {fileID: 11400000, guid: 3b6438dba3b134cb3bc51591457c569d, type: 2}
    - {fileID: 11400000, guid: 464bb7887eb8946f686eabec6f148643, type: 2}
    - {fileID: 11400000, guid: 5a4365bcb7a3d40439217b0c75491b17, type: 2}
    - {fileID: 11400000, guid: 7450b5fb802c645308f97d9c6914e4fa, type: 2}
    - {fileID: 11400000, guid: a41a50b27088740acb6b384ab5630cd7, type: 2}
    - {fileID: 11400000, guid: 9b9485aca89fc43c48e1fcf765e372a4, type: 2}
    - {fileID: 11400000, guid: 220c591942f4a4409a689cf57eaceb8a, type: 2}
    - {fileID: 11400000, guid: 97095575bf11d47ae90c7450e613faf9, type: 2}
    - {fileID: 11400000, guid: f228fa1cace8a4e779f24a6768104b02, type: 2}
    - {fileID: 11400000, guid: 04e75eb53faa84ab3b73bccd5efb4703, type: 2}
    - {fileID: 11400000, guid: 24ed971b6900f4974af67d21f5e7f0d7, type: 2}
    - {fileID: 11400000, guid: 0fcb30d261bf74d27b331fd95289a684, type: 2}
    - {fileID: 11400000, guid: dd7def26a443b4da48f0b8464ab15a08, type: 2}
    - {fileID: 11400000, guid: aad0ad79a2fd6440ebc04eed95f0aeea, type: 2}
    - {fileID: 11400000, guid: e17ff4f758afb43fa989299dc4a16011, type: 2}
    - {fileID: 11400000, guid: 77876e58f913a467ab7e70f64fc1d426, type: 2}
    - {fileID: 11400000, guid: 9580ebceaa066400ca1d171e5f029136, type: 2}
    - {fileID: 11400000, guid: 576cc31217f6e4434b643cb0fce67ca8, type: 2}
    SerializedBytesString: 
    Prefab: {fileID: 0}
    PrefabModificationsReferencedUnityObjects: []
    PrefabModifications: []
    SerializationNodes:
    - Name: <Name>k__BackingField
      Entry: 10
      Data: 0
    - Name: <ShortName>k__BackingField
      Entry: 10
      Data: 1
    - Name: <Infocard>k__BackingField
      Entry: 10
      Data: 2
    - Name: <Reputations>k__BackingField
      Entry: 7
      Data: 0|System.Collections.Generic.Dictionary`2[[FreelancerDataTool.Interfaces.IFaction,
        Assembly-CSharp],[System.Single, mscorlib]], mscorlib
    - Name: comparer
      Entry: 7
      Data: 1|System.Collections.Generic.ObjectEqualityComparer`1[[FreelancerDataTool.Interfaces.IFaction,
        Assembly-CSharp]], mscorlib
    - Name: 
      Entry: 8
      Data: 
    - Name: 
      Entry: 12
      Data: 18
    - Name: 
      Entry: 7
      Data: 
    - Name: $k
      Entry: 10
      Data: 3
    - Name: $v
      Entry: 4
      Data: -0.65
    - Name: 
      Entry: 8
      Data: 
    - Name: 
      Entry: 7
      Data: 
    - Name: $k
      Entry: 10
      Data: 4
    - Name: $v
      Entry: 4
      Data: -0.65
    - Name: 
      Entry: 8
      Data: 
    - Name: 
      Entry: 7
      Data: 
    - Name: $k
      Entry: 10
      Data: 5
    - Name: $v
      Entry: 4
      Data: -0.65
    - Name: 
      Entry: 8
      Data: 
    - Name: 
      Entry: 7
      Data: 
    - Name: $k
      Entry: 10
      Data: 6
    - Name: $v
      Entry: 4
      Data: -0.65
    - Name: 
      Entry: 8
      Data: 
    - Name: 
      Entry: 7
      Data: 
    - Name: $k
      Entry: 10
      Data: 7
    - Name: $v
      Entry: 4
      Data: -0.65
    - Name: 
      Entry: 8
      Data: 
    - Name: 
      Entry: 7
      Data: 
    - Name: $k
      Entry: 10
      Data: 8
    - Name: $v
      Entry: 4
      Data: -0.65
    - Name: 
      Entry: 8
      Data: 
    - Name: 
      Entry: 7
      Data: 
    - Name: $k
      Entry: 10
      Data: 9
    - Name: $v
      Entry: 4
      Data: -0.65
    - Name: 
      Entry: 8
      Data: 
    - Name: 
      Entry: 7
      Data: 
    - Name: $k
      Entry: 10
      Data: 10
    - Name: $v
      Entry: 4
      Data: -0.65
    - Name: 
      Entry: 8
      Data: 
    - Name: 
      Entry: 7
      Data: 
    - Name: $k
      Entry: 10
      Data: 11
    - Name: $v
      Entry: 4
      Data: -0.65
    - Name: 
      Entry: 8
      Data: 
    - Name: 
      Entry: 7
      Data: 
    - Name: $k
      Entry: 10
      Data: 12
    - Name: $v
      Entry: 4
      Data: -0.65
    - Name: 
      Entry: 8
      Data: 
    - Name: 
      Entry: 7
      Data: 
    - Name: $k
      Entry: 10
      Data: 13
    - Name: $v
      Entry: 4
      Data: -0.3
    - Name: 
      Entry: 8
      Data: 
    - Name: 
      Entry: 7
      Data: 
    - Name: $k
      Entry: 10
      Data: 14
    - Name: $v
      Entry: 4
      Data: -0.3
    - Name: 
      Entry: 8
      Data: 
    - Name: 
      Entry: 7
      Data: 
    - Name: $k
      Entry: 10
      Data: 15
    - Name: $v
      Entry: 4
      Data: -0.3
    - Name: 
      Entry: 8
      Data: 
    - Name: 
      Entry: 7
      Data: 
    - Name: $k
      Entry: 10
      Data: 16
    - Name: $v
      Entry: 4
      Data: -0.3
    - Name: 
      Entry: 8
      Data: 
    - Name: 
      Entry: 7
      Data: 
    - Name: $k
      Entry: 10
      Data: 17
    - Name: $v
      Entry: 4
      Data: -0.3
    - Name: 
      Entry: 8
      Data: 
    - Name: 
      Entry: 7
      Data: 
    - Name: $k
      Entry: 10
      Data: 18
    - Name: $v
      Entry: 4
      Data: -0.3
    - Name: 
      Entry: 8
      Data: 
    - Name: 
      Entry: 7
      Data: 
    - Name: $k
      Entry: 10
      Data: 19
    - Name: $v
      Entry: 4
      Data: 0.65
    - Name: 
      Entry: 8
      Data: 
    - Name: 
      Entry: 7
      Data: 
    - Name: $k
      Entry: 10
      Data: 20
    - Name: $v
      Entry: 4
      Data: 0.65
    - Name: 
      Entry: 8
      Data: 
    - Name: 
      Entry: 13
      Data: 
    - Name: 
      Entry: 8
      Data: 
    - Name: <NpcBribers>k__BackingField
      Entry: 7
      Data: 2|System.Collections.Generic.Dictionary`2[[FreelancerDataTool.Interfaces.INpc,
        Assembly-CSharp],[System.Single, mscorlib]], mscorlib
    - Name: comparer
      Entry: 7
      Data: 3|System.Collections.Generic.ObjectEqualityComparer`1[[FreelancerDataTool.Interfaces.INpc,
        Assembly-CSharp]], mscorlib
    - Name: 
      Entry: 8
      Data: 
    - Name: 
      Entry: 12
      Data: 15
    - Name: 
      Entry: 7
      Data: 
    - Name: $k
      Entry: 10
      Data: 21
    - Name: $v
      Entry: 4
      Data: 840
    - Name: 
      Entry: 8
      Data: 
    - Name: 
      Entry: 7
      Data: 
    - Name: $k
      Entry: 10
      Data: 22
    - Name: $v
      Entry: 4
      Data: 840
    - Name: 
      Entry: 8
      Data: 
    - Name: 
      Entry: 7
      Data: 
    - Name: $k
      Entry: 10
      Data: 23
    - Name: $v
      Entry: 4
      Data: 840
    - Name: 
      Entry: 8
      Data: 
    - Name: 
      Entry: 7
      Data: 
    - Name: $k
      Entry: 10
      Data: 24
    - Name: $v
      Entry: 4
      Data: 840
    - Name: 
      Entry: 8
      Data: 
    - Name: 
      Entry: 7
      Data: 
    - Name: $k
      Entry: 10
      Data: 25
    - Name: $v
      Entry: 4
      Data: 840
    - Name: 
      Entry: 8
      Data: 
    - Name: 
      Entry: 7
      Data: 
    - Name: $k
      Entry: 10
      Data: 26
    - Name: $v
      Entry: 4
      Data: 840
    - Name: 
      Entry: 8
      Data: 
    - Name: 
      Entry: 7
      Data: 
    - Name: $k
      Entry: 10
      Data: 27
    - Name: $v
      Entry: 4
      Data: 840
    - Name: 
      Entry: 8
      Data: 
    - Name: 
      Entry: 7
      Data: 
    - Name: $k
      Entry: 10
      Data: 28
    - Name: $v
      Entry: 4
      Data: 840
    - Name: 
      Entry: 8
      Data: 
    - Name: 
      Entry: 7
      Data: 
    - Name: $k
      Entry: 10
      Data: 29
    - Name: $v
      Entry: 4
      Data: 840
    - Name: 
      Entry: 8
      Data: 
    - Name: 
      Entry: 7
      Data: 
    - Name: $k
      Entry: 10
      Data: 30
    - Name: $v
      Entry: 4
      Data: 840
    - Name: 
      Entry: 8
      Data: 
    - Name: 
      Entry: 7
      Data: 
    - Name: $k
      Entry: 10
      Data: 31
    - Name: $v
      Entry: 4
      Data: 840
    - Name: 
      Entry: 8
      Data: 
    - Name: 
      Entry: 7
      Data: 
    - Name: $k
      Entry: 10
      Data: 32
    - Name: $v
      Entry: 4
      Data: 840
    - Name: 
      Entry: 8
      Data: 
    - Name: 
      Entry: 7
      Data: 
    - Name: $k
      Entry: 10
      Data: 33
    - Name: $v
      Entry: 4
      Data: 840
    - Name: 
      Entry: 8
      Data: 
    - Name: 
      Entry: 7
      Data: 
    - Name: $k
      Entry: 10
      Data: 34
    - Name: $v
      Entry: 4
      Data: 840
    - Name: 
      Entry: 8
      Data: 
    - Name: 
      Entry: 7
      Data: 
    - Name: $k
      Entry: 10
      Data: 35
    - Name: $v
      Entry: 4
      Data: 840
    - Name: 
      Entry: 8
      Data: 
    - Name: 
      Entry: 13
      Data: 
    - Name: 
      Entry: 8
      Data: 
    - Name: <ShipsUsed>k__BackingField
      Entry: 7
      Data: 4|System.Collections.Generic.List`1[[FreelancerDataTool.Interfaces.IShip,
        Assembly-CSharp]], mscorlib
    - Name: 
      Entry: 12
      Data: 14
    - Name: 
      Entry: 10
      Data: 36
    - Name: 
      Entry: 10
      Data: 37
    - Name: 
      Entry: 10
      Data: 38
    - Name: 
      Entry: 10
      Data: 39
    - Name: 
      Entry: 10
      Data: 40
    - Name: 
      Entry: 10
      Data: 41
    - Name: 
      Entry: 10
      Data: 42
    - Name: 
      Entry: 10
      Data: 43
    - Name: 
      Entry: 10
      Data: 44
    - Name: 
      Entry: 10
      Data: 45
    - Name: 
      Entry: 10
      Data: 46
    - Name: 
      Entry: 10
      Data: 47
    - Name: 
      Entry: 10
      Data: 48
    - Name: 
      Entry: 10
      Data: 49
    - Name: 
      Entry: 13
      Data: 
    - Name: 
      Entry: 8
      Data: 
    - Name: <OwnedBases>k__BackingField
      Entry: 7
      Data: 5|System.Collections.Generic.List`1[[FreelancerDataTool.Interfaces.IBase,
        Assembly-CSharp]], mscorlib
    - Name: 
      Entry: 12
      Data: 3
    - Name: 
      Entry: 10
      Data: 50
    - Name: 
      Entry: 10
      Data: 51
    - Name: 
      Entry: 10
      Data: 52
    - Name: 
      Entry: 13
      Data: 
    - Name: 
      Entry: 8
      Data: 
    - Name: <Npcs>k__BackingField
      Entry: 7
      Data: 6|System.Collections.Generic.List`1[[FreelancerDataTool.Interfaces.INpc,
        Assembly-CSharp]], mscorlib
    - Name: 
      Entry: 12
      Data: 43
    - Name: 
      Entry: 10
      Data: 53
    - Name: 
      Entry: 10
      Data: 54
    - Name: 
      Entry: 10
      Data: 55
    - Name: 
      Entry: 10
      Data: 56
    - Name: 
      Entry: 10
      Data: 57
    - Name: 
      Entry: 10
      Data: 23
    - Name: 
      Entry: 10
      Data: 58
    - Name: 
      Entry: 10
      Data: 59
    - Name: 
      Entry: 10
      Data: 60
    - Name: 
      Entry: 10
      Data: 61
    - Name: 
      Entry: 10
      Data: 62
    - Name: 
      Entry: 10
      Data: 63
    - Name: 
      Entry: 10
      Data: 24
    - Name: 
      Entry: 10
      Data: 64
    - Name: 
      Entry: 10
      Data: 65
    - Name: 
      Entry: 10
      Data: 66
    - Name: 
      Entry: 10
      Data: 67
    - Name: 
      Entry: 10
      Data: 25
    - Name: 
      Entry: 10
      Data: 26
    - Name: 
      Entry: 10
      Data: 68
    - Name: 
      Entry: 10
      Data: 69
    - Name: 
      Entry: 10
      Data: 70
    - Name: 
      Entry: 10
      Data: 71
    - Name: 
      Entry: 10
      Data: 72
    - Name: 
      Entry: 10
      Data: 73
    - Name: 
      Entry: 10
      Data: 74
    - Name: 
      Entry: 10
      Data: 75
    - Name: 
      Entry: 10
      Data: 30
    - Name: 
      Entry: 10
      Data: 76
    - Name: 
      Entry: 10
      Data: 77
    - Name: 
      Entry: 10
      Data: 78
    - Name: 
      Entry: 10
      Data: 79
    - Name: 
      Entry: 10
      Data: 80
    - Name: 
      Entry: 10
      Data: 81
    - Name: 
      Entry: 10
      Data: 31
    - Name: 
      Entry: 10
      Data: 82
    - Name: 
      Entry: 10
      Data: 83
    - Name: 
      Entry: 10
      Data: 84
    - Name: 
      Entry: 10
      Data: 85
    - Name: 
      Entry: 10
      Data: 86
    - Name: 
      Entry: 10
      Data: 87
    - Name: 
      Entry: 10
      Data: 88
    - Name: 
      Entry: 10
      Data: 35
    - Name: 
      Entry: 13
      Data: 
    - Name: 
      Entry: 8
      Data: 
  <Nickname>k__BackingField: fc_rn_grp
  <Logo>k__BackingField: {fileID: 21300000, guid: 97b6c56fbb0334e55b6ce3e004c5cea2, type: 3}
  <Legality>k__BackingField: lawful
  <JumpPreference>k__BackingField: any
  <ScanAnnounce>k__BackingField: 1
  <ScanChance>k__BackingField: 0.4
