%YAML 1.1
%TAG !u! tag:unity3d.com,2011:
--- !u!114 &11400000
MonoBehaviour:
  m_ObjectHideFlags: 0
  m_CorrespondingSourceObject: {fileID: 0}
  m_PrefabInstance: {fileID: 0}
  m_PrefabAsset: {fileID: 0}
  m_GameObject: {fileID: 0}
  m_Enabled: 1
  m_EditorHideFlags: 0
  m_Script: {fileID: 11500000, guid: 182eb47472f64de388dd50183c0411d8, type: 3}
  m_Name: SO_Infocard_462628
  m_EditorClassIdentifier: 
  <Key>k__BackingField: 462628
  <Value>k__BackingField: 'When we heard about the attack on Red Deer Station we
    thought it was a mixed bag for the Bounty Hunter''s Guild. On the one hand, Liberty''s
    typical lust for vengeance might result in some extra high paying bounties. But
    on the other hand, an attack on a police outpost is just the sort of thing that
    gets those preening Navy types talking about "jurisdiction", when they really
    just want to hog all the glory and press coverage. Still, a few of us are here
    doing patrols, and we''ll see what shakes out. So far, LPI seems to have run
    with its tail between its legs, and the Navy doesn''t seem motivated enough to
    even enter the system.<br>


'
