%YAML 1.1
%TAG !u! tag:unity3d.com,2011:
--- !u!114 &11400000
MonoBehaviour:
  m_ObjectHideFlags: 0
  m_CorrespondingSourceObject: {fileID: 0}
  m_PrefabInstance: {fileID: 0}
  m_PrefabAsset: {fileID: 0}
  m_GameObject: {fileID: 0}
  m_Enabled: 1
  m_EditorHideFlags: 0
  m_Script: {fileID: 11500000, guid: 77745e53922c405d884b74e75f714afa, type: 3}
  m_Name: SO_Npc_BountyHunterHunterLizBecker
  m_EditorClassIdentifier: 
  serializationData:
    SerializedFormat: 2
    SerializedBytes: 
    ReferencedUnityObjects:
    - {fileID: 11400000, guid: 9a4ebbda7c8744dc7b6992987c3d9315, type: 2}
    - {fileID: 11400000, guid: 93a65ecafd45a4ae7ad65c85a1cdfc02, type: 2}
    - {fileID: 11400000, guid: 40c3ce01a8b4c4d379e10a23e2c69545, type: 2}
    - {fileID: 11400000, guid: 0420cf83d448a4041bd7dbaab3df644a, type: 2}
    - {fileID: 11400000, guid: 2d47234e1ac254c7c9e9e107a5263bfc, type: 2}
    - {fileID: 11400000, guid: f959171c492af419197f03823cd44df2, type: 2}
    - {fileID: 11400000, guid: a3fb417e71d834917a665386c89c8ab8, type: 2}
    - {fileID: 11400000, guid: 9ba86632eb77842f1b6f38fc55a94747, type: 2}
    - {fileID: 11400000, guid: 542a93806dd43421bac04efa072fcfb0, type: 2}
    - {fileID: 11400000, guid: 9d39dc4b5c2e74a3d99271afa15f7cb4, type: 2}
    - {fileID: 11400000, guid: 70ad9767ecd1c4daf9a380d09a64341e, type: 2}
    - {fileID: 11400000, guid: 540bd0c70443d4700a98044166a4d8b8, type: 2}
    SerializedBytesString: 
    Prefab: {fileID: 0}
    PrefabModificationsReferencedUnityObjects: []
    PrefabModifications: []
    SerializationNodes:
    - Name: <Name>k__BackingField
      Entry: 10
      Data: 0
    - Name: <Base>k__BackingField
      Entry: 10
      Data: 1
    - Name: <Affiliation>k__BackingField
      Entry: 10
      Data: 2
    - Name: <Bribes>k__BackingField
      Entry: 7
      Data: 0|System.Collections.Generic.Dictionary`2[[FreelancerDataTool.Interfaces.IFaction,
        Assembly-CSharp],[System.Int32, mscorlib]], mscorlib
    - Name: comparer
      Entry: 7
      Data: 1|System.Collections.Generic.ObjectEqualityComparer`1[[FreelancerDataTool.Interfaces.IFaction,
        Assembly-CSharp]], mscorlib
    - Name: 
      Entry: 8
      Data: 
    - Name: 
      Entry: 12
      Data: 3
    - Name: 
      Entry: 7
      Data: 
    - Name: $k
      Entry: 10
      Data: 3
    - Name: $v
      Entry: 3
      Data: 840
    - Name: 
      Entry: 8
      Data: 
    - Name: 
      Entry: 7
      Data: 
    - Name: $k
      Entry: 10
      Data: 2
    - Name: $v
      Entry: 3
      Data: 840
    - Name: 
      Entry: 8
      Data: 
    - Name: 
      Entry: 7
      Data: 
    - Name: $k
      Entry: 10
      Data: 4
    - Name: $v
      Entry: 3
      Data: 840
    - Name: 
      Entry: 8
      Data: 
    - Name: 
      Entry: 13
      Data: 
    - Name: 
      Entry: 8
      Data: 
    - Name: <Rumors>k__BackingField
      Entry: 7
      Data: 2|System.Collections.Generic.List`1[[FreelancerDataTool.Interfaces.IInfocard,
        Assembly-CSharp]], mscorlib
    - Name: 
      Entry: 12
      Data: 7
    - Name: 
      Entry: 10
      Data: 5
    - Name: 
      Entry: 10
      Data: 6
    - Name: 
      Entry: 10
      Data: 7
    - Name: 
      Entry: 10
      Data: 8
    - Name: 
      Entry: 10
      Data: 9
    - Name: 
      Entry: 10
      Data: 10
    - Name: 
      Entry: 10
      Data: 11
    - Name: 
      Entry: 13
      Data: 
    - Name: 
      Entry: 8
      Data: 
  <Nickname>k__BackingField: ew0302_bounty_001_f
  <Room>k__BackingField: bar
