%YAML 1.1
%TAG !u! tag:unity3d.com,2011:
--- !u!114 &11400000
MonoBehaviour:
  m_ObjectHideFlags: 0
  m_CorrespondingSourceObject: {fileID: 0}
  m_PrefabInstance: {fileID: 0}
  m_PrefabAsset: {fileID: 0}
  m_GameObject: {fileID: 0}
  m_Enabled: 1
  m_EditorHideFlags: 0
  m_Script: {fileID: 11500000, guid: ac6f300716fb477b98dee1a497bbb338, type: 3}
  m_Name: SO_Base_KansaiResearchInstitute
  m_EditorClassIdentifier: 
  serializationData:
    SerializedFormat: 2
    SerializedBytes: 
    ReferencedUnityObjects:
    - {fileID: 11400000, guid: 9af1e58d6561b436680ac2e7c6e29d33, type: 2}
    - {fileID: 11400000, guid: 8c73a3eaf909e480396877a3ef22c42b, type: 2}
    - {fileID: 11400000, guid: d96d4558b119747a99b8cc7ffd692e1d, type: 2}
    - {fileID: 11400000, guid: 4a88d66dcecb34024b890710a6406b16, type: 2}
    SerializedBytesString: 
    Prefab: {fileID: 0}
    PrefabModificationsReferencedUnityObjects: []
    PrefabModifications: []
    SerializationNodes:
    - Name: <Name>k__BackingField
      Entry: 10
      Data: 0
    - Name: <Infocard>k__BackingField
      Entry: 10
      Data: 1
    - Name: <System>k__BackingField
      Entry: 10
      Data: 2
    - Name: <Reputation>k__BackingField
      Entry: 10
      Data: 3
  <Nickname>k__BackingField: Ku04_04_Base
