%YAML 1.1
%TAG !u! tag:unity3d.com,2011:
--- !u!114 &11400000
MonoBehaviour:
  m_ObjectHideFlags: 0
  m_CorrespondingSourceObject: {fileID: 0}
  m_PrefabInstance: {fileID: 0}
  m_PrefabAsset: {fileID: 0}
  m_GameObject: {fileID: 0}
  m_Enabled: 1
  m_EditorHideFlags: 0
  m_Script: {fileID: 11500000, guid: 182eb47472f64de388dd50183c0411d8, type: 3}
  m_Name: SO_Infocard_509705
  m_EditorClassIdentifier: 
  <Key>k__BackingField: 509705
  <Value>k__BackingField: 'Here in the Maquis, we have two kinds of members. The
    majority of us are ex-soldiers, many of whom have lost everything they care about.
    The latter are hardened criminals and anarchists, who are quite happy to burn
    Royalists and fill their own pockets at the same time.<br>


'
