%YAML 1.1
%TAG !u! tag:unity3d.com,2011:
--- !u!114 &11400000
MonoBehaviour:
  m_ObjectHideFlags: 0
  m_CorrespondingSourceObject: {fileID: 0}
  m_PrefabInstance: {fileID: 0}
  m_PrefabAsset: {fileID: 0}
  m_GameObject: {fileID: 0}
  m_Enabled: 1
  m_EditorHideFlags: 0
  m_Script: {fileID: 11500000, guid: 182eb47472f64de388dd50183c0411d8, type: 3}
  m_Name: SO_Infocard_515033
  m_EditorClassIdentifier: 
  <Key>k__BackingField: 515033
  <Value>k__BackingField: 'What do you want from me? The Order already knows everything.
    Me and many others were abandoned by the Core after they deemed Dabadoru to be
    lost. We were expendable! Sure, some of our own liked it here - given their options.
    Volunteers like me were sent to Order space but since I had wide knowledge of
    Dabadoru''s maintenance they left me here. What about actual Core survivors?
    They fought to the end for the most part - those who did not, were executed anyway.<br>


'
