%YAML 1.1
%TAG !u! tag:unity3d.com,2011:
--- !u!114 &11400000
MonoBehaviour:
  m_ObjectHideFlags: 0
  m_CorrespondingSourceObject: {fileID: 0}
  m_PrefabInstance: {fileID: 0}
  m_PrefabAsset: {fileID: 0}
  m_GameObject: {fileID: 0}
  m_Enabled: 1
  m_EditorHideFlags: 0
  m_Script: {fileID: 11500000, guid: 182eb47472f64de388dd50183c0411d8, type: 3}
  m_Name: SO_Infocard_131322
  m_EditorClassIdentifier: 
  <Key>k__BackingField: 131322
  <Value>k__BackingField: 'Unlike other Liberty Navy battleships, the Missouri''s
    commander isn''t patient with Prisoners. Rather than throwing them in the brig
    until a Prison Liner can pick them up for Texas, he has his pilots deliver them
    directly to Fort Bush.<br>


'
