%YAML 1.1
%TAG !u! tag:unity3d.com,2011:
--- !u!114 &11400000
MonoBehaviour:
  m_ObjectHideFlags: 0
  m_CorrespondingSourceObject: {fileID: 0}
  m_PrefabInstance: {fileID: 0}
  m_PrefabAsset: {fileID: 0}
  m_GameObject: {fileID: 0}
  m_Enabled: 1
  m_EditorHideFlags: 0
  m_Script: {fileID: 11500000, guid: 182eb47472f64de388dd50183c0411d8, type: 3}
  m_Name: SO_Infocard_475412
  m_EditorClassIdentifier: 
  <Key>k__BackingField: 475412
  <Value>k__BackingField: 'One of our cardamine transports just arrived at Morioka.
    It is a dangerous journey to travel all the way to Malta, but it is most profitable
    to buy directly from the source. The Kusari State Police is attempting to discover
    our smuggling routes, but we are well aware of this and keep changing them. There
    are many ways to depart and enter Kusari, more ways than they are aware of. <br>


'
