%YAML 1.1
%TAG !u! tag:unity3d.com,2011:
--- !u!114 &11400000
MonoBehaviour:
  m_ObjectHideFlags: 0
  m_CorrespondingSourceObject: {fileID: 0}
  m_PrefabInstance: {fileID: 0}
  m_PrefabAsset: {fileID: 0}
  m_GameObject: {fileID: 0}
  m_Enabled: 1
  m_EditorHideFlags: 0
  m_Script: {fileID: 11500000, guid: 182eb47472f64de388dd50183c0411d8, type: 3}
  m_Name: SO_Infocard_131172
  m_EditorClassIdentifier: 
  <Key>k__BackingField: 131172
  <Value>k__BackingField: 'The income we get from hauling scrap to the Sugarland
    from the debris in this system goes into our Xenos account. The Xenos account
    is the money we use to hire Junker-friendly smugglers and pirates to attack the
    Xenos and defend us against their attacks. What a waste of money.<br>


'
