%YAML 1.1
%TAG !u! tag:unity3d.com,2011:
--- !u!114 &11400000
MonoBehaviour:
  m_ObjectHideFlags: 0
  m_CorrespondingSourceObject: {fileID: 0}
  m_PrefabInstance: {fileID: 0}
  m_PrefabAsset: {fileID: 0}
  m_GameObject: {fileID: 0}
  m_Enabled: 1
  m_EditorHideFlags: 0
  m_Script: {fileID: 11500000, guid: 182eb47472f64de388dd50183c0411d8, type: 3}
  m_Name: SO_Infocard_131269
  m_EditorClassIdentifier: 
  <Key>k__BackingField: 131269
  <Value>k__BackingField: 'We ship Manhattan''s famous Luxury Goods to the booming
    destinations of Curacao and Baden Baden. A lot of the ultra rich go to Cortez
    or Stuttgart to play or retire. They are newer systems that cater to the elite.
    Of course, during the war with Rheinland, Libertonians detour through Bretonia
    to reach Baden Baden.<br>


'
