%YAML 1.1
%TAG !u! tag:unity3d.com,2011:
--- !u!114 &11400000
MonoBehaviour:
  m_ObjectHideFlags: 0
  m_CorrespondingSourceObject: {fileID: 0}
  m_PrefabInstance: {fileID: 0}
  m_PrefabAsset: {fileID: 0}
  m_GameObject: {fileID: 0}
  m_Enabled: 1
  m_EditorHideFlags: 0
  m_Script: {fileID: 11500000, guid: 182eb47472f64de388dd50183c0411d8, type: 3}
  m_Name: SO_Infocard_468207
  m_EditorClassIdentifier: 
  <Key>k__BackingField: 468207
  <Value>k__BackingField: 'Hunting Corsairs? No, I''m tracking someone else. My brother
    to be exact. The lad left Bretonia two weeks ago with the idea of chasing a high-value
    mark. Last I heared he was headed to Omega-48, but I haven''t heared from him
    since. If the Corsairs already got him, he''s a goner, that''s for sure. <br>


'
