%YAML 1.1
%TAG !u! tag:unity3d.com,2011:
--- !u!114 &11400000
MonoBehaviour:
  m_ObjectHideFlags: 0
  m_CorrespondingSourceObject: {fileID: 0}
  m_PrefabInstance: {fileID: 0}
  m_PrefabAsset: {fileID: 0}
  m_GameObject: {fileID: 0}
  m_Enabled: 1
  m_EditorHideFlags: 0
  m_Script: {fileID: 11500000, guid: 182eb47472f64de388dd50183c0411d8, type: 3}
  m_Name: SO_Infocard_134216
  m_EditorClassIdentifier: 
  <Key>k__BackingField: 134216
  <Value>k__BackingField: 'Along with basic supplies, we also purchase Side Arms
    and Engine Components from the Junkers in New Berlin to ship here. Surplus weapons
    and engine parts get sent to Freital. <br><nbsp><br>


'
