%YAML 1.1
%TAG !u! tag:unity3d.com,2011:
--- !u!114 &11400000
MonoBehaviour:
  m_ObjectHideFlags: 0
  m_CorrespondingSourceObject: {fileID: 0}
  m_PrefabInstance: {fileID: 0}
  m_PrefabAsset: {fileID: 0}
  m_GameObject: {fileID: 0}
  m_Enabled: 1
  m_EditorHideFlags: 0
  m_Script: {fileID: 11500000, guid: 182eb47472f64de388dd50183c0411d8, type: 3}
  m_Name: SO_Infocard_131539
  m_EditorClassIdentifier: 
  <Key>k__BackingField: 131539
  <Value>k__BackingField: 'In this system we make plenty of raids on valuable shipments
    traveling between Liberty and Bretonia. We use the Jump Hole to raid shipments
    in Cortez that may be trying to bypass Magellan, and the Jump Hole from Cortez
    to California let''s us get back to our beloved homeland. Financial freedom has
    its costs, I guess, but it''s quite the adventure being out here. It''s certainly
    more exciting than that stuffy lab on Pueblo Station. <br>


'
