%YAML 1.1
%TAG !u! tag:unity3d.com,2011:
--- !u!114 &11400000
MonoBehaviour:
  m_ObjectHideFlags: 0
  m_CorrespondingSourceObject: {fileID: 0}
  m_PrefabInstance: {fileID: 0}
  m_PrefabAsset: {fileID: 0}
  m_GameObject: {fileID: 0}
  m_Enabled: 1
  m_EditorHideFlags: 0
  m_Script: {fileID: 11500000, guid: ac6f300716fb477b98dee1a497bbb338, type: 3}
  m_Name: SO_Base_NavyPrisonStation
  m_EditorClassIdentifier: 
  serializationData:
    SerializedFormat: 2
    SerializedBytes: 
    ReferencedUnityObjects:
    - {fileID: 11400000, guid: 5633b3876a77043d59f1e59107f3d1ef, type: 2}
    - {fileID: 11400000, guid: 26973eb55e2594c64aaae8ec2b80affa, type: 2}
    - {fileID: 11400000, guid: 595fb76b6b6a1419e8f30da62979e221, type: 2}
    - {fileID: 11400000, guid: 6d6558d384fd846da90528a00ed8e839, type: 2}
    SerializedBytesString: 
    Prefab: {fileID: 0}
    PrefabModificationsReferencedUnityObjects: []
    PrefabModifications: []
    SerializationNodes:
    - Name: <Name>k__BackingField
      Entry: 10
      Data: 0
    - Name: <Infocard>k__BackingField
      Entry: 10
      Data: 1
    - Name: <System>k__BackingField
      Entry: 10
      Data: 2
    - Name: <Reputation>k__BackingField
      Entry: 10
      Data: 3
  <Nickname>k__BackingField: IW09_02_Base
