%YAML 1.1
%TAG !u! tag:unity3d.com,2011:
--- !u!114 &11400000
MonoBehaviour:
  m_ObjectHideFlags: 0
  m_CorrespondingSourceObject: {fileID: 0}
  m_PrefabInstance: {fileID: 0}
  m_PrefabAsset: {fileID: 0}
  m_GameObject: {fileID: 0}
  m_Enabled: 1
  m_EditorHideFlags: 0
  m_Script: {fileID: 11500000, guid: 182eb47472f64de388dd50183c0411d8, type: 3}
  m_Name: SO_Infocard_132511
  m_EditorClassIdentifier: 
  <Key>k__BackingField: 132511
  <Value>k__BackingField: 'These Gallic newcomers... I just don''t know what to think
    about them. On the one hand they''ve put a permanent stopper in both Planetform
    and Orbital''s expoitation of Gaia, but on the other hand, they might turn around
    and do exactly the same thing! If that happens, we''ll need to be ready for it.
    <br>


'
