%YAML 1.1
%TAG !u! tag:unity3d.com,2011:
--- !u!114 &11400000
MonoBehaviour:
  m_ObjectHideFlags: 0
  m_CorrespondingSourceObject: {fileID: 0}
  m_PrefabInstance: {fileID: 0}
  m_PrefabAsset: {fileID: 0}
  m_GameObject: {fileID: 0}
  m_Enabled: 1
  m_EditorHideFlags: 0
  m_Script: {fileID: 11500000, guid: 182eb47472f64de388dd50183c0411d8, type: 3}
  m_Name: SO_Infocard_505133
  m_EditorClassIdentifier: 
  <Key>k__BackingField: 505133
  <Value>k__BackingField: '<b><p align="center">"Hercules" Civilian Base Construction
    Platform<br></b><p align="left"><br>The Hercules-class is designed for one specific
    purpose: modular installation construction at-scale. With a limited hold just
    large enough for the core components necessary for an outpost, the Hercules sees
    use among militaries, outlaws, and homesteaders alike. Constructing an outpost
    using its specialist nano-assembly equipment requires only an initial supply
    of basic and super alloys, industrial materials, optronics, construction machinery,
    and nanocapacitors. Typically, Hercules-class gantries only create a habitable
    temporary worksite for onboard engineering teams, who will then take over with
    conventional construction.<br>


'
