%YAML 1.1
%TAG !u! tag:unity3d.com,2011:
--- !u!114 &11400000
MonoBehaviour:
  m_ObjectHideFlags: 0
  m_CorrespondingSourceObject: {fileID: 0}
  m_PrefabInstance: {fileID: 0}
  m_PrefabAsset: {fileID: 0}
  m_GameObject: {fileID: 0}
  m_Enabled: 1
  m_EditorHideFlags: 0
  m_Script: {fileID: 11500000, guid: 182eb47472f64de388dd50183c0411d8, type: 3}
  m_Name: SO_Infocard_133233
  m_EditorClassIdentifier: 
  <Key>k__BackingField: 133233
  <Value>k__BackingField: 'MOX is always in demand here. We use it for our larger
    ships, and we have discovered a means of making extremely destructive weaponry
    from it. Should a large navy enter this system, it would soon be destroyed by
    our planetary defense missiles. The missiles are a vehicle for chain-reaction,
    plutonium-tipped warheads. <br><nbsp><br>


'
