%YAML 1.1
%TAG !u! tag:unity3d.com,2011:
--- !u!114 &11400000
MonoBehaviour:
  m_ObjectHideFlags: 0
  m_CorrespondingSourceObject: {fileID: 0}
  m_PrefabInstance: {fileID: 0}
  m_PrefabAsset: {fileID: 0}
  m_GameObject: {fileID: 0}
  m_Enabled: 1
  m_EditorHideFlags: 0
  m_Script: {fileID: 11500000, guid: 182eb47472f64de388dd50183c0411d8, type: 3}
  m_Name: SO_Infocard_132787
  m_EditorClassIdentifier: 
  <Key>k__BackingField: 132787
  <Value>k__BackingField: 'I should like to thank whomever came up with the idea
    of conducting business here. It is profitable for everyone involved. The Corsairs
    benefit from having a place where they can sell their Artifacts with relative
    ease. The Hogosha benefit from having easy access to them. Orbital Spa benefits
    from the safety that dealing with both groups offers - especially when the Outcasts
    try something. The only ones left pouting are the GMG, but they have themselves
    to thank for that. <br>


'
