%YAML 1.1
%TAG !u! tag:unity3d.com,2011:
--- !u!114 &11400000
MonoBehaviour:
  m_ObjectHideFlags: 0
  m_CorrespondingSourceObject: {fileID: 0}
  m_PrefabInstance: {fileID: 0}
  m_PrefabAsset: {fileID: 0}
  m_GameObject: {fileID: 0}
  m_Enabled: 1
  m_EditorHideFlags: 0
  m_Script: {fileID: 11500000, guid: ac6f300716fb477b98dee1a497bbb338, type: 3}
  m_Name: SO_Base_CanberraStarCity
  m_EditorClassIdentifier: 
  serializationData:
    SerializedFormat: 2
    SerializedBytes: 
    ReferencedUnityObjects:
    - {fileID: 11400000, guid: c5b53c00c305c46c7a113473e58f95b4, type: 2}
    - {fileID: 11400000, guid: c85e76b731ea543a7879b13548a67f1c, type: 2}
    - {fileID: 11400000, guid: d6dbb1cd820464458a99ca4154bf2cc6, type: 2}
    SerializedBytesString: 
    Prefab: {fileID: 0}
    PrefabModificationsReferencedUnityObjects: []
    PrefabModifications: []
    SerializationNodes:
    - Name: <Name>k__BackingField
      Entry: 10
      Data: 0
    - Name: <Infocard>k__BackingField
      Entry: 10
      Data: 1
    - Name: <System>k__BackingField
      Entry: 10
      Data: 2
    - Name: <Reputation>k__BackingField
      Entry: 6
      Data: 
  <Nickname>k__BackingField: EW17_05_Base
