%YAML 1.1
%TAG !u! tag:unity3d.com,2011:
--- !u!114 &11400000
MonoBehaviour:
  m_ObjectHideFlags: 0
  m_CorrespondingSourceObject: {fileID: 0}
  m_PrefabInstance: {fileID: 0}
  m_PrefabAsset: {fileID: 0}
  m_GameObject: {fileID: 0}
  m_Enabled: 1
  m_EditorHideFlags: 0
  m_Script: {fileID: 11500000, guid: 182eb47472f64de388dd50183c0411d8, type: 3}
  m_Name: SO_Infocard_460869
  m_EditorClassIdentifier: 
  <Key>k__BackingField: 460869
  <Value>k__BackingField: 'I really don''t get what the Gaians have against terraforming.
    I can understand the wish to preserve the ecology of Gaia, since it is unique,
    and one of the few Earth-like environments mankind has found in the Sirius sector.
    But I really don''t see what their problem is with us bringing dead, lifeless
    worlds to life. It''s not like anyone is harmed by creating life on a planet.
    <br>


'
