%YAML 1.1
%TAG !u! tag:unity3d.com,2011:
--- !u!114 &11400000
MonoBehaviour:
  m_ObjectHideFlags: 0
  m_CorrespondingSourceObject: {fileID: 0}
  m_PrefabInstance: {fileID: 0}
  m_PrefabAsset: {fileID: 0}
  m_GameObject: {fileID: 0}
  m_Enabled: 1
  m_EditorHideFlags: 0
  m_Script: {fileID: 11500000, guid: 182eb47472f64de388dd50183c0411d8, type: 3}
  m_Name: SO_Infocard_133454
  m_EditorClassIdentifier: 
  <Key>k__BackingField: 133454
  <Value>k__BackingField: 'The Blood Dragons are fierce opponents, and the police
    require our help to fight them off. Bounty Hunters are also successful at dealing
    with them, and I know that Samura has hired many of these mercenaries to deal
    with the problem. Deshima is home to the Bounty Hunters Guild in Kusari. No where
    else will you find their bases operating in this part of space.<br>


'
