%YAML 1.1
%TAG !u! tag:unity3d.com,2011:
--- !u!114 &11400000
MonoBehaviour:
  m_ObjectHideFlags: 0
  m_CorrespondingSourceObject: {fileID: 0}
  m_PrefabInstance: {fileID: 0}
  m_PrefabAsset: {fileID: 0}
  m_GameObject: {fileID: 0}
  m_Enabled: 1
  m_EditorHideFlags: 0
  m_Script: {fileID: 11500000, guid: 182eb47472f64de388dd50183c0411d8, type: 3}
  m_Name: SO_Infocard_525313
  m_EditorClassIdentifier: 
  <Key>k__BackingField: 525313
  <Value>k__BackingField: 'When Belfast was taken over by the Mollys - oh, excuse
    me, "abandoned", Scarborough became the nearest place to that Molly hive. We''ve
    faced an increasing number of attacks ever since. We''ve requested that the Armed
    Forces place a few weapon platforms to provide more defense, but so far they
    haven''t come through. I suppose having the Ark Royal here reduces the urgency
    for them, though. <br>


'
