%YAML 1.1
%TAG !u! tag:unity3d.com,2011:
--- !u!114 &11400000
MonoBehaviour:
  m_ObjectHideFlags: 0
  m_CorrespondingSourceObject: {fileID: 0}
  m_PrefabInstance: {fileID: 0}
  m_PrefabAsset: {fileID: 0}
  m_GameObject: {fileID: 0}
  m_Enabled: 1
  m_EditorHideFlags: 0
  m_Script: {fileID: 11500000, guid: 182eb47472f64de388dd50183c0411d8, type: 3}
  m_Name: SO_Infocard_525356
  m_EditorClassIdentifier: 
  <Key>k__BackingField: 525356
  <Value>k__BackingField: 'There is a Jump Hole to the Manchester system not far
    from here. We have a base out there as well, to keep an eye on the goings-on
    at Birmingham. Planetform uses BMM and Bowex as proxies to produce and transport
    materials needed for terraforming. In this system, they mainly reside on Gateshead,
    along with some Cryer folk. <br>


'
