%YAML 1.1
%TAG !u! tag:unity3d.com,2011:
--- !u!114 &11400000
MonoBehaviour:
  m_ObjectHideFlags: 0
  m_CorrespondingSourceObject: {fileID: 0}
  m_PrefabInstance: {fileID: 0}
  m_PrefabAsset: {fileID: 0}
  m_GameObject: {fileID: 0}
  m_Enabled: 1
  m_EditorHideFlags: 0
  m_Script: {fileID: 11500000, guid: 182eb47472f64de388dd50183c0411d8, type: 3}
  m_Name: SO_Infocard_525326
  m_EditorClassIdentifier: 
  <Key>k__BackingField: 525326
  <Value>k__BackingField: 'We captured Belfast by launching a direct assault from
    this base. The Armed Forces were too preoccupied with Kusari at the time - we
    knew the Ark Royal wasn''t ready for any kind of operation, and BMM corporate
    security is a joke. Belfast now produces a large portion of all our manufactured
    goods, using raw materials usually "liberated" from various transports across
    Bretonia, and the mining rigs on Middlesbrough. <br>


'
