%YAML 1.1
%TAG !u! tag:unity3d.com,2011:
--- !u!114 &11400000
MonoBehaviour:
  m_ObjectHideFlags: 0
  m_CorrespondingSourceObject: {fileID: 0}
  m_PrefabInstance: {fileID: 0}
  m_PrefabAsset: {fileID: 0}
  m_GameObject: {fileID: 0}
  m_Enabled: 1
  m_EditorHideFlags: 0
  m_Script: {fileID: 11500000, guid: 182eb47472f64de388dd50183c0411d8, type: 3}
  m_Name: SO_Infocard_515129
  m_EditorClassIdentifier: 
  <Key>k__BackingField: 515129
  <Value>k__BackingField: 'Planetform is so used to thinking in time scales of decades
    and centuries that they miss the advantage of a consumable product over a durable
    one. A filter than never wears out, you can sell just once to a customer. A filter
    that has a shelf-life can be sold over and over and over again. The bacteria
    we cultivate for the Xenobiotic Filters absorb toxins and pollutants from the
    atmosphere, but they only have a limited capacity to do so. Eventually, the bacteria
    will die, leaving the filter ineffective and in need of replacement with a fresh
    one. <br>


'
