%YAML 1.1
%TAG !u! tag:unity3d.com,2011:
--- !u!114 &11400000
MonoBehaviour:
  m_ObjectHideFlags: 0
  m_CorrespondingSourceObject: {fileID: 0}
  m_PrefabInstance: {fileID: 0}
  m_PrefabAsset: {fileID: 0}
  m_GameObject: {fileID: 0}
  m_Enabled: 1
  m_EditorHideFlags: 0
  m_Script: {fileID: 11500000, guid: 182eb47472f64de388dd50183c0411d8, type: 3}
  m_Name: SO_Infocard_132288
  m_EditorClassIdentifier: 
  <Key>k__BackingField: 132288
  <Value>k__BackingField: 'IMG is a motley collection of unemployed New London miners,
    former BMM malcontents, and hordes of Daumann and Kruger Rheinlanders. They have
    no business operating as a legal entity within the boundaries of Bretonia - the
    Crown ought to remove them from our border as a matter of principle. There is
    little we can do in the Border Worlds, unfortunately. <br>


'
