%YAML 1.1
%TAG !u! tag:unity3d.com,2011:
--- !u!114 &11400000
MonoBehaviour:
  m_ObjectHideFlags: 0
  m_CorrespondingSourceObject: {fileID: 0}
  m_PrefabInstance: {fileID: 0}
  m_PrefabAsset: {fileID: 0}
  m_GameObject: {fileID: 0}
  m_Enabled: 1
  m_EditorHideFlags: 0
  m_Script: {fileID: 11500000, guid: 182eb47472f64de388dd50183c0411d8, type: 3}
  m_Name: SO_Infocard_393745
  m_EditorClassIdentifier: 
  <Key>k__BackingField: 393745
  <Value>k__BackingField: ' <br><b><p align="center">Stats<br></b><p align="left">
    <br>Gun/Turret Mounts: 0/0<br>Base Armor: 100000000<br>Cargo Space: 5000<br>Power
    Output: n/a<br>Batteries/NanoBots: 0/0<br>Impulse Speed: 83<br>Cruise Speed:
    100<br>Equipment Mounts: <br>


'
