%YAML 1.1
%TAG !u! tag:unity3d.com,2011:
--- !u!114 &11400000
MonoBehaviour:
  m_ObjectHideFlags: 0
  m_CorrespondingSourceObject: {fileID: 0}
  m_PrefabInstance: {fileID: 0}
  m_PrefabAsset: {fileID: 0}
  m_GameObject: {fileID: 0}
  m_Enabled: 1
  m_EditorHideFlags: 0
  m_Script: {fileID: 11500000, guid: 182eb47472f64de388dd50183c0411d8, type: 3}
  m_Name: SO_Infocard_515043
  m_EditorClassIdentifier: 
  <Key>k__BackingField: 515043
  <Value>k__BackingField: 'We uncloaked right on remainders of Core defense force.
    With a full magnum launch, we cleared the entire hangar deck of the Apophis in
    mere seconds, commencing a blitzkrieg assault against Dabadoru. This was one
    of very few moments they let me kill as many scoundrels I want until they sadly
    turned around and hit the afterburner. We needed all forces on one very specific
    location to make the takeover as smooth as humanly possible.<br>


'
