%YAML 1.1
%TAG !u! tag:unity3d.com,2011:
--- !u!114 &11400000
MonoBehaviour:
  m_ObjectHideFlags: 0
  m_CorrespondingSourceObject: {fileID: 0}
  m_PrefabInstance: {fileID: 0}
  m_PrefabAsset: {fileID: 0}
  m_GameObject: {fileID: 0}
  m_Enabled: 1
  m_EditorHideFlags: 0
  m_Script: {fileID: 11500000, guid: 182eb47472f64de388dd50183c0411d8, type: 3}
  m_Name: SO_Infocard_133389
  m_EditorClassIdentifier: 
  <Key>k__BackingField: 133389
  <Value>k__BackingField: 'Once we are more established in Kusari, we will no longer
    need this hellish place. Samura puts much pressure on us. Only the assistance
    of the Blood Dragons has allowed us to survive at all out here. <br>


'
