%YAML 1.1
%TAG !u! tag:unity3d.com,2011:
--- !u!114 &11400000
MonoBehaviour:
  m_ObjectHideFlags: 0
  m_CorrespondingSourceObject: {fileID: 0}
  m_PrefabInstance: {fileID: 0}
  m_PrefabAsset: {fileID: 0}
  m_GameObject: {fileID: 0}
  m_Enabled: 1
  m_EditorHideFlags: 0
  m_Script: {fileID: 11500000, guid: 182eb47472f64de388dd50183c0411d8, type: 3}
  m_Name: SO_Infocard_134313
  m_EditorClassIdentifier: 
  <Key>k__BackingField: 134313
  <Value>k__BackingField: 'Jesse Casas was truly an original. Captured as a young
    Corsair on his first mission to the inner house systems, he spent years imprisoned
    in Vierlande. He eventually renounced his Corsair vows and joined the Bounty
    Hunters Guild. Flying the Rebel, Casas used his intimate knowledge of the pirate
    ways to full tactical advantage. He finally met his demise somewhere in the Napo
    Cloud in 791. <br><nbsp><br>


'
