%YAML 1.1
%TAG !u! tag:unity3d.com,2011:
--- !u!114 &11400000
MonoBehaviour:
  m_ObjectHideFlags: 0
  m_CorrespondingSourceObject: {fileID: 0}
  m_PrefabInstance: {fileID: 0}
  m_PrefabAsset: {fileID: 0}
  m_GameObject: {fileID: 0}
  m_Enabled: 1
  m_EditorHideFlags: 0
  m_Script: {fileID: 11500000, guid: 182eb47472f64de388dd50183c0411d8, type: 3}
  m_Name: SO_Infocard_131221
  m_EditorClassIdentifier: 
  <Key>k__BackingField: 131221
  <Value>k__BackingField: 'The Navy sends patrols into the Badlands, where the criminals
    are smuggling in a large portion of the contraband that enters the system. We
    have yet to find the Jump Hole they are using, but when we do the citizens of
    this system will be a lot safer than they are now. <br>


'
