%YAML 1.1
%TAG !u! tag:unity3d.com,2011:
--- !u!114 &11400000
MonoBehaviour:
  m_ObjectHideFlags: 0
  m_CorrespondingSourceObject: {fileID: 0}
  m_PrefabInstance: {fileID: 0}
  m_PrefabAsset: {fileID: 0}
  m_GameObject: {fileID: 0}
  m_Enabled: 1
  m_EditorHideFlags: 0
  m_Script: {fileID: 11500000, guid: 182eb47472f64de388dd50183c0411d8, type: 3}
  m_Name: SO_Infocard_133238
  m_EditorClassIdentifier: 
  <Key>k__BackingField: 133238
  <Value>k__BackingField: 'Why have we flourished? Why are our ships so well crafted
    and designed? We operate on a higher order of being. Many wonder why we take
    life so easily. It is because this life is just a dream of what truly is. What
    human beings cherish is an illusion; there is no such thing as death, only change.
    <br><nbsp><br>


'
