%YAML 1.1
%TAG !u! tag:unity3d.com,2011:
--- !u!114 &11400000
MonoBehaviour:
  m_ObjectHideFlags: 0
  m_CorrespondingSourceObject: {fileID: 0}
  m_PrefabInstance: {fileID: 0}
  m_PrefabAsset: {fileID: 0}
  m_GameObject: {fileID: 0}
  m_Enabled: 1
  m_EditorHideFlags: 0
  m_Script: {fileID: 11500000, guid: 182eb47472f64de388dd50183c0411d8, type: 3}
  m_Name: SO_Infocard_133100
  m_EditorClassIdentifier: 
  <Key>k__BackingField: 133100
  <Value>k__BackingField: 'Gaians are a bunch of pansy rich kids who had no problems
    in their lives, so they decided to create one. Terraforming isn''t anything terrible
    or unethical. As a matter of fact, it will eventually save Bretonia. I take pleasure
    in wasting or busting those filthy snobs. <br>


'
