%YAML 1.1
%TAG !u! tag:unity3d.com,2011:
--- !u!114 &11400000
MonoBehaviour:
  m_ObjectHideFlags: 0
  m_CorrespondingSourceObject: {fileID: 0}
  m_PrefabInstance: {fileID: 0}
  m_PrefabAsset: {fileID: 0}
  m_GameObject: {fileID: 0}
  m_Enabled: 1
  m_EditorHideFlags: 0
  m_Script: {fileID: 11500000, guid: 182eb47472f64de388dd50183c0411d8, type: 3}
  m_Name: SO_Infocard_133506
  m_EditorClassIdentifier: 
  <Key>k__BackingField: 133506
  <Value>k__BackingField: 'I will stare into the depths of the waters here. There
    is little I can do to escape this place. I miss New Tokyo dearly, and I want
    only to be back there. I hate fish; I can never completely wash its smell from
    my skin.<br>


'
