%YAML 1.1
%TAG !u! tag:unity3d.com,2011:
--- !u!114 &11400000
MonoBehaviour:
  m_ObjectHideFlags: 0
  m_CorrespondingSourceObject: {fileID: 0}
  m_PrefabInstance: {fileID: 0}
  m_PrefabAsset: {fileID: 0}
  m_GameObject: {fileID: 0}
  m_Enabled: 1
  m_EditorHideFlags: 0
  m_Script: {fileID: 11500000, guid: 182eb47472f64de388dd50183c0411d8, type: 3}
  m_Name: SO_Infocard_132776
  m_EditorClassIdentifier: 
  <Key>k__BackingField: 132776
  <Value>k__BackingField: 'This place kind of freaks me out. I''m looking forward
    to getting out of this test tube. You wouldn''t believe me, but I could have
    sworn I''ve heard screaming here late at night. Don''t tell the scientists I
    told you that, it wouldn''t be good for business. Still, are these eggheads testing
    on humans now? Can they even do that? <br>


'
