%YAML 1.1
%TAG !u! tag:unity3d.com,2011:
--- !u!114 &11400000
MonoBehaviour:
  m_ObjectHideFlags: 0
  m_CorrespondingSourceObject: {fileID: 0}
  m_PrefabInstance: {fileID: 0}
  m_PrefabAsset: {fileID: 0}
  m_GameObject: {fileID: 0}
  m_Enabled: 1
  m_EditorHideFlags: 0
  m_Script: {fileID: 11500000, guid: 182eb47472f64de388dd50183c0411d8, type: 3}
  m_Name: SO_Infocard_133330
  m_EditorClassIdentifier: 
  <Key>k__BackingField: 133330
  <Value>k__BackingField: 'We buy our supplies from the Yukawa shipyard or Shinagawa.
    Since we produce our own life support Gases, our needs are few. It is a lonely
    life, surrounded by our protective mine field. Once you enter this complex, you
    rarely leave. <br>


'
