%YAML 1.1
%TAG !u! tag:unity3d.com,2011:
--- !u!114 &11400000
MonoBehaviour:
  m_ObjectHideFlags: 0
  m_CorrespondingSourceObject: {fileID: 0}
  m_PrefabInstance: {fileID: 0}
  m_PrefabAsset: {fileID: 0}
  m_GameObject: {fileID: 0}
  m_Enabled: 1
  m_EditorHideFlags: 0
  m_Script: {fileID: 11500000, guid: 182eb47472f64de388dd50183c0411d8, type: 3}
  m_Name: SO_Infocard_131861
  m_EditorClassIdentifier: 
  <Key>k__BackingField: 131861
  <Value>k__BackingField: 'I killed four Rogues trying to escape into the Pittsburgh
    Fields last week. They almost made it, but I blew out the engines on one of their
    ships, and the other three came back to tried and save him. They must have been
    high on Cardamine the way they were flying. <br><nbsp><br>


'
