%YAML 1.1
%TAG !u! tag:unity3d.com,2011:
--- !u!114 &11400000
MonoBehaviour:
  m_ObjectHideFlags: 0
  m_CorrespondingSourceObject: {fileID: 0}
  m_PrefabInstance: {fileID: 0}
  m_PrefabAsset: {fileID: 0}
  m_GameObject: {fileID: 0}
  m_Enabled: 1
  m_EditorHideFlags: 0
  m_Script: {fileID: 11500000, guid: 182eb47472f64de388dd50183c0411d8, type: 3}
  m_Name: SO_Infocard_509580
  m_EditorClassIdentifier: 
  <Key>k__BackingField: 509580
  <Value>k__BackingField: 'If you want to trade anything in the Black Market, you
    better have some Brigand friends. We control a substantial portion of the Gallic
    Black Market. We once had a great deal of conflict with the Unione Corse over
    turf, but we have an uneasy truce now that allows us all to profit.<br>


'
