%YAML 1.1
%TAG !u! tag:unity3d.com,2011:
--- !u!114 &11400000
MonoBehaviour:
  m_ObjectHideFlags: 0
  m_CorrespondingSourceObject: {fileID: 0}
  m_PrefabInstance: {fileID: 0}
  m_PrefabAsset: {fileID: 0}
  m_GameObject: {fileID: 0}
  m_Enabled: 1
  m_EditorHideFlags: 0
  m_Script: {fileID: 11500000, guid: b271f90cda31432883e1182aa0b8027c, type: 3}
  m_Name: SO_Faction_BorderWorldExports
  m_EditorClassIdentifier: 
  serializationData:
    SerializedFormat: 2
    SerializedBytes: 
    ReferencedUnityObjects:
    - {fileID: 11400000, guid: 0c90111167f1b4a40ba050fe5fdad583, type: 2}
    - {fileID: 11400000, guid: d7fcfad3148e647ad8a8c7d2cc4ae8bb, type: 2}
    - {fileID: 11400000, guid: 558954f6e552343fdbe41206a436c7a1, type: 2}
    - {fileID: 11400000, guid: 0d46b2c39269747c59579a4408c34643, type: 2}
    - {fileID: 11400000, guid: 5aca43d48730e48bfac9635f7b72a6fe, type: 2}
    - {fileID: 11400000, guid: e5cf04969bfc74cfa9d781d655359d78, type: 2}
    - {fileID: 11400000, guid: 744c518d1bf5c4b8c9902224ba93cbcb, type: 2}
    - {fileID: 11400000, guid: d178e38d1201b4e69b08f68dc51ada8d, type: 2}
    - {fileID: 11400000, guid: 17ca187d2c0e0435799c00a483fe495f, type: 2}
    - {fileID: 11400000, guid: 6a56ebfd596f2409ba6c1378638411a2, type: 2}
    - {fileID: 11400000, guid: 447a49d7c8e51492793ced160f8d42cb, type: 2}
    - {fileID: 11400000, guid: 9ab189d5539924ced9e4d91e5185813e, type: 2}
    - {fileID: 11400000, guid: 095c5c4e3c074457c942014f226e6293, type: 2}
    - {fileID: 11400000, guid: 7e5c119a3e5954c9d95a0fd5febc5ec5, type: 2}
    - {fileID: 11400000, guid: 9f1fe5ebfab8c441eb4e132055568dd4, type: 2}
    - {fileID: 11400000, guid: 5ddc301b56cfb4344a71e27badc22f8a, type: 2}
    - {fileID: 11400000, guid: 233819f10e81045ecb2cd26402c94a86, type: 2}
    - {fileID: 11400000, guid: 67ffa408a1a9447749bb5ff7ee243b9b, type: 2}
    - {fileID: 11400000, guid: cdf28eab446214afc9cdde5c5b1fdc56, type: 2}
    - {fileID: 11400000, guid: 4d255a13a9aa74a5bbc933f6612cfbd8, type: 2}
    - {fileID: 11400000, guid: fa4eae277dff14ddeaf77f2e6d8733e9, type: 2}
    - {fileID: 11400000, guid: cdc2a0f492bb8492ba7e596718895362, type: 2}
    - {fileID: 11400000, guid: 9838cd2a642214500bb05f4d2651a4f7, type: 2}
    - {fileID: 11400000, guid: 64fa43a959e1a42a684bea5367d4ead1, type: 2}
    - {fileID: 11400000, guid: d918497363467490cab836f56ef0cb16, type: 2}
    - {fileID: 11400000, guid: 42ace5e27ed2e4d45b6ba3eec1febb3b, type: 2}
    - {fileID: 11400000, guid: a70b59cc9080e4dde8635e2b48d833ae, type: 2}
    - {fileID: 11400000, guid: ba2aebfd30f7549c583823c825b13fb2, type: 2}
    - {fileID: 11400000, guid: feb985b5dcaff413f9bf2b8d56b77006, type: 2}
    - {fileID: 11400000, guid: a8ccb27f7c05c4eec8bce2cec0734151, type: 2}
    - {fileID: 11400000, guid: 2f24a9f24b6624e068c90fb1a916c98c, type: 2}
    - {fileID: 11400000, guid: 047290a2a69cb4ec7815417d5119f332, type: 2}
    - {fileID: 11400000, guid: 811beb3ff1e3244508d2f3b576da2d4e, type: 2}
    - {fileID: 11400000, guid: ad4d58060aa8c4b47814b8a7114ce222, type: 2}
    - {fileID: 11400000, guid: ab1eba8cbbb9a4d83b2736018fec8afd, type: 2}
    - {fileID: 11400000, guid: 63614196d1eaa49a1a325edd0ad54479, type: 2}
    - {fileID: 11400000, guid: 478dd9a7b9f5d43c79896e4180bbcc88, type: 2}
    - {fileID: 11400000, guid: 39861eec566044a80bf7d19edb385517, type: 2}
    - {fileID: 11400000, guid: fd92c5374f2b944deb6a06a2efebd0a5, type: 2}
    - {fileID: 11400000, guid: 0b7372911ddca4c41afc4a519e8789cc, type: 2}
    - {fileID: 11400000, guid: 03837e36b34bb4cc397529402f904f02, type: 2}
    - {fileID: 11400000, guid: 9876c6066afbe4c278e6df7867203c51, type: 2}
    - {fileID: 11400000, guid: 2a4aa9edecc634ccca403dbb9cd658c9, type: 2}
    - {fileID: 11400000, guid: 03783c18edc5f40eead1c7d09289700f, type: 2}
    - {fileID: 11400000, guid: 9d5bbb291524b4141b849f086d39319b, type: 2}
    - {fileID: 11400000, guid: 45069beacc2f04a15a79da10c79e74a0, type: 2}
    - {fileID: 11400000, guid: 3c97090660d274d72a13819e37ff5c3e, type: 2}
    - {fileID: 11400000, guid: 40c3ce01a8b4c4d379e10a23e2c69545, type: 2}
    - {fileID: 11400000, guid: 0508c29c7342545818479a1c76e6131b, type: 2}
    - {fileID: 11400000, guid: 4d73ec3a6d088418fad3112db70e7447, type: 2}
    - {fileID: 11400000, guid: 92ea5a3f8686640ec99793b705cda8c1, type: 2}
    - {fileID: 11400000, guid: c8061fc561e714aca9e492105eab1b66, type: 2}
    - {fileID: 11400000, guid: 49355e79c95cd4eb3b8045facaa333dd, type: 2}
    - {fileID: 11400000, guid: 9f76544856a1046bd86cba5663b90d4b, type: 2}
    - {fileID: 11400000, guid: 640e4703f46254de4b3d03cb86f8e38a, type: 2}
    - {fileID: 11400000, guid: d12290a2f163343adb9885399f2ff3a7, type: 2}
    - {fileID: 11400000, guid: a53bc43b3e05f4e34b56af51134478ce, type: 2}
    - {fileID: 11400000, guid: bf6609ff962bf43ba9f1edb605bc91af, type: 2}
    - {fileID: 11400000, guid: d324f66a3e2414fccbdd15ffe1902df5, type: 2}
    - {fileID: 11400000, guid: 1afd41308bbb6433390e74af2066c1ca, type: 2}
    - {fileID: 11400000, guid: 6b4a63a649535455091c84df3485059e, type: 2}
    - {fileID: 11400000, guid: d4a232a65085147f1b3a4dcc0abc94d4, type: 2}
    - {fileID: 11400000, guid: f794371ec12354f8c9020ccde5db8c20, type: 2}
    - {fileID: 11400000, guid: e4fdf4448d73b445c9ec3e19eea332fc, type: 2}
    - {fileID: 11400000, guid: 1f45ab1767a4548c6808cc6a92f03a69, type: 2}
    - {fileID: 11400000, guid: 86ec847c845524fb393c8988a4165cda, type: 2}
    - {fileID: 11400000, guid: 961a429092c5c42a095b05f61737c79a, type: 2}
    - {fileID: 11400000, guid: 25bb7c56c351943698cb48143f3b2fda, type: 2}
    - {fileID: 11400000, guid: b9b630a02de9c444ab407f3a9f28417e, type: 2}
    - {fileID: 11400000, guid: 111819896eed84840b958c3c96158a47, type: 2}
    - {fileID: 11400000, guid: ba8daca3fe71140a98e65a9d2d821a87, type: 2}
    - {fileID: 11400000, guid: 9b27795dc6a9441deac5dd1e1e6474e8, type: 2}
    - {fileID: 11400000, guid: 1969295f6f40d4a59a7dad930a170a5f, type: 2}
    - {fileID: 11400000, guid: 7157376f5553f4333bd76159e84f3a36, type: 2}
    - {fileID: 11400000, guid: b4edf6b5d6b774a47a773c668405122d, type: 2}
    - {fileID: 11400000, guid: f59b52621198348f2acfbbea887ef6f7, type: 2}
    - {fileID: 11400000, guid: 6f450ad5063144743882290abd5a4a5f, type: 2}
    - {fileID: 11400000, guid: 5c9cfe442b3f34c8aa6909fea38b0944, type: 2}
    - {fileID: 11400000, guid: af55b13e42e994a10bf791940f5ada25, type: 2}
    - {fileID: 11400000, guid: dff1f98280fda414c94afe35ca8dd5c1, type: 2}
    - {fileID: 11400000, guid: d4dd4190f3cbc46bfb3a85138c9a1cea, type: 2}
    - {fileID: 11400000, guid: e382248e1480740448335b62f36cc30c, type: 2}
    - {fileID: 11400000, guid: 45f31be5684a84aaaa744ca4747b4175, type: 2}
    - {fileID: 11400000, guid: a63ec86fafcd64ea9bd6ba283b19bcd7, type: 2}
    - {fileID: 11400000, guid: 1b10e19eb42b04bae97100ad1fe1ad19, type: 2}
    - {fileID: 11400000, guid: 759956af087b54209ab0a23976674eea, type: 2}
    - {fileID: 11400000, guid: ac4d5f4f243454e70961db13582ca274, type: 2}
    - {fileID: 11400000, guid: 985021796687444c183a4efb7325ea74, type: 2}
    - {fileID: 11400000, guid: 0c84098761dc94fb8a1d030d55e040ec, type: 2}
    - {fileID: 11400000, guid: 6f56dd8c3907f497aa02d95a9cff4183, type: 2}
    - {fileID: 11400000, guid: 7f360c03f4a8f4f54a22012ec270e6ca, type: 2}
    - {fileID: 11400000, guid: 829f98cef8c844d41b4846496738c696, type: 2}
    - {fileID: 11400000, guid: 1745198e75f86404fa7752a704c57c9f, type: 2}
    - {fileID: 11400000, guid: 9b912ed15f9c44cde9f4d8c6be5f5c3b, type: 2}
    - {fileID: 11400000, guid: 8a20f84c10a784cf786f4aef86d6e3a1, type: 2}
    - {fileID: 11400000, guid: 02a8dd9c5df5c4900a5b3b97a6ae004f, type: 2}
    - {fileID: 11400000, guid: 9eb2812aa12c347eea4adfe11c88aa1a, type: 2}
    - {fileID: 11400000, guid: 4b4a53f0eeccc46cc8ba718aa7ba574a, type: 2}
    - {fileID: 11400000, guid: 2e52155975dc44862a2af0ea0e714cb3, type: 2}
    - {fileID: 11400000, guid: a162b2eb9b4a242fbb2f9ea42cbca03f, type: 2}
    - {fileID: 11400000, guid: f65add12386464fe1a21a845448f8910, type: 2}
    - {fileID: 11400000, guid: 6ff4d5810212441cbbd8b8abe9a34e92, type: 2}
    - {fileID: 11400000, guid: 37c7ef9f46f8d455ebd1b6fd3d83a47a, type: 2}
    - {fileID: 11400000, guid: bb0bf44336648470994ef9358a860d4c, type: 2}
    - {fileID: 11400000, guid: ca34e9f3daa3d4724861a4df1bd3cdc2, type: 2}
    - {fileID: 11400000, guid: 68cbe730ed50c477b9a95017bad95ef2, type: 2}
    - {fileID: 11400000, guid: cf99aca2442b24593837960d009bb147, type: 2}
    - {fileID: 11400000, guid: df70d315bd93c40788c8df3ea12afcf6, type: 2}
    - {fileID: 11400000, guid: 8f878de2c52f4406b9bac4bc3810cdd8, type: 2}
    - {fileID: 11400000, guid: b77181825af7544daad46de3a456ef0f, type: 2}
    - {fileID: 11400000, guid: 3ba6845b408104659b1cfd0bd7bb20e9, type: 2}
    - {fileID: 11400000, guid: 4df0726adfee142febd62df27939b209, type: 2}
    - {fileID: 11400000, guid: f470ffb727c1a4004a25f4d1d3115d21, type: 2}
    - {fileID: 11400000, guid: b114af0fb5ff6406b89e08a1f96d9dfd, type: 2}
    - {fileID: 11400000, guid: eff675e13cdcd4424b67551946b5198c, type: 2}
    - {fileID: 11400000, guid: 96b8f4b2936e144d3a9a2e182fd79d88, type: 2}
    - {fileID: 11400000, guid: 4f270bb44a5934919a91d929d3b541ea, type: 2}
    - {fileID: 11400000, guid: 703780571684d413b8da35cff7ec1198, type: 2}
    - {fileID: 11400000, guid: 5cfb59ef2272e40e8ad93dc8366cfa8b, type: 2}
    - {fileID: 11400000, guid: 3be72b169f3a543388e1476ce65652e0, type: 2}
    - {fileID: 11400000, guid: 26c83a00bf75745489a99b921b6d8f36, type: 2}
    - {fileID: 11400000, guid: f8c2bde43da4249edbde2633d64e34a1, type: 2}
    - {fileID: 11400000, guid: 6bc53980b95fb487297b4742cdc3e256, type: 2}
    - {fileID: 11400000, guid: 232fc4c0e320849c798be2ff70adc705, type: 2}
    - {fileID: 11400000, guid: 0013eb96b58d14fdeb4a953ecf683f4d, type: 2}
    - {fileID: 11400000, guid: 01dd7088b09a548cc9f3f64778b46ace, type: 2}
    - {fileID: 11400000, guid: d05c5ceecc5a14fc0a874af91fc1b563, type: 2}
    - {fileID: 11400000, guid: f364cd011c5b444bb813c26b5285a6cc, type: 2}
    - {fileID: 11400000, guid: e638e890f9d674ed0be05a5c0aff5d14, type: 2}
    - {fileID: 11400000, guid: f524a5ec5691b4a058ce6795388596b0, type: 2}
    - {fileID: 11400000, guid: 0d6bb5bd04fc2493d891f831f72016fb, type: 2}
    - {fileID: 11400000, guid: 496c8bbd6385c41f19185275b4b97b24, type: 2}
    - {fileID: 11400000, guid: 360069feb807f42b184763da301b2f1d, type: 2}
    - {fileID: 11400000, guid: 6c996f72de4a54fd9920325329a844ce, type: 2}
    - {fileID: 11400000, guid: 782961b4293cb46ccbbdf42d0f2dab26, type: 2}
    - {fileID: 11400000, guid: 552fa8f23705740de99fee9b05f4fbaf, type: 2}
    - {fileID: 11400000, guid: a118c3f2387f84f64803f6f3b34b251f, type: 2}
    - {fileID: 11400000, guid: 00eca9475296847909b422ff78948e70, type: 2}
    - {fileID: 11400000, guid: 039d2848eaec344c2ad3758924da1ecd, type: 2}
    - {fileID: 11400000, guid: c2c188ddbfef44b86a3f52af87dfc3c0, type: 2}
    - {fileID: 11400000, guid: b58d1fa29ffe041c185236a0e694e955, type: 2}
    - {fileID: 11400000, guid: 0bff39843f8254868bdb8217974e27d6, type: 2}
    - {fileID: 11400000, guid: 3d5c81a00e8a5443ebd77600dce1880d, type: 2}
    - {fileID: 11400000, guid: 511e28315b95748089788492eb0fc741, type: 2}
    - {fileID: 11400000, guid: f4af87fc2901d4ef791079c4c3c3699b, type: 2}
    - {fileID: 11400000, guid: 11910c42d0eba40c388caffb19a5eec9, type: 2}
    - {fileID: 11400000, guid: 615663a9a967d444781d66a474a82463, type: 2}
    - {fileID: 11400000, guid: ff7694d9b0cdd4bf685b31afd330793b, type: 2}
    - {fileID: 11400000, guid: 11e3b77e63df64e66bc73afb2752415f, type: 2}
    - {fileID: 11400000, guid: 0cccb0a152b76424c80202045d27fec4, type: 2}
    - {fileID: 11400000, guid: ce18bb9f754ba405fbc29dab25cb6063, type: 2}
    - {fileID: 11400000, guid: 84eed1dfddc7e45a08763cb44f116690, type: 2}
    - {fileID: 11400000, guid: f9522b685d6bf48a49d264adcc79985d, type: 2}
    - {fileID: 11400000, guid: e9afce0bcb5444b2ba43d7df45b03213, type: 2}
    - {fileID: 11400000, guid: caa7c480b9c9948b6ab2ee8e2e41304b, type: 2}
    - {fileID: 11400000, guid: a6f6369ae68d1402b87398dbae4c7624, type: 2}
    - {fileID: 11400000, guid: 7941739268deb4bd5bd3c369af850ddc, type: 2}
    - {fileID: 11400000, guid: 57ab9810e4e2643e3afa3b01048d9698, type: 2}
    - {fileID: 11400000, guid: 0f7dbd4ae12da4a3aa7e68cba82e26a8, type: 2}
    - {fileID: 11400000, guid: 38ea7c4aa47a8475fb3facbcb983c17f, type: 2}
    - {fileID: 11400000, guid: 0f0c3eff2e3c444ebb6ca3b70ff39199, type: 2}
    - {fileID: 11400000, guid: a766bb57046834637ab2f430c28422b8, type: 2}
    - {fileID: 11400000, guid: 0b4daa46ebeee42e59f918727f35bbc5, type: 2}
    - {fileID: 11400000, guid: 35ab77e3080d04107bd1ecf810d88b0c, type: 2}
    - {fileID: 11400000, guid: 98ec7dd542d2d497c8f65d52a84a903e, type: 2}
    - {fileID: 11400000, guid: e106ddcd511674eef9dffdf63995a45d, type: 2}
    - {fileID: 11400000, guid: 42dea8de9be754d58b4ce466011a62df, type: 2}
    - {fileID: 11400000, guid: ba280f894b41d445fbb53abf4cdcf8c1, type: 2}
    - {fileID: 11400000, guid: 7d50faeb17a61430baecf4ff6e6c45a8, type: 2}
    - {fileID: 11400000, guid: 2527cf475f87e48d3a0e70624cce2bf6, type: 2}
    - {fileID: 11400000, guid: 32e511bdf23b649daa3ac42be575603e, type: 2}
    - {fileID: 11400000, guid: 8003aa9fc5eb741079a346c5bde02143, type: 2}
    - {fileID: 11400000, guid: 917ad84d37f1c44d8bb88f2ab55a9289, type: 2}
    - {fileID: 11400000, guid: 0696c1d7d9ef84be7be6ee54d11c68ac, type: 2}
    - {fileID: 11400000, guid: 3ee3df8a6b8bb4d38bf177fd533c44b5, type: 2}
    - {fileID: 11400000, guid: 07c807cf99de14fd2add8faa986d7e7b, type: 2}
    - {fileID: 11400000, guid: 35f54936fce604c4f89171cc01511f81, type: 2}
    - {fileID: 11400000, guid: f822400c29aa04760ac13a722108604a, type: 2}
    - {fileID: 11400000, guid: 44af76ac93b4e40e99006e5390839a3f, type: 2}
    - {fileID: 11400000, guid: 6700f94be66374b9b81988fd0ca82e19, type: 2}
    - {fileID: 11400000, guid: 2090fdc7117bd4e26b244756756873ff, type: 2}
    - {fileID: 11400000, guid: f7ca306a4688e41cf8ec18ff090647b4, type: 2}
    - {fileID: 11400000, guid: 8b849b3fbeeb24d85857c256a2e90cc5, type: 2}
    - {fileID: 11400000, guid: 5d7aad7d6a57d41f2acb2d9287c5eb52, type: 2}
    - {fileID: 11400000, guid: 9cbcd88fd0bee4473985c11f4836b26c, type: 2}
    - {fileID: 11400000, guid: 3a1810f273ed54fecbda39fcbfac1630, type: 2}
    - {fileID: 11400000, guid: 2efea616049e74161b36fb7e427c478d, type: 2}
    - {fileID: 11400000, guid: 0376e30d3b0b448cda591ba6deb2ec23, type: 2}
    - {fileID: 11400000, guid: f6661114a2ec749af94838b4558f9245, type: 2}
    - {fileID: 11400000, guid: 4cc553f1f49264fc5a0ae61edab1682d, type: 2}
    - {fileID: 11400000, guid: 4d98b6455ee2040ed9edbf8d0e3040f4, type: 2}
    - {fileID: 11400000, guid: d497157d2c4ea4483a4ab971712a2337, type: 2}
    - {fileID: 11400000, guid: 65f340ed1cdcb4cfea90652f427106f7, type: 2}
    - {fileID: 11400000, guid: 0d25fbec241054f1f95e1948a79dcb73, type: 2}
    - {fileID: 11400000, guid: 982b997ef395849cba3b987b525c1a34, type: 2}
    - {fileID: 11400000, guid: 78d76bf75fceb4c2b8fd7be404acdace, type: 2}
    - {fileID: 11400000, guid: 1ad9f86182d574f2d9d58aab33987d85, type: 2}
    - {fileID: 11400000, guid: 4acee8d2090a94ceda7f681738ac2b0e, type: 2}
    - {fileID: 11400000, guid: dd7945856c36b4c41ada0a2f534592d1, type: 2}
    - {fileID: 11400000, guid: 22b5f7b52b00842c280ca717ada33b96, type: 2}
    - {fileID: 11400000, guid: 8998e79717eb84075bf99c94682afdda, type: 2}
    - {fileID: 11400000, guid: 039be3f89807d4a91a7a3a26ad7e235c, type: 2}
    - {fileID: 11400000, guid: 2eb47fe4611e34b24a3fd73e63102ae7, type: 2}
    - {fileID: 11400000, guid: 10c7b733b98184ec5bfd0b87ea93b915, type: 2}
    - {fileID: 11400000, guid: b3709ae81f2334534adeff81df0d5ca5, type: 2}
    - {fileID: 11400000, guid: 8c1ff4d6459d0443b9bc3e07b861a1d2, type: 2}
    - {fileID: 11400000, guid: 13067e1371ac0483fb17a0be1872b140, type: 2}
    - {fileID: 11400000, guid: eb7aa0d511cd6453896c0edae1e6d7c3, type: 2}
    - {fileID: 11400000, guid: c9c951c317083426b80bfb06270362de, type: 2}
    - {fileID: 11400000, guid: ca7b88e5a0750429289b778664fc59e0, type: 2}
    - {fileID: 11400000, guid: 3639e6e9e3b6545448b69adaaaeb5e71, type: 2}
    - {fileID: 11400000, guid: 54e2b5643346c4210a65a004e6f480f8, type: 2}
    - {fileID: 11400000, guid: 36a1a28e807f8451baf03ad4a317f532, type: 2}
    - {fileID: 11400000, guid: 8c1d1a7cb1e984c46b9cf097c14e23f2, type: 2}
    - {fileID: 11400000, guid: 6c7f6dab230b04dd391da8806e2de228, type: 2}
    - {fileID: 11400000, guid: 8318430b7fcbe4142bc3ec7632dd9dd0, type: 2}
    SerializedBytesString: 
    Prefab: {fileID: 0}
    PrefabModificationsReferencedUnityObjects: []
    PrefabModifications: []
    SerializationNodes:
    - Name: <Name>k__BackingField
      Entry: 10
      Data: 0
    - Name: <ShortName>k__BackingField
      Entry: 10
      Data: 1
    - Name: <Infocard>k__BackingField
      Entry: 10
      Data: 2
    - Name: <Reputations>k__BackingField
      Entry: 7
      Data: 0|System.Collections.Generic.Dictionary`2[[FreelancerDataTool.Interfaces.IFaction,
        Assembly-CSharp],[System.Single, mscorlib]], mscorlib
    - Name: comparer
      Entry: 7
      Data: 1|System.Collections.Generic.ObjectEqualityComparer`1[[FreelancerDataTool.Interfaces.IFaction,
        Assembly-CSharp]], mscorlib
    - Name: 
      Entry: 8
      Data: 
    - Name: 
      Entry: 12
      Data: 60
    - Name: 
      Entry: 7
      Data: 
    - Name: $k
      Entry: 10
      Data: 3
    - Name: $v
      Entry: 4
      Data: -0.65
    - Name: 
      Entry: 8
      Data: 
    - Name: 
      Entry: 7
      Data: 
    - Name: $k
      Entry: 10
      Data: 4
    - Name: $v
      Entry: 4
      Data: -0.65
    - Name: 
      Entry: 8
      Data: 
    - Name: 
      Entry: 7
      Data: 
    - Name: $k
      Entry: 10
      Data: 5
    - Name: $v
      Entry: 4
      Data: -0.65
    - Name: 
      Entry: 8
      Data: 
    - Name: 
      Entry: 7
      Data: 
    - Name: $k
      Entry: 10
      Data: 6
    - Name: $v
      Entry: 4
      Data: -0.65
    - Name: 
      Entry: 8
      Data: 
    - Name: 
      Entry: 7
      Data: 
    - Name: $k
      Entry: 10
      Data: 7
    - Name: $v
      Entry: 4
      Data: -0.65
    - Name: 
      Entry: 8
      Data: 
    - Name: 
      Entry: 7
      Data: 
    - Name: $k
      Entry: 10
      Data: 8
    - Name: $v
      Entry: 4
      Data: -0.65
    - Name: 
      Entry: 8
      Data: 
    - Name: 
      Entry: 7
      Data: 
    - Name: $k
      Entry: 10
      Data: 9
    - Name: $v
      Entry: 4
      Data: -0.65
    - Name: 
      Entry: 8
      Data: 
    - Name: 
      Entry: 7
      Data: 
    - Name: $k
      Entry: 10
      Data: 10
    - Name: $v
      Entry: 4
      Data: -0.65
    - Name: 
      Entry: 8
      Data: 
    - Name: 
      Entry: 7
      Data: 
    - Name: $k
      Entry: 10
      Data: 11
    - Name: $v
      Entry: 4
      Data: -0.65
    - Name: 
      Entry: 8
      Data: 
    - Name: 
      Entry: 7
      Data: 
    - Name: $k
      Entry: 10
      Data: 12
    - Name: $v
      Entry: 4
      Data: -0.65
    - Name: 
      Entry: 8
      Data: 
    - Name: 
      Entry: 7
      Data: 
    - Name: $k
      Entry: 10
      Data: 13
    - Name: $v
      Entry: 4
      Data: -0.65
    - Name: 
      Entry: 8
      Data: 
    - Name: 
      Entry: 7
      Data: 
    - Name: $k
      Entry: 10
      Data: 14
    - Name: $v
      Entry: 4
      Data: -0.65
    - Name: 
      Entry: 8
      Data: 
    - Name: 
      Entry: 7
      Data: 
    - Name: $k
      Entry: 10
      Data: 15
    - Name: $v
      Entry: 4
      Data: -0.65
    - Name: 
      Entry: 8
      Data: 
    - Name: 
      Entry: 7
      Data: 
    - Name: $k
      Entry: 10
      Data: 16
    - Name: $v
      Entry: 4
      Data: -0.65
    - Name: 
      Entry: 8
      Data: 
    - Name: 
      Entry: 7
      Data: 
    - Name: $k
      Entry: 10
      Data: 17
    - Name: $v
      Entry: 4
      Data: -0.65
    - Name: 
      Entry: 8
      Data: 
    - Name: 
      Entry: 7
      Data: 
    - Name: $k
      Entry: 10
      Data: 18
    - Name: $v
      Entry: 4
      Data: -0.65
    - Name: 
      Entry: 8
      Data: 
    - Name: 
      Entry: 7
      Data: 
    - Name: $k
      Entry: 10
      Data: 19
    - Name: $v
      Entry: 4
      Data: -0.65
    - Name: 
      Entry: 8
      Data: 
    - Name: 
      Entry: 7
      Data: 
    - Name: $k
      Entry: 10
      Data: 20
    - Name: $v
      Entry: 4
      Data: -0.65
    - Name: 
      Entry: 8
      Data: 
    - Name: 
      Entry: 7
      Data: 
    - Name: $k
      Entry: 10
      Data: 21
    - Name: $v
      Entry: 4
      Data: -0.65
    - Name: 
      Entry: 8
      Data: 
    - Name: 
      Entry: 7
      Data: 
    - Name: $k
      Entry: 10
      Data: 22
    - Name: $v
      Entry: 4
      Data: -0.65
    - Name: 
      Entry: 8
      Data: 
    - Name: 
      Entry: 7
      Data: 
    - Name: $k
      Entry: 10
      Data: 23
    - Name: $v
      Entry: 4
      Data: -0.65
    - Name: 
      Entry: 8
      Data: 
    - Name: 
      Entry: 7
      Data: 
    - Name: $k
      Entry: 10
      Data: 24
    - Name: $v
      Entry: 4
      Data: -0.65
    - Name: 
      Entry: 8
      Data: 
    - Name: 
      Entry: 7
      Data: 
    - Name: $k
      Entry: 10
      Data: 25
    - Name: $v
      Entry: 4
      Data: -0.65
    - Name: 
      Entry: 8
      Data: 
    - Name: 
      Entry: 7
      Data: 
    - Name: $k
      Entry: 10
      Data: 26
    - Name: $v
      Entry: 4
      Data: -0.65
    - Name: 
      Entry: 8
      Data: 
    - Name: 
      Entry: 7
      Data: 
    - Name: $k
      Entry: 10
      Data: 27
    - Name: $v
      Entry: 4
      Data: -0.65
    - Name: 
      Entry: 8
      Data: 
    - Name: 
      Entry: 7
      Data: 
    - Name: $k
      Entry: 10
      Data: 28
    - Name: $v
      Entry: 4
      Data: -0.65
    - Name: 
      Entry: 8
      Data: 
    - Name: 
      Entry: 7
      Data: 
    - Name: $k
      Entry: 10
      Data: 29
    - Name: $v
      Entry: 4
      Data: -0.65
    - Name: 
      Entry: 8
      Data: 
    - Name: 
      Entry: 7
      Data: 
    - Name: $k
      Entry: 10
      Data: 30
    - Name: $v
      Entry: 4
      Data: -0.65
    - Name: 
      Entry: 8
      Data: 
    - Name: 
      Entry: 7
      Data: 
    - Name: $k
      Entry: 10
      Data: 31
    - Name: $v
      Entry: 4
      Data: -0.65
    - Name: 
      Entry: 8
      Data: 
    - Name: 
      Entry: 7
      Data: 
    - Name: $k
      Entry: 10
      Data: 32
    - Name: $v
      Entry: 4
      Data: -0.65
    - Name: 
      Entry: 8
      Data: 
    - Name: 
      Entry: 7
      Data: 
    - Name: $k
      Entry: 10
      Data: 33
    - Name: $v
      Entry: 4
      Data: -0.65
    - Name: 
      Entry: 8
      Data: 
    - Name: 
      Entry: 7
      Data: 
    - Name: $k
      Entry: 10
      Data: 34
    - Name: $v
      Entry: 4
      Data: -0.3
    - Name: 
      Entry: 8
      Data: 
    - Name: 
      Entry: 7
      Data: 
    - Name: $k
      Entry: 10
      Data: 35
    - Name: $v
      Entry: 4
      Data: -0.3
    - Name: 
      Entry: 8
      Data: 
    - Name: 
      Entry: 7
      Data: 
    - Name: $k
      Entry: 10
      Data: 36
    - Name: $v
      Entry: 4
      Data: -0.3
    - Name: 
      Entry: 8
      Data: 
    - Name: 
      Entry: 7
      Data: 
    - Name: $k
      Entry: 10
      Data: 37
    - Name: $v
      Entry: 4
      Data: -0.3
    - Name: 
      Entry: 8
      Data: 
    - Name: 
      Entry: 7
      Data: 
    - Name: $k
      Entry: 10
      Data: 38
    - Name: $v
      Entry: 4
      Data: -0.3
    - Name: 
      Entry: 8
      Data: 
    - Name: 
      Entry: 7
      Data: 
    - Name: $k
      Entry: 10
      Data: 39
    - Name: $v
      Entry: 4
      Data: -0.3
    - Name: 
      Entry: 8
      Data: 
    - Name: 
      Entry: 7
      Data: 
    - Name: $k
      Entry: 10
      Data: 40
    - Name: $v
      Entry: 4
      Data: -0.3
    - Name: 
      Entry: 8
      Data: 
    - Name: 
      Entry: 7
      Data: 
    - Name: $k
      Entry: 10
      Data: 41
    - Name: $v
      Entry: 4
      Data: 0.3
    - Name: 
      Entry: 8
      Data: 
    - Name: 
      Entry: 7
      Data: 
    - Name: $k
      Entry: 10
      Data: 42
    - Name: $v
      Entry: 4
      Data: 0.3
    - Name: 
      Entry: 8
      Data: 
    - Name: 
      Entry: 7
      Data: 
    - Name: $k
      Entry: 10
      Data: 43
    - Name: $v
      Entry: 4
      Data: 0.3
    - Name: 
      Entry: 8
      Data: 
    - Name: 
      Entry: 7
      Data: 
    - Name: $k
      Entry: 10
      Data: 44
    - Name: $v
      Entry: 4
      Data: 0.3
    - Name: 
      Entry: 8
      Data: 
    - Name: 
      Entry: 7
      Data: 
    - Name: $k
      Entry: 10
      Data: 45
    - Name: $v
      Entry: 4
      Data: 0.3
    - Name: 
      Entry: 8
      Data: 
    - Name: 
      Entry: 7
      Data: 
    - Name: $k
      Entry: 10
      Data: 46
    - Name: $v
      Entry: 4
      Data: 0.3
    - Name: 
      Entry: 8
      Data: 
    - Name: 
      Entry: 7
      Data: 
    - Name: $k
      Entry: 10
      Data: 47
    - Name: $v
      Entry: 4
      Data: 0.3
    - Name: 
      Entry: 8
      Data: 
    - Name: 
      Entry: 7
      Data: 
    - Name: $k
      Entry: 10
      Data: 48
    - Name: $v
      Entry: 4
      Data: 0.3
    - Name: 
      Entry: 8
      Data: 
    - Name: 
      Entry: 7
      Data: 
    - Name: $k
      Entry: 10
      Data: 49
    - Name: $v
      Entry: 4
      Data: 0.3
    - Name: 
      Entry: 8
      Data: 
    - Name: 
      Entry: 7
      Data: 
    - Name: $k
      Entry: 10
      Data: 50
    - Name: $v
      Entry: 4
      Data: 0.3
    - Name: 
      Entry: 8
      Data: 
    - Name: 
      Entry: 7
      Data: 
    - Name: $k
      Entry: 10
      Data: 51
    - Name: $v
      Entry: 4
      Data: 0.3
    - Name: 
      Entry: 8
      Data: 
    - Name: 
      Entry: 7
      Data: 
    - Name: $k
      Entry: 10
      Data: 52
    - Name: $v
      Entry: 4
      Data: 0.3
    - Name: 
      Entry: 8
      Data: 
    - Name: 
      Entry: 7
      Data: 
    - Name: $k
      Entry: 10
      Data: 53
    - Name: $v
      Entry: 4
      Data: 0.3
    - Name: 
      Entry: 8
      Data: 
    - Name: 
      Entry: 7
      Data: 
    - Name: $k
      Entry: 10
      Data: 54
    - Name: $v
      Entry: 4
      Data: 0.3
    - Name: 
      Entry: 8
      Data: 
    - Name: 
      Entry: 7
      Data: 
    - Name: $k
      Entry: 10
      Data: 55
    - Name: $v
      Entry: 4
      Data: 0.3
    - Name: 
      Entry: 8
      Data: 
    - Name: 
      Entry: 7
      Data: 
    - Name: $k
      Entry: 10
      Data: 56
    - Name: $v
      Entry: 4
      Data: 0.3
    - Name: 
      Entry: 8
      Data: 
    - Name: 
      Entry: 7
      Data: 
    - Name: $k
      Entry: 10
      Data: 57
    - Name: $v
      Entry: 4
      Data: 0.65
    - Name: 
      Entry: 8
      Data: 
    - Name: 
      Entry: 7
      Data: 
    - Name: $k
      Entry: 10
      Data: 58
    - Name: $v
      Entry: 4
      Data: 0.65
    - Name: 
      Entry: 8
      Data: 
    - Name: 
      Entry: 7
      Data: 
    - Name: $k
      Entry: 10
      Data: 59
    - Name: $v
      Entry: 4
      Data: 0.65
    - Name: 
      Entry: 8
      Data: 
    - Name: 
      Entry: 7
      Data: 
    - Name: $k
      Entry: 10
      Data: 60
    - Name: $v
      Entry: 4
      Data: 0.65
    - Name: 
      Entry: 8
      Data: 
    - Name: 
      Entry: 7
      Data: 
    - Name: $k
      Entry: 10
      Data: 61
    - Name: $v
      Entry: 4
      Data: 0.65
    - Name: 
      Entry: 8
      Data: 
    - Name: 
      Entry: 7
      Data: 
    - Name: $k
      Entry: 10
      Data: 62
    - Name: $v
      Entry: 4
      Data: 0.65
    - Name: 
      Entry: 8
      Data: 
    - Name: 
      Entry: 13
      Data: 
    - Name: 
      Entry: 8
      Data: 
    - Name: <NpcBribers>k__BackingField
      Entry: 7
      Data: 2|System.Collections.Generic.Dictionary`2[[FreelancerDataTool.Interfaces.INpc,
        Assembly-CSharp],[System.Single, mscorlib]], mscorlib
    - Name: comparer
      Entry: 7
      Data: 3|System.Collections.Generic.ObjectEqualityComparer`1[[FreelancerDataTool.Interfaces.INpc,
        Assembly-CSharp]], mscorlib
    - Name: 
      Entry: 8
      Data: 
    - Name: 
      Entry: 12
      Data: 121
    - Name: 
      Entry: 7
      Data: 
    - Name: $k
      Entry: 10
      Data: 63
    - Name: $v
      Entry: 4
      Data: 840
    - Name: 
      Entry: 8
      Data: 
    - Name: 
      Entry: 7
      Data: 
    - Name: $k
      Entry: 10
      Data: 64
    - Name: $v
      Entry: 4
      Data: 840
    - Name: 
      Entry: 8
      Data: 
    - Name: 
      Entry: 7
      Data: 
    - Name: $k
      Entry: 10
      Data: 65
    - Name: $v
      Entry: 4
      Data: 840
    - Name: 
      Entry: 8
      Data: 
    - Name: 
      Entry: 7
      Data: 
    - Name: $k
      Entry: 10
      Data: 66
    - Name: $v
      Entry: 4
      Data: 840
    - Name: 
      Entry: 8
      Data: 
    - Name: 
      Entry: 7
      Data: 
    - Name: $k
      Entry: 10
      Data: 67
    - Name: $v
      Entry: 4
      Data: 840
    - Name: 
      Entry: 8
      Data: 
    - Name: 
      Entry: 7
      Data: 
    - Name: $k
      Entry: 10
      Data: 68
    - Name: $v
      Entry: 4
      Data: 840
    - Name: 
      Entry: 8
      Data: 
    - Name: 
      Entry: 7
      Data: 
    - Name: $k
      Entry: 10
      Data: 69
    - Name: $v
      Entry: 4
      Data: 840
    - Name: 
      Entry: 8
      Data: 
    - Name: 
      Entry: 7
      Data: 
    - Name: $k
      Entry: 10
      Data: 70
    - Name: $v
      Entry: 4
      Data: 840
    - Name: 
      Entry: 8
      Data: 
    - Name: 
      Entry: 7
      Data: 
    - Name: $k
      Entry: 10
      Data: 71
    - Name: $v
      Entry: 4
      Data: 840
    - Name: 
      Entry: 8
      Data: 
    - Name: 
      Entry: 7
      Data: 
    - Name: $k
      Entry: 10
      Data: 72
    - Name: $v
      Entry: 4
      Data: 840
    - Name: 
      Entry: 8
      Data: 
    - Name: 
      Entry: 7
      Data: 
    - Name: $k
      Entry: 10
      Data: 73
    - Name: $v
      Entry: 4
      Data: 840
    - Name: 
      Entry: 8
      Data: 
    - Name: 
      Entry: 7
      Data: 
    - Name: $k
      Entry: 10
      Data: 74
    - Name: $v
      Entry: 4
      Data: 840
    - Name: 
      Entry: 8
      Data: 
    - Name: 
      Entry: 7
      Data: 
    - Name: $k
      Entry: 10
      Data: 75
    - Name: $v
      Entry: 4
      Data: 840
    - Name: 
      Entry: 8
      Data: 
    - Name: 
      Entry: 7
      Data: 
    - Name: $k
      Entry: 10
      Data: 76
    - Name: $v
      Entry: 4
      Data: 840
    - Name: 
      Entry: 8
      Data: 
    - Name: 
      Entry: 7
      Data: 
    - Name: $k
      Entry: 10
      Data: 77
    - Name: $v
      Entry: 4
      Data: 840
    - Name: 
      Entry: 8
      Data: 
    - Name: 
      Entry: 7
      Data: 
    - Name: $k
      Entry: 10
      Data: 78
    - Name: $v
      Entry: 4
      Data: 840
    - Name: 
      Entry: 8
      Data: 
    - Name: 
      Entry: 7
      Data: 
    - Name: $k
      Entry: 10
      Data: 79
    - Name: $v
      Entry: 4
      Data: 840
    - Name: 
      Entry: 8
      Data: 
    - Name: 
      Entry: 7
      Data: 
    - Name: $k
      Entry: 10
      Data: 80
    - Name: $v
      Entry: 4
      Data: 840
    - Name: 
      Entry: 8
      Data: 
    - Name: 
      Entry: 7
      Data: 
    - Name: $k
      Entry: 10
      Data: 81
    - Name: $v
      Entry: 4
      Data: 840
    - Name: 
      Entry: 8
      Data: 
    - Name: 
      Entry: 7
      Data: 
    - Name: $k
      Entry: 10
      Data: 82
    - Name: $v
      Entry: 4
      Data: 840
    - Name: 
      Entry: 8
      Data: 
    - Name: 
      Entry: 7
      Data: 
    - Name: $k
      Entry: 10
      Data: 83
    - Name: $v
      Entry: 4
      Data: 840
    - Name: 
      Entry: 8
      Data: 
    - Name: 
      Entry: 7
      Data: 
    - Name: $k
      Entry: 10
      Data: 84
    - Name: $v
      Entry: 4
      Data: 840
    - Name: 
      Entry: 8
      Data: 
    - Name: 
      Entry: 7
      Data: 
    - Name: $k
      Entry: 10
      Data: 85
    - Name: $v
      Entry: 4
      Data: 840
    - Name: 
      Entry: 8
      Data: 
    - Name: 
      Entry: 7
      Data: 
    - Name: $k
      Entry: 10
      Data: 86
    - Name: $v
      Entry: 4
      Data: 840
    - Name: 
      Entry: 8
      Data: 
    - Name: 
      Entry: 7
      Data: 
    - Name: $k
      Entry: 10
      Data: 87
    - Name: $v
      Entry: 4
      Data: 840
    - Name: 
      Entry: 8
      Data: 
    - Name: 
      Entry: 7
      Data: 
    - Name: $k
      Entry: 10
      Data: 88
    - Name: $v
      Entry: 4
      Data: 840
    - Name: 
      Entry: 8
      Data: 
    - Name: 
      Entry: 7
      Data: 
    - Name: $k
      Entry: 10
      Data: 89
    - Name: $v
      Entry: 4
      Data: 840
    - Name: 
      Entry: 8
      Data: 
    - Name: 
      Entry: 7
      Data: 
    - Name: $k
      Entry: 10
      Data: 90
    - Name: $v
      Entry: 4
      Data: 840
    - Name: 
      Entry: 8
      Data: 
    - Name: 
      Entry: 7
      Data: 
    - Name: $k
      Entry: 10
      Data: 91
    - Name: $v
      Entry: 4
      Data: 840
    - Name: 
      Entry: 8
      Data: 
    - Name: 
      Entry: 7
      Data: 
    - Name: $k
      Entry: 10
      Data: 92
    - Name: $v
      Entry: 4
      Data: 840
    - Name: 
      Entry: 8
      Data: 
    - Name: 
      Entry: 7
      Data: 
    - Name: $k
      Entry: 10
      Data: 93
    - Name: $v
      Entry: 4
      Data: 840
    - Name: 
      Entry: 8
      Data: 
    - Name: 
      Entry: 7
      Data: 
    - Name: $k
      Entry: 10
      Data: 94
    - Name: $v
      Entry: 4
      Data: 840
    - Name: 
      Entry: 8
      Data: 
    - Name: 
      Entry: 7
      Data: 
    - Name: $k
      Entry: 10
      Data: 95
    - Name: $v
      Entry: 4
      Data: 840
    - Name: 
      Entry: 8
      Data: 
    - Name: 
      Entry: 7
      Data: 
    - Name: $k
      Entry: 10
      Data: 96
    - Name: $v
      Entry: 4
      Data: 840
    - Name: 
      Entry: 8
      Data: 
    - Name: 
      Entry: 7
      Data: 
    - Name: $k
      Entry: 10
      Data: 97
    - Name: $v
      Entry: 4
      Data: 840
    - Name: 
      Entry: 8
      Data: 
    - Name: 
      Entry: 7
      Data: 
    - Name: $k
      Entry: 10
      Data: 98
    - Name: $v
      Entry: 4
      Data: 840
    - Name: 
      Entry: 8
      Data: 
    - Name: 
      Entry: 7
      Data: 
    - Name: $k
      Entry: 10
      Data: 99
    - Name: $v
      Entry: 4
      Data: 840
    - Name: 
      Entry: 8
      Data: 
    - Name: 
      Entry: 7
      Data: 
    - Name: $k
      Entry: 10
      Data: 100
    - Name: $v
      Entry: 4
      Data: 840
    - Name: 
      Entry: 8
      Data: 
    - Name: 
      Entry: 7
      Data: 
    - Name: $k
      Entry: 10
      Data: 101
    - Name: $v
      Entry: 4
      Data: 840
    - Name: 
      Entry: 8
      Data: 
    - Name: 
      Entry: 7
      Data: 
    - Name: $k
      Entry: 10
      Data: 102
    - Name: $v
      Entry: 4
      Data: 840
    - Name: 
      Entry: 8
      Data: 
    - Name: 
      Entry: 7
      Data: 
    - Name: $k
      Entry: 10
      Data: 103
    - Name: $v
      Entry: 4
      Data: 840
    - Name: 
      Entry: 8
      Data: 
    - Name: 
      Entry: 7
      Data: 
    - Name: $k
      Entry: 10
      Data: 104
    - Name: $v
      Entry: 4
      Data: 840
    - Name: 
      Entry: 8
      Data: 
    - Name: 
      Entry: 7
      Data: 
    - Name: $k
      Entry: 10
      Data: 105
    - Name: $v
      Entry: 4
      Data: 840
    - Name: 
      Entry: 8
      Data: 
    - Name: 
      Entry: 7
      Data: 
    - Name: $k
      Entry: 10
      Data: 106
    - Name: $v
      Entry: 4
      Data: 840
    - Name: 
      Entry: 8
      Data: 
    - Name: 
      Entry: 7
      Data: 
    - Name: $k
      Entry: 10
      Data: 107
    - Name: $v
      Entry: 4
      Data: 840
    - Name: 
      Entry: 8
      Data: 
    - Name: 
      Entry: 7
      Data: 
    - Name: $k
      Entry: 10
      Data: 108
    - Name: $v
      Entry: 4
      Data: 840
    - Name: 
      Entry: 8
      Data: 
    - Name: 
      Entry: 7
      Data: 
    - Name: $k
      Entry: 10
      Data: 109
    - Name: $v
      Entry: 4
      Data: 840
    - Name: 
      Entry: 8
      Data: 
    - Name: 
      Entry: 7
      Data: 
    - Name: $k
      Entry: 10
      Data: 110
    - Name: $v
      Entry: 4
      Data: 840
    - Name: 
      Entry: 8
      Data: 
    - Name: 
      Entry: 7
      Data: 
    - Name: $k
      Entry: 10
      Data: 111
    - Name: $v
      Entry: 4
      Data: 840
    - Name: 
      Entry: 8
      Data: 
    - Name: 
      Entry: 7
      Data: 
    - Name: $k
      Entry: 10
      Data: 112
    - Name: $v
      Entry: 4
      Data: 840
    - Name: 
      Entry: 8
      Data: 
    - Name: 
      Entry: 7
      Data: 
    - Name: $k
      Entry: 10
      Data: 113
    - Name: $v
      Entry: 4
      Data: 840
    - Name: 
      Entry: 8
      Data: 
    - Name: 
      Entry: 7
      Data: 
    - Name: $k
      Entry: 10
      Data: 114
    - Name: $v
      Entry: 4
      Data: 840
    - Name: 
      Entry: 8
      Data: 
    - Name: 
      Entry: 7
      Data: 
    - Name: $k
      Entry: 10
      Data: 115
    - Name: $v
      Entry: 4
      Data: 840
    - Name: 
      Entry: 8
      Data: 
    - Name: 
      Entry: 7
      Data: 
    - Name: $k
      Entry: 10
      Data: 116
    - Name: $v
      Entry: 4
      Data: 840
    - Name: 
      Entry: 8
      Data: 
    - Name: 
      Entry: 7
      Data: 
    - Name: $k
      Entry: 10
      Data: 117
    - Name: $v
      Entry: 4
      Data: 840
    - Name: 
      Entry: 8
      Data: 
    - Name: 
      Entry: 7
      Data: 
    - Name: $k
      Entry: 10
      Data: 118
    - Name: $v
      Entry: 4
      Data: 840
    - Name: 
      Entry: 8
      Data: 
    - Name: 
      Entry: 7
      Data: 
    - Name: $k
      Entry: 10
      Data: 119
    - Name: $v
      Entry: 4
      Data: 840
    - Name: 
      Entry: 8
      Data: 
    - Name: 
      Entry: 7
      Data: 
    - Name: $k
      Entry: 10
      Data: 120
    - Name: $v
      Entry: 4
      Data: 840
    - Name: 
      Entry: 8
      Data: 
    - Name: 
      Entry: 7
      Data: 
    - Name: $k
      Entry: 10
      Data: 121
    - Name: $v
      Entry: 4
      Data: 840
    - Name: 
      Entry: 8
      Data: 
    - Name: 
      Entry: 7
      Data: 
    - Name: $k
      Entry: 10
      Data: 122
    - Name: $v
      Entry: 4
      Data: 840
    - Name: 
      Entry: 8
      Data: 
    - Name: 
      Entry: 7
      Data: 
    - Name: $k
      Entry: 10
      Data: 123
    - Name: $v
      Entry: 4
      Data: 840
    - Name: 
      Entry: 8
      Data: 
    - Name: 
      Entry: 7
      Data: 
    - Name: $k
      Entry: 10
      Data: 124
    - Name: $v
      Entry: 4
      Data: 840
    - Name: 
      Entry: 8
      Data: 
    - Name: 
      Entry: 7
      Data: 
    - Name: $k
      Entry: 10
      Data: 125
    - Name: $v
      Entry: 4
      Data: 840
    - Name: 
      Entry: 8
      Data: 
    - Name: 
      Entry: 7
      Data: 
    - Name: $k
      Entry: 10
      Data: 126
    - Name: $v
      Entry: 4
      Data: 840
    - Name: 
      Entry: 8
      Data: 
    - Name: 
      Entry: 7
      Data: 
    - Name: $k
      Entry: 10
      Data: 127
    - Name: $v
      Entry: 4
      Data: 840
    - Name: 
      Entry: 8
      Data: 
    - Name: 
      Entry: 7
      Data: 
    - Name: $k
      Entry: 10
      Data: 128
    - Name: $v
      Entry: 4
      Data: 840
    - Name: 
      Entry: 8
      Data: 
    - Name: 
      Entry: 7
      Data: 
    - Name: $k
      Entry: 10
      Data: 129
    - Name: $v
      Entry: 4
      Data: 840
    - Name: 
      Entry: 8
      Data: 
    - Name: 
      Entry: 7
      Data: 
    - Name: $k
      Entry: 10
      Data: 130
    - Name: $v
      Entry: 4
      Data: 840
    - Name: 
      Entry: 8
      Data: 
    - Name: 
      Entry: 7
      Data: 
    - Name: $k
      Entry: 10
      Data: 131
    - Name: $v
      Entry: 4
      Data: 840
    - Name: 
      Entry: 8
      Data: 
    - Name: 
      Entry: 7
      Data: 
    - Name: $k
      Entry: 10
      Data: 132
    - Name: $v
      Entry: 4
      Data: 840
    - Name: 
      Entry: 8
      Data: 
    - Name: 
      Entry: 7
      Data: 
    - Name: $k
      Entry: 10
      Data: 133
    - Name: $v
      Entry: 4
      Data: 840
    - Name: 
      Entry: 8
      Data: 
    - Name: 
      Entry: 7
      Data: 
    - Name: $k
      Entry: 10
      Data: 134
    - Name: $v
      Entry: 4
      Data: 840
    - Name: 
      Entry: 8
      Data: 
    - Name: 
      Entry: 7
      Data: 
    - Name: $k
      Entry: 10
      Data: 135
    - Name: $v
      Entry: 4
      Data: 840
    - Name: 
      Entry: 8
      Data: 
    - Name: 
      Entry: 7
      Data: 
    - Name: $k
      Entry: 10
      Data: 136
    - Name: $v
      Entry: 4
      Data: 840
    - Name: 
      Entry: 8
      Data: 
    - Name: 
      Entry: 7
      Data: 
    - Name: $k
      Entry: 10
      Data: 137
    - Name: $v
      Entry: 4
      Data: 840
    - Name: 
      Entry: 8
      Data: 
    - Name: 
      Entry: 7
      Data: 
    - Name: $k
      Entry: 10
      Data: 138
    - Name: $v
      Entry: 4
      Data: 840
    - Name: 
      Entry: 8
      Data: 
    - Name: 
      Entry: 7
      Data: 
    - Name: $k
      Entry: 10
      Data: 139
    - Name: $v
      Entry: 4
      Data: 840
    - Name: 
      Entry: 8
      Data: 
    - Name: 
      Entry: 7
      Data: 
    - Name: $k
      Entry: 10
      Data: 140
    - Name: $v
      Entry: 4
      Data: 840
    - Name: 
      Entry: 8
      Data: 
    - Name: 
      Entry: 7
      Data: 
    - Name: $k
      Entry: 10
      Data: 141
    - Name: $v
      Entry: 4
      Data: 840
    - Name: 
      Entry: 8
      Data: 
    - Name: 
      Entry: 7
      Data: 
    - Name: $k
      Entry: 10
      Data: 142
    - Name: $v
      Entry: 4
      Data: 840
    - Name: 
      Entry: 8
      Data: 
    - Name: 
      Entry: 7
      Data: 
    - Name: $k
      Entry: 10
      Data: 143
    - Name: $v
      Entry: 4
      Data: 840
    - Name: 
      Entry: 8
      Data: 
    - Name: 
      Entry: 7
      Data: 
    - Name: $k
      Entry: 10
      Data: 144
    - Name: $v
      Entry: 4
      Data: 840
    - Name: 
      Entry: 8
      Data: 
    - Name: 
      Entry: 7
      Data: 
    - Name: $k
      Entry: 10
      Data: 145
    - Name: $v
      Entry: 4
      Data: 840
    - Name: 
      Entry: 8
      Data: 
    - Name: 
      Entry: 7
      Data: 
    - Name: $k
      Entry: 10
      Data: 146
    - Name: $v
      Entry: 4
      Data: 840
    - Name: 
      Entry: 8
      Data: 
    - Name: 
      Entry: 7
      Data: 
    - Name: $k
      Entry: 10
      Data: 147
    - Name: $v
      Entry: 4
      Data: 840
    - Name: 
      Entry: 8
      Data: 
    - Name: 
      Entry: 7
      Data: 
    - Name: $k
      Entry: 10
      Data: 148
    - Name: $v
      Entry: 4
      Data: 840
    - Name: 
      Entry: 8
      Data: 
    - Name: 
      Entry: 7
      Data: 
    - Name: $k
      Entry: 10
      Data: 149
    - Name: $v
      Entry: 4
      Data: 840
    - Name: 
      Entry: 8
      Data: 
    - Name: 
      Entry: 7
      Data: 
    - Name: $k
      Entry: 10
      Data: 150
    - Name: $v
      Entry: 4
      Data: 840
    - Name: 
      Entry: 8
      Data: 
    - Name: 
      Entry: 7
      Data: 
    - Name: $k
      Entry: 10
      Data: 151
    - Name: $v
      Entry: 4
      Data: 840
    - Name: 
      Entry: 8
      Data: 
    - Name: 
      Entry: 7
      Data: 
    - Name: $k
      Entry: 10
      Data: 152
    - Name: $v
      Entry: 4
      Data: 840
    - Name: 
      Entry: 8
      Data: 
    - Name: 
      Entry: 7
      Data: 
    - Name: $k
      Entry: 10
      Data: 153
    - Name: $v
      Entry: 4
      Data: 840
    - Name: 
      Entry: 8
      Data: 
    - Name: 
      Entry: 7
      Data: 
    - Name: $k
      Entry: 10
      Data: 154
    - Name: $v
      Entry: 4
      Data: 840
    - Name: 
      Entry: 8
      Data: 
    - Name: 
      Entry: 7
      Data: 
    - Name: $k
      Entry: 10
      Data: 155
    - Name: $v
      Entry: 4
      Data: 840
    - Name: 
      Entry: 8
      Data: 
    - Name: 
      Entry: 7
      Data: 
    - Name: $k
      Entry: 10
      Data: 156
    - Name: $v
      Entry: 4
      Data: 840
    - Name: 
      Entry: 8
      Data: 
    - Name: 
      Entry: 7
      Data: 
    - Name: $k
      Entry: 10
      Data: 157
    - Name: $v
      Entry: 4
      Data: 840
    - Name: 
      Entry: 8
      Data: 
    - Name: 
      Entry: 7
      Data: 
    - Name: $k
      Entry: 10
      Data: 158
    - Name: $v
      Entry: 4
      Data: 840
    - Name: 
      Entry: 8
      Data: 
    - Name: 
      Entry: 7
      Data: 
    - Name: $k
      Entry: 10
      Data: 159
    - Name: $v
      Entry: 4
      Data: 840
    - Name: 
      Entry: 8
      Data: 
    - Name: 
      Entry: 7
      Data: 
    - Name: $k
      Entry: 10
      Data: 160
    - Name: $v
      Entry: 4
      Data: 840
    - Name: 
      Entry: 8
      Data: 
    - Name: 
      Entry: 7
      Data: 
    - Name: $k
      Entry: 10
      Data: 161
    - Name: $v
      Entry: 4
      Data: 840
    - Name: 
      Entry: 8
      Data: 
    - Name: 
      Entry: 7
      Data: 
    - Name: $k
      Entry: 10
      Data: 162
    - Name: $v
      Entry: 4
      Data: 840
    - Name: 
      Entry: 8
      Data: 
    - Name: 
      Entry: 7
      Data: 
    - Name: $k
      Entry: 10
      Data: 163
    - Name: $v
      Entry: 4
      Data: 840
    - Name: 
      Entry: 8
      Data: 
    - Name: 
      Entry: 7
      Data: 
    - Name: $k
      Entry: 10
      Data: 164
    - Name: $v
      Entry: 4
      Data: 840
    - Name: 
      Entry: 8
      Data: 
    - Name: 
      Entry: 7
      Data: 
    - Name: $k
      Entry: 10
      Data: 165
    - Name: $v
      Entry: 4
      Data: 840
    - Name: 
      Entry: 8
      Data: 
    - Name: 
      Entry: 7
      Data: 
    - Name: $k
      Entry: 10
      Data: 166
    - Name: $v
      Entry: 4
      Data: 840
    - Name: 
      Entry: 8
      Data: 
    - Name: 
      Entry: 7
      Data: 
    - Name: $k
      Entry: 10
      Data: 167
    - Name: $v
      Entry: 4
      Data: 840
    - Name: 
      Entry: 8
      Data: 
    - Name: 
      Entry: 7
      Data: 
    - Name: $k
      Entry: 10
      Data: 168
    - Name: $v
      Entry: 4
      Data: 840
    - Name: 
      Entry: 8
      Data: 
    - Name: 
      Entry: 7
      Data: 
    - Name: $k
      Entry: 10
      Data: 169
    - Name: $v
      Entry: 4
      Data: 840
    - Name: 
      Entry: 8
      Data: 
    - Name: 
      Entry: 7
      Data: 
    - Name: $k
      Entry: 10
      Data: 170
    - Name: $v
      Entry: 4
      Data: 840
    - Name: 
      Entry: 8
      Data: 
    - Name: 
      Entry: 7
      Data: 
    - Name: $k
      Entry: 10
      Data: 171
    - Name: $v
      Entry: 4
      Data: 840
    - Name: 
      Entry: 8
      Data: 
    - Name: 
      Entry: 7
      Data: 
    - Name: $k
      Entry: 10
      Data: 172
    - Name: $v
      Entry: 4
      Data: 840
    - Name: 
      Entry: 8
      Data: 
    - Name: 
      Entry: 7
      Data: 
    - Name: $k
      Entry: 10
      Data: 173
    - Name: $v
      Entry: 4
      Data: 840
    - Name: 
      Entry: 8
      Data: 
    - Name: 
      Entry: 7
      Data: 
    - Name: $k
      Entry: 10
      Data: 174
    - Name: $v
      Entry: 4
      Data: 840
    - Name: 
      Entry: 8
      Data: 
    - Name: 
      Entry: 7
      Data: 
    - Name: $k
      Entry: 10
      Data: 175
    - Name: $v
      Entry: 4
      Data: 840
    - Name: 
      Entry: 8
      Data: 
    - Name: 
      Entry: 7
      Data: 
    - Name: $k
      Entry: 10
      Data: 176
    - Name: $v
      Entry: 4
      Data: 840
    - Name: 
      Entry: 8
      Data: 
    - Name: 
      Entry: 7
      Data: 
    - Name: $k
      Entry: 10
      Data: 177
    - Name: $v
      Entry: 4
      Data: 840
    - Name: 
      Entry: 8
      Data: 
    - Name: 
      Entry: 7
      Data: 
    - Name: $k
      Entry: 10
      Data: 178
    - Name: $v
      Entry: 4
      Data: 840
    - Name: 
      Entry: 8
      Data: 
    - Name: 
      Entry: 7
      Data: 
    - Name: $k
      Entry: 10
      Data: 179
    - Name: $v
      Entry: 4
      Data: 840
    - Name: 
      Entry: 8
      Data: 
    - Name: 
      Entry: 7
      Data: 
    - Name: $k
      Entry: 10
      Data: 180
    - Name: $v
      Entry: 4
      Data: 840
    - Name: 
      Entry: 8
      Data: 
    - Name: 
      Entry: 7
      Data: 
    - Name: $k
      Entry: 10
      Data: 181
    - Name: $v
      Entry: 4
      Data: 840
    - Name: 
      Entry: 8
      Data: 
    - Name: 
      Entry: 7
      Data: 
    - Name: $k
      Entry: 10
      Data: 182
    - Name: $v
      Entry: 4
      Data: 840
    - Name: 
      Entry: 8
      Data: 
    - Name: 
      Entry: 7
      Data: 
    - Name: $k
      Entry: 10
      Data: 183
    - Name: $v
      Entry: 4
      Data: 840
    - Name: 
      Entry: 8
      Data: 
    - Name: 
      Entry: 13
      Data: 
    - Name: 
      Entry: 8
      Data: 
    - Name: <ShipsUsed>k__BackingField
      Entry: 7
      Data: 4|System.Collections.Generic.List`1[[FreelancerDataTool.Interfaces.IShip,
        Assembly-CSharp]], mscorlib
    - Name: 
      Entry: 12
      Data: 15
    - Name: 
      Entry: 10
      Data: 184
    - Name: 
      Entry: 10
      Data: 185
    - Name: 
      Entry: 10
      Data: 186
    - Name: 
      Entry: 10
      Data: 187
    - Name: 
      Entry: 10
      Data: 188
    - Name: 
      Entry: 10
      Data: 189
    - Name: 
      Entry: 10
      Data: 190
    - Name: 
      Entry: 10
      Data: 191
    - Name: 
      Entry: 10
      Data: 192
    - Name: 
      Entry: 10
      Data: 193
    - Name: 
      Entry: 10
      Data: 194
    - Name: 
      Entry: 10
      Data: 195
    - Name: 
      Entry: 10
      Data: 196
    - Name: 
      Entry: 10
      Data: 197
    - Name: 
      Entry: 10
      Data: 198
    - Name: 
      Entry: 13
      Data: 
    - Name: 
      Entry: 8
      Data: 
    - Name: <OwnedBases>k__BackingField
      Entry: 7
      Data: 5|System.Collections.Generic.List`1[[FreelancerDataTool.Interfaces.IBase,
        Assembly-CSharp]], mscorlib
    - Name: 
      Entry: 12
      Data: 2
    - Name: 
      Entry: 10
      Data: 199
    - Name: 
      Entry: 10
      Data: 200
    - Name: 
      Entry: 13
      Data: 
    - Name: 
      Entry: 8
      Data: 
    - Name: <Npcs>k__BackingField
      Entry: 7
      Data: 6|System.Collections.Generic.List`1[[FreelancerDataTool.Interfaces.INpc,
        Assembly-CSharp]], mscorlib
    - Name: 
      Entry: 12
      Data: 49
    - Name: 
      Entry: 10
      Data: 64
    - Name: 
      Entry: 10
      Data: 65
    - Name: 
      Entry: 10
      Data: 68
    - Name: 
      Entry: 10
      Data: 73
    - Name: 
      Entry: 10
      Data: 75
    - Name: 
      Entry: 10
      Data: 79
    - Name: 
      Entry: 10
      Data: 82
    - Name: 
      Entry: 10
      Data: 84
    - Name: 
      Entry: 10
      Data: 86
    - Name: 
      Entry: 10
      Data: 89
    - Name: 
      Entry: 10
      Data: 91
    - Name: 
      Entry: 10
      Data: 93
    - Name: 
      Entry: 10
      Data: 95
    - Name: 
      Entry: 10
      Data: 97
    - Name: 
      Entry: 10
      Data: 201
    - Name: 
      Entry: 10
      Data: 202
    - Name: 
      Entry: 10
      Data: 203
    - Name: 
      Entry: 10
      Data: 204
    - Name: 
      Entry: 10
      Data: 205
    - Name: 
      Entry: 10
      Data: 98
    - Name: 
      Entry: 10
      Data: 206
    - Name: 
      Entry: 10
      Data: 207
    - Name: 
      Entry: 10
      Data: 208
    - Name: 
      Entry: 10
      Data: 99
    - Name: 
      Entry: 10
      Data: 209
    - Name: 
      Entry: 10
      Data: 102
    - Name: 
      Entry: 10
      Data: 103
    - Name: 
      Entry: 10
      Data: 104
    - Name: 
      Entry: 10
      Data: 210
    - Name: 
      Entry: 10
      Data: 211
    - Name: 
      Entry: 10
      Data: 212
    - Name: 
      Entry: 10
      Data: 105
    - Name: 
      Entry: 10
      Data: 106
    - Name: 
      Entry: 10
      Data: 108
    - Name: 
      Entry: 10
      Data: 213
    - Name: 
      Entry: 10
      Data: 112
    - Name: 
      Entry: 10
      Data: 214
    - Name: 
      Entry: 10
      Data: 116
    - Name: 
      Entry: 10
      Data: 126
    - Name: 
      Entry: 10
      Data: 140
    - Name: 
      Entry: 10
      Data: 145
    - Name: 
      Entry: 10
      Data: 149
    - Name: 
      Entry: 10
      Data: 150
    - Name: 
      Entry: 10
      Data: 152
    - Name: 
      Entry: 10
      Data: 155
    - Name: 
      Entry: 10
      Data: 160
    - Name: 
      Entry: 10
      Data: 215
    - Name: 
      Entry: 10
      Data: 168
    - Name: 
      Entry: 10
      Data: 180
    - Name: 
      Entry: 13
      Data: 
    - Name: 
      Entry: 8
      Data: 
  <Nickname>k__BackingField: co_be_grp
  <Logo>k__BackingField: {fileID: 21300000, guid: cefb5266c4e9143a492607d88b4c690e, type: 3}
  <Legality>k__BackingField: lawful
  <JumpPreference>k__BackingField: any
  <ScanAnnounce>k__BackingField: 0
  <ScanChance>k__BackingField: 0
