%YAML 1.1
%TAG !u! tag:unity3d.com,2011:
--- !u!114 &11400000
MonoBehaviour:
  m_ObjectHideFlags: 0
  m_CorrespondingSourceObject: {fileID: 0}
  m_PrefabInstance: {fileID: 0}
  m_PrefabAsset: {fileID: 0}
  m_GameObject: {fileID: 0}
  m_Enabled: 1
  m_EditorHideFlags: 0
  m_Script: {fileID: 11500000, guid: b271f90cda31432883e1182aa0b8027c, type: 3}
  m_Name: SO_Faction_GatewayShipping
  m_EditorClassIdentifier: 
  serializationData:
    SerializedFormat: 2
    SerializedBytes: 
    ReferencedUnityObjects:
    - {fileID: 11400000, guid: 7816217cf8eaa4278902b61ba0a2af03, type: 2}
    - {fileID: 11400000, guid: e0cb2f4272d904d50955ca32ecdafa39, type: 2}
    - {fileID: 11400000, guid: 7c6f0350d06714f3db5c82cccbc812ba, type: 2}
    - {fileID: 11400000, guid: 0d46b2c39269747c59579a4408c34643, type: 2}
    - {fileID: 11400000, guid: 5aca43d48730e48bfac9635f7b72a6fe, type: 2}
    - {fileID: 11400000, guid: e5cf04969bfc74cfa9d781d655359d78, type: 2}
    - {fileID: 11400000, guid: 744c518d1bf5c4b8c9902224ba93cbcb, type: 2}
    - {fileID: 11400000, guid: d178e38d1201b4e69b08f68dc51ada8d, type: 2}
    - {fileID: 11400000, guid: 17ca187d2c0e0435799c00a483fe495f, type: 2}
    - {fileID: 11400000, guid: 6a56ebfd596f2409ba6c1378638411a2, type: 2}
    - {fileID: 11400000, guid: 447a49d7c8e51492793ced160f8d42cb, type: 2}
    - {fileID: 11400000, guid: 9ab189d5539924ced9e4d91e5185813e, type: 2}
    - {fileID: 11400000, guid: 095c5c4e3c074457c942014f226e6293, type: 2}
    - {fileID: 11400000, guid: 7e5c119a3e5954c9d95a0fd5febc5ec5, type: 2}
    - {fileID: 11400000, guid: 9f1fe5ebfab8c441eb4e132055568dd4, type: 2}
    - {fileID: 11400000, guid: 5ddc301b56cfb4344a71e27badc22f8a, type: 2}
    - {fileID: 11400000, guid: 233819f10e81045ecb2cd26402c94a86, type: 2}
    - {fileID: 11400000, guid: 67ffa408a1a9447749bb5ff7ee243b9b, type: 2}
    - {fileID: 11400000, guid: cdf28eab446214afc9cdde5c5b1fdc56, type: 2}
    - {fileID: 11400000, guid: 4d255a13a9aa74a5bbc933f6612cfbd8, type: 2}
    - {fileID: 11400000, guid: fa4eae277dff14ddeaf77f2e6d8733e9, type: 2}
    - {fileID: 11400000, guid: cdc2a0f492bb8492ba7e596718895362, type: 2}
    - {fileID: 11400000, guid: 9838cd2a642214500bb05f4d2651a4f7, type: 2}
    - {fileID: 11400000, guid: 64fa43a959e1a42a684bea5367d4ead1, type: 2}
    - {fileID: 11400000, guid: d918497363467490cab836f56ef0cb16, type: 2}
    - {fileID: 11400000, guid: 42ace5e27ed2e4d45b6ba3eec1febb3b, type: 2}
    - {fileID: 11400000, guid: a70b59cc9080e4dde8635e2b48d833ae, type: 2}
    - {fileID: 11400000, guid: ba2aebfd30f7549c583823c825b13fb2, type: 2}
    - {fileID: 11400000, guid: feb985b5dcaff413f9bf2b8d56b77006, type: 2}
    - {fileID: 11400000, guid: a8ccb27f7c05c4eec8bce2cec0734151, type: 2}
    - {fileID: 11400000, guid: 2f24a9f24b6624e068c90fb1a916c98c, type: 2}
    - {fileID: 11400000, guid: 047290a2a69cb4ec7815417d5119f332, type: 2}
    - {fileID: 11400000, guid: 811beb3ff1e3244508d2f3b576da2d4e, type: 2}
    - {fileID: 11400000, guid: ad4d58060aa8c4b47814b8a7114ce222, type: 2}
    - {fileID: 11400000, guid: ab1eba8cbbb9a4d83b2736018fec8afd, type: 2}
    - {fileID: 11400000, guid: 63614196d1eaa49a1a325edd0ad54479, type: 2}
    - {fileID: 11400000, guid: 478dd9a7b9f5d43c79896e4180bbcc88, type: 2}
    - {fileID: 11400000, guid: 39861eec566044a80bf7d19edb385517, type: 2}
    - {fileID: 11400000, guid: fd92c5374f2b944deb6a06a2efebd0a5, type: 2}
    - {fileID: 11400000, guid: bf6609ff962bf43ba9f1edb605bc91af, type: 2}
    - {fileID: 11400000, guid: 9876c6066afbe4c278e6df7867203c51, type: 2}
    - {fileID: 11400000, guid: 2a4aa9edecc634ccca403dbb9cd658c9, type: 2}
    - {fileID: 11400000, guid: b107a784d30094a869f63dee472bac63, type: 2}
    - {fileID: 11400000, guid: 03783c18edc5f40eead1c7d09289700f, type: 2}
    - {fileID: 11400000, guid: 4402e096209084785ab194afa25da1b1, type: 2}
    - {fileID: 11400000, guid: 9d5bbb291524b4141b849f086d39319b, type: 2}
    - {fileID: 11400000, guid: 68290904865fd48c2bb4b37d37aa6993, type: 2}
    - {fileID: 11400000, guid: 4fcafd485d33849e285f88ecc469d40f, type: 2}
    - {fileID: 11400000, guid: d4a232a65085147f1b3a4dcc0abc94d4, type: 2}
    - {fileID: 11400000, guid: 45069beacc2f04a15a79da10c79e74a0, type: 2}
    - {fileID: 11400000, guid: 3c97090660d274d72a13819e37ff5c3e, type: 2}
    - {fileID: 11400000, guid: 40c3ce01a8b4c4d379e10a23e2c69545, type: 2}
    - {fileID: 11400000, guid: 0508c29c7342545818479a1c76e6131b, type: 2}
    - {fileID: 11400000, guid: 4d73ec3a6d088418fad3112db70e7447, type: 2}
    - {fileID: 11400000, guid: 92ea5a3f8686640ec99793b705cda8c1, type: 2}
    - {fileID: 11400000, guid: c8061fc561e714aca9e492105eab1b66, type: 2}
    - {fileID: 11400000, guid: 49355e79c95cd4eb3b8045facaa333dd, type: 2}
    - {fileID: 11400000, guid: 9f76544856a1046bd86cba5663b90d4b, type: 2}
    - {fileID: 11400000, guid: 640e4703f46254de4b3d03cb86f8e38a, type: 2}
    - {fileID: 11400000, guid: d12290a2f163343adb9885399f2ff3a7, type: 2}
    - {fileID: 11400000, guid: a53bc43b3e05f4e34b56af51134478ce, type: 2}
    - {fileID: 11400000, guid: d324f66a3e2414fccbdd15ffe1902df5, type: 2}
    - {fileID: 11400000, guid: 1afd41308bbb6433390e74af2066c1ca, type: 2}
    - {fileID: 11400000, guid: 6b4a63a649535455091c84df3485059e, type: 2}
    - {fileID: 11400000, guid: 7d79efbcecbfa4ee489948f04ab61ba1, type: 2}
    - {fileID: 11400000, guid: f794371ec12354f8c9020ccde5db8c20, type: 2}
    - {fileID: 11400000, guid: 0b7372911ddca4c41afc4a519e8789cc, type: 2}
    - {fileID: 11400000, guid: 03837e36b34bb4cc397529402f904f02, type: 2}
    - {fileID: 11400000, guid: 0c74966870b4a4add876e490ef2ede19, type: 2}
    - {fileID: 11400000, guid: 7a27527064e7247f9bca6056ad116feb, type: 2}
    - {fileID: 11400000, guid: 47998c8ad5a4e478aad56ac24a09c628, type: 2}
    - {fileID: 11400000, guid: 25bb7c56c351943698cb48143f3b2fda, type: 2}
    - {fileID: 11400000, guid: 8134475461e4441509aa991e4e6830ae, type: 2}
    - {fileID: 11400000, guid: ba8daca3fe71140a98e65a9d2d821a87, type: 2}
    - {fileID: 11400000, guid: 6af22b2d1895e4033a1f73a3eb530eec, type: 2}
    - {fileID: 11400000, guid: 30146b532fde24abdbdf6560f27cb7a9, type: 2}
    - {fileID: 11400000, guid: 24047952fbe72475d8dedd3f599c9f3b, type: 2}
    - {fileID: 11400000, guid: a991036c7af4f4dea846b0b1ea1ec95b, type: 2}
    - {fileID: 11400000, guid: 40e123c27bde44d06874eabf503419eb, type: 2}
    - {fileID: 11400000, guid: e382248e1480740448335b62f36cc30c, type: 2}
    - {fileID: 11400000, guid: 0c73f1bb573764008b44e908399d7b0e, type: 2}
    - {fileID: 11400000, guid: 759956af087b54209ab0a23976674eea, type: 2}
    - {fileID: 11400000, guid: 985021796687444c183a4efb7325ea74, type: 2}
    - {fileID: 11400000, guid: 0a883e8a03f4640f29790dd7c1d4c6c8, type: 2}
    - {fileID: 11400000, guid: ccc342f021b304c228bfc6f3d4a2ba5b, type: 2}
    - {fileID: 11400000, guid: 6ff4d5810212441cbbd8b8abe9a34e92, type: 2}
    - {fileID: 11400000, guid: 80fd89ec357e345df82bea43102c5754, type: 2}
    - {fileID: 11400000, guid: df70d315bd93c40788c8df3ea12afcf6, type: 2}
    - {fileID: 11400000, guid: f3bf77a3748064a5d930e85fe60bcd33, type: 2}
    - {fileID: 11400000, guid: b916eb20d2981483eba1bdf9b38cb256, type: 2}
    - {fileID: 11400000, guid: b77181825af7544daad46de3a456ef0f, type: 2}
    - {fileID: 11400000, guid: 3ba6845b408104659b1cfd0bd7bb20e9, type: 2}
    - {fileID: 11400000, guid: 4df0726adfee142febd62df27939b209, type: 2}
    - {fileID: 11400000, guid: b114af0fb5ff6406b89e08a1f96d9dfd, type: 2}
    - {fileID: 11400000, guid: eff675e13cdcd4424b67551946b5198c, type: 2}
    - {fileID: 11400000, guid: 574248bac9f8e444fa1b4b9c241ec15f, type: 2}
    - {fileID: 11400000, guid: c9131b6d035574923916ee0bd2aec899, type: 2}
    - {fileID: 11400000, guid: 703780571684d413b8da35cff7ec1198, type: 2}
    - {fileID: 11400000, guid: 26c83a00bf75745489a99b921b6d8f36, type: 2}
    - {fileID: 11400000, guid: 2718f0ab67cb5447bb50ae3e5c5c5ce4, type: 2}
    - {fileID: 11400000, guid: f8c2bde43da4249edbde2633d64e34a1, type: 2}
    - {fileID: 11400000, guid: b912e9a9dd9d341c082b652f078bb0c9, type: 2}
    - {fileID: 11400000, guid: cbf4ea05036e14390b31694978ab6757, type: 2}
    - {fileID: 11400000, guid: a42da22a879ef47f59eb8f889d6ede04, type: 2}
    - {fileID: 11400000, guid: 2de37b4f63f3149418bdd0abe8f1f6fb, type: 2}
    - {fileID: 11400000, guid: 6bc53980b95fb487297b4742cdc3e256, type: 2}
    - {fileID: 11400000, guid: 232fc4c0e320849c798be2ff70adc705, type: 2}
    - {fileID: 11400000, guid: 49e135086fc7a45f3b8dad1da64f20d2, type: 2}
    - {fileID: 11400000, guid: 3e61a554e2b994150ba138ae9ea3a67b, type: 2}
    - {fileID: 11400000, guid: 3508fccd33b564f41bd058caf38fc0ae, type: 2}
    - {fileID: 11400000, guid: f228fa1cace8a4e779f24a6768104b02, type: 2}
    - {fileID: 11400000, guid: 77876e58f913a467ab7e70f64fc1d426, type: 2}
    - {fileID: 11400000, guid: f364cd011c5b444bb813c26b5285a6cc, type: 2}
    - {fileID: 11400000, guid: af45319446ede4f9c991e9c7f1868dc0, type: 2}
    - {fileID: 11400000, guid: e638e890f9d674ed0be05a5c0aff5d14, type: 2}
    - {fileID: 11400000, guid: 1031cc966df7b48beb6f3c2d14e5323d, type: 2}
    - {fileID: 11400000, guid: 496c8bbd6385c41f19185275b4b97b24, type: 2}
    - {fileID: 11400000, guid: 6a391a75be9824e21a99d624cab549ee, type: 2}
    - {fileID: 11400000, guid: 14cd791fdfd9243a182a70713249416f, type: 2}
    - {fileID: 11400000, guid: 782961b4293cb46ccbbdf42d0f2dab26, type: 2}
    - {fileID: 11400000, guid: 552fa8f23705740de99fee9b05f4fbaf, type: 2}
    - {fileID: 11400000, guid: 992481730c80a414eab01f3984e7405c, type: 2}
    - {fileID: 11400000, guid: 0bff39843f8254868bdb8217974e27d6, type: 2}
    - {fileID: 11400000, guid: 114adf4759be94ffca04fe1a6b1b1017, type: 2}
    - {fileID: 11400000, guid: c7d248799af0d4b9fb974b8bd910de5e, type: 2}
    - {fileID: 11400000, guid: ff7694d9b0cdd4bf685b31afd330793b, type: 2}
    - {fileID: 11400000, guid: b2e5565e2907b4053a23609fa2797889, type: 2}
    - {fileID: 11400000, guid: 66639e30f019b40f98663b9b49c96dfa, type: 2}
    - {fileID: 11400000, guid: 5596a7217ac7b43b1b07a0b61b9994dd, type: 2}
    - {fileID: 11400000, guid: b11c6e289aace42d5b05e2a8d80f7a48, type: 2}
    - {fileID: 11400000, guid: 84eed1dfddc7e45a08763cb44f116690, type: 2}
    - {fileID: 11400000, guid: 7f96b833ac4334a3a8055c7ff6ebeab9, type: 2}
    - {fileID: 11400000, guid: f9522b685d6bf48a49d264adcc79985d, type: 2}
    - {fileID: 11400000, guid: caa7c480b9c9948b6ab2ee8e2e41304b, type: 2}
    - {fileID: 11400000, guid: a6f6369ae68d1402b87398dbae4c7624, type: 2}
    - {fileID: 11400000, guid: 7941739268deb4bd5bd3c369af850ddc, type: 2}
    - {fileID: 11400000, guid: 57ab9810e4e2643e3afa3b01048d9698, type: 2}
    - {fileID: 11400000, guid: 38ea7c4aa47a8475fb3facbcb983c17f, type: 2}
    - {fileID: 11400000, guid: 0f0c3eff2e3c444ebb6ca3b70ff39199, type: 2}
    - {fileID: 11400000, guid: e442086ce50e54bd3ac09156ab37c661, type: 2}
    - {fileID: 11400000, guid: a766bb57046834637ab2f430c28422b8, type: 2}
    - {fileID: 11400000, guid: 0b4daa46ebeee42e59f918727f35bbc5, type: 2}
    - {fileID: 11400000, guid: 35ab77e3080d04107bd1ecf810d88b0c, type: 2}
    - {fileID: 11400000, guid: e106ddcd511674eef9dffdf63995a45d, type: 2}
    - {fileID: 11400000, guid: 42dea8de9be754d58b4ce466011a62df, type: 2}
    - {fileID: 11400000, guid: 8c685b5b1695647c8b5cb33be0ca1d68, type: 2}
    - {fileID: 11400000, guid: bdb8b529f169f4ac8b2fc96dbcaa35e9, type: 2}
    - {fileID: 11400000, guid: 7d50faeb17a61430baecf4ff6e6c45a8, type: 2}
    - {fileID: 11400000, guid: 6aaccaed44de94c5cbb72d50de7456ee, type: 2}
    - {fileID: 11400000, guid: 2527cf475f87e48d3a0e70624cce2bf6, type: 2}
    - {fileID: 11400000, guid: 32e511bdf23b649daa3ac42be575603e, type: 2}
    - {fileID: 11400000, guid: 0989024f4cefa424e9134aa94d8bf9e9, type: 2}
    - {fileID: 11400000, guid: edcd949be3ea34e1399924a1c7feee63, type: 2}
    - {fileID: 11400000, guid: d14a2887784344edbbb0edcf473e7408, type: 2}
    - {fileID: 11400000, guid: 7e07bac837eb04e3e8583e82b3c0460a, type: 2}
    - {fileID: 11400000, guid: e9403d6f4c1204a0d978d4c562ebe281, type: 2}
    - {fileID: 11400000, guid: 190c8eba0172348fd95fb4c28c3799c3, type: 2}
    - {fileID: 11400000, guid: 5f7421dd11c6a450abcc709431103c4b, type: 2}
    - {fileID: 11400000, guid: e5638de48fb5349c0b0136836081de14, type: 2}
    - {fileID: 11400000, guid: 3965d723b49674302ace5e53440770a7, type: 2}
    - {fileID: 11400000, guid: 18fcf3bc0fdf5462a8c1fa1b50b3a83b, type: 2}
    - {fileID: 11400000, guid: 0696c1d7d9ef84be7be6ee54d11c68ac, type: 2}
    - {fileID: 11400000, guid: 3ee3df8a6b8bb4d38bf177fd533c44b5, type: 2}
    - {fileID: 11400000, guid: 35f54936fce604c4f89171cc01511f81, type: 2}
    - {fileID: 11400000, guid: f822400c29aa04760ac13a722108604a, type: 2}
    - {fileID: 11400000, guid: 44af76ac93b4e40e99006e5390839a3f, type: 2}
    - {fileID: 11400000, guid: 71c92069422594aecb74f50ec51dd2ca, type: 2}
    - {fileID: 11400000, guid: 8b849b3fbeeb24d85857c256a2e90cc5, type: 2}
    - {fileID: 11400000, guid: 5d7aad7d6a57d41f2acb2d9287c5eb52, type: 2}
    - {fileID: 11400000, guid: 9cbcd88fd0bee4473985c11f4836b26c, type: 2}
    - {fileID: 11400000, guid: 3a1810f273ed54fecbda39fcbfac1630, type: 2}
    - {fileID: 11400000, guid: 2efea616049e74161b36fb7e427c478d, type: 2}
    - {fileID: 11400000, guid: 0376e30d3b0b448cda591ba6deb2ec23, type: 2}
    - {fileID: 11400000, guid: f6661114a2ec749af94838b4558f9245, type: 2}
    - {fileID: 11400000, guid: 4cc553f1f49264fc5a0ae61edab1682d, type: 2}
    - {fileID: 11400000, guid: 4d98b6455ee2040ed9edbf8d0e3040f4, type: 2}
    - {fileID: 11400000, guid: d497157d2c4ea4483a4ab971712a2337, type: 2}
    - {fileID: 11400000, guid: 65f340ed1cdcb4cfea90652f427106f7, type: 2}
    - {fileID: 11400000, guid: 0d25fbec241054f1f95e1948a79dcb73, type: 2}
    - {fileID: 11400000, guid: 982b997ef395849cba3b987b525c1a34, type: 2}
    - {fileID: 11400000, guid: 78d76bf75fceb4c2b8fd7be404acdace, type: 2}
    - {fileID: 11400000, guid: 1ad9f86182d574f2d9d58aab33987d85, type: 2}
    - {fileID: 11400000, guid: 4acee8d2090a94ceda7f681738ac2b0e, type: 2}
    - {fileID: 11400000, guid: dd7945856c36b4c41ada0a2f534592d1, type: 2}
    - {fileID: 11400000, guid: 7bd032f1dfd524810959401ac6a9f911, type: 2}
    - {fileID: 11400000, guid: 8060ca9139cef44bf9cbbe0c93aae739, type: 2}
    - {fileID: 11400000, guid: d5607fb57153c44a0abb0b4d2cf90a7a, type: 2}
    - {fileID: 11400000, guid: 802db0a5f16504ebbaf38ba440380393, type: 2}
    - {fileID: 11400000, guid: 3354abe4b5067409cb6ff29368796c55, type: 2}
    - {fileID: 11400000, guid: c8cbcda565ef6402fb19ae08fc08362c, type: 2}
    - {fileID: 11400000, guid: 56017afdb05fa4e9e9656dd29c2b47fb, type: 2}
    - {fileID: 11400000, guid: 0bd6103bc48344a42ab3e4fac65365bf, type: 2}
    - {fileID: 11400000, guid: 369127b7cddc348cd8093f9f13459a2b, type: 2}
    - {fileID: 11400000, guid: 586fa928a36094dcc9f0a5bd79e0250b, type: 2}
    - {fileID: 11400000, guid: 0a28e24c871734290bd57fdae19d1ba9, type: 2}
    - {fileID: 11400000, guid: a54fc6613cf854803861bb59693ef6a2, type: 2}
    - {fileID: 11400000, guid: 0bfd5be4bfe7e429aa53470af4f430d8, type: 2}
    - {fileID: 11400000, guid: 4152e814266ba49c68714b07500cb137, type: 2}
    - {fileID: 11400000, guid: ea8e72411c8964804ba8a48fe7f7bb3f, type: 2}
    SerializedBytesString: 
    Prefab: {fileID: 0}
    PrefabModificationsReferencedUnityObjects: []
    PrefabModifications: []
    SerializationNodes:
    - Name: <Name>k__BackingField
      Entry: 10
      Data: 0
    - Name: <ShortName>k__BackingField
      Entry: 10
      Data: 1
    - Name: <Infocard>k__BackingField
      Entry: 10
      Data: 2
    - Name: <Reputations>k__BackingField
      Entry: 7
      Data: 0|System.Collections.Generic.Dictionary`2[[FreelancerDataTool.Interfaces.IFaction,
        Assembly-CSharp],[System.Single, mscorlib]], mscorlib
    - Name: comparer
      Entry: 7
      Data: 1|System.Collections.Generic.ObjectEqualityComparer`1[[FreelancerDataTool.Interfaces.IFaction,
        Assembly-CSharp]], mscorlib
    - Name: 
      Entry: 8
      Data: 
    - Name: 
      Entry: 12
      Data: 65
    - Name: 
      Entry: 7
      Data: 
    - Name: $k
      Entry: 10
      Data: 3
    - Name: $v
      Entry: 4
      Data: -0.65
    - Name: 
      Entry: 8
      Data: 
    - Name: 
      Entry: 7
      Data: 
    - Name: $k
      Entry: 10
      Data: 4
    - Name: $v
      Entry: 4
      Data: -0.65
    - Name: 
      Entry: 8
      Data: 
    - Name: 
      Entry: 7
      Data: 
    - Name: $k
      Entry: 10
      Data: 5
    - Name: $v
      Entry: 4
      Data: -0.65
    - Name: 
      Entry: 8
      Data: 
    - Name: 
      Entry: 7
      Data: 
    - Name: $k
      Entry: 10
      Data: 6
    - Name: $v
      Entry: 4
      Data: -0.65
    - Name: 
      Entry: 8
      Data: 
    - Name: 
      Entry: 7
      Data: 
    - Name: $k
      Entry: 10
      Data: 7
    - Name: $v
      Entry: 4
      Data: -0.65
    - Name: 
      Entry: 8
      Data: 
    - Name: 
      Entry: 7
      Data: 
    - Name: $k
      Entry: 10
      Data: 8
    - Name: $v
      Entry: 4
      Data: -0.65
    - Name: 
      Entry: 8
      Data: 
    - Name: 
      Entry: 7
      Data: 
    - Name: $k
      Entry: 10
      Data: 9
    - Name: $v
      Entry: 4
      Data: -0.65
    - Name: 
      Entry: 8
      Data: 
    - Name: 
      Entry: 7
      Data: 
    - Name: $k
      Entry: 10
      Data: 10
    - Name: $v
      Entry: 4
      Data: -0.65
    - Name: 
      Entry: 8
      Data: 
    - Name: 
      Entry: 7
      Data: 
    - Name: $k
      Entry: 10
      Data: 11
    - Name: $v
      Entry: 4
      Data: -0.65
    - Name: 
      Entry: 8
      Data: 
    - Name: 
      Entry: 7
      Data: 
    - Name: $k
      Entry: 10
      Data: 12
    - Name: $v
      Entry: 4
      Data: -0.65
    - Name: 
      Entry: 8
      Data: 
    - Name: 
      Entry: 7
      Data: 
    - Name: $k
      Entry: 10
      Data: 13
    - Name: $v
      Entry: 4
      Data: -0.65
    - Name: 
      Entry: 8
      Data: 
    - Name: 
      Entry: 7
      Data: 
    - Name: $k
      Entry: 10
      Data: 14
    - Name: $v
      Entry: 4
      Data: -0.65
    - Name: 
      Entry: 8
      Data: 
    - Name: 
      Entry: 7
      Data: 
    - Name: $k
      Entry: 10
      Data: 15
    - Name: $v
      Entry: 4
      Data: -0.65
    - Name: 
      Entry: 8
      Data: 
    - Name: 
      Entry: 7
      Data: 
    - Name: $k
      Entry: 10
      Data: 16
    - Name: $v
      Entry: 4
      Data: -0.65
    - Name: 
      Entry: 8
      Data: 
    - Name: 
      Entry: 7
      Data: 
    - Name: $k
      Entry: 10
      Data: 17
    - Name: $v
      Entry: 4
      Data: -0.65
    - Name: 
      Entry: 8
      Data: 
    - Name: 
      Entry: 7
      Data: 
    - Name: $k
      Entry: 10
      Data: 18
    - Name: $v
      Entry: 4
      Data: -0.65
    - Name: 
      Entry: 8
      Data: 
    - Name: 
      Entry: 7
      Data: 
    - Name: $k
      Entry: 10
      Data: 19
    - Name: $v
      Entry: 4
      Data: -0.65
    - Name: 
      Entry: 8
      Data: 
    - Name: 
      Entry: 7
      Data: 
    - Name: $k
      Entry: 10
      Data: 20
    - Name: $v
      Entry: 4
      Data: -0.65
    - Name: 
      Entry: 8
      Data: 
    - Name: 
      Entry: 7
      Data: 
    - Name: $k
      Entry: 10
      Data: 21
    - Name: $v
      Entry: 4
      Data: -0.65
    - Name: 
      Entry: 8
      Data: 
    - Name: 
      Entry: 7
      Data: 
    - Name: $k
      Entry: 10
      Data: 22
    - Name: $v
      Entry: 4
      Data: -0.65
    - Name: 
      Entry: 8
      Data: 
    - Name: 
      Entry: 7
      Data: 
    - Name: $k
      Entry: 10
      Data: 23
    - Name: $v
      Entry: 4
      Data: -0.65
    - Name: 
      Entry: 8
      Data: 
    - Name: 
      Entry: 7
      Data: 
    - Name: $k
      Entry: 10
      Data: 24
    - Name: $v
      Entry: 4
      Data: -0.65
    - Name: 
      Entry: 8
      Data: 
    - Name: 
      Entry: 7
      Data: 
    - Name: $k
      Entry: 10
      Data: 25
    - Name: $v
      Entry: 4
      Data: -0.65
    - Name: 
      Entry: 8
      Data: 
    - Name: 
      Entry: 7
      Data: 
    - Name: $k
      Entry: 10
      Data: 26
    - Name: $v
      Entry: 4
      Data: -0.65
    - Name: 
      Entry: 8
      Data: 
    - Name: 
      Entry: 7
      Data: 
    - Name: $k
      Entry: 10
      Data: 27
    - Name: $v
      Entry: 4
      Data: -0.65
    - Name: 
      Entry: 8
      Data: 
    - Name: 
      Entry: 7
      Data: 
    - Name: $k
      Entry: 10
      Data: 28
    - Name: $v
      Entry: 4
      Data: -0.65
    - Name: 
      Entry: 8
      Data: 
    - Name: 
      Entry: 7
      Data: 
    - Name: $k
      Entry: 10
      Data: 29
    - Name: $v
      Entry: 4
      Data: -0.65
    - Name: 
      Entry: 8
      Data: 
    - Name: 
      Entry: 7
      Data: 
    - Name: $k
      Entry: 10
      Data: 30
    - Name: $v
      Entry: 4
      Data: -0.65
    - Name: 
      Entry: 8
      Data: 
    - Name: 
      Entry: 7
      Data: 
    - Name: $k
      Entry: 10
      Data: 31
    - Name: $v
      Entry: 4
      Data: -0.65
    - Name: 
      Entry: 8
      Data: 
    - Name: 
      Entry: 7
      Data: 
    - Name: $k
      Entry: 10
      Data: 32
    - Name: $v
      Entry: 4
      Data: -0.65
    - Name: 
      Entry: 8
      Data: 
    - Name: 
      Entry: 7
      Data: 
    - Name: $k
      Entry: 10
      Data: 33
    - Name: $v
      Entry: 4
      Data: -0.65
    - Name: 
      Entry: 8
      Data: 
    - Name: 
      Entry: 7
      Data: 
    - Name: $k
      Entry: 10
      Data: 34
    - Name: $v
      Entry: 4
      Data: -0.3
    - Name: 
      Entry: 8
      Data: 
    - Name: 
      Entry: 7
      Data: 
    - Name: $k
      Entry: 10
      Data: 35
    - Name: $v
      Entry: 4
      Data: -0.3
    - Name: 
      Entry: 8
      Data: 
    - Name: 
      Entry: 7
      Data: 
    - Name: $k
      Entry: 10
      Data: 36
    - Name: $v
      Entry: 4
      Data: -0.3
    - Name: 
      Entry: 8
      Data: 
    - Name: 
      Entry: 7
      Data: 
    - Name: $k
      Entry: 10
      Data: 37
    - Name: $v
      Entry: 4
      Data: -0.3
    - Name: 
      Entry: 8
      Data: 
    - Name: 
      Entry: 7
      Data: 
    - Name: $k
      Entry: 10
      Data: 38
    - Name: $v
      Entry: 4
      Data: -0.3
    - Name: 
      Entry: 8
      Data: 
    - Name: 
      Entry: 7
      Data: 
    - Name: $k
      Entry: 10
      Data: 39
    - Name: $v
      Entry: 4
      Data: 0.3
    - Name: 
      Entry: 8
      Data: 
    - Name: 
      Entry: 7
      Data: 
    - Name: $k
      Entry: 10
      Data: 40
    - Name: $v
      Entry: 4
      Data: 0.3
    - Name: 
      Entry: 8
      Data: 
    - Name: 
      Entry: 7
      Data: 
    - Name: $k
      Entry: 10
      Data: 41
    - Name: $v
      Entry: 4
      Data: 0.3
    - Name: 
      Entry: 8
      Data: 
    - Name: 
      Entry: 7
      Data: 
    - Name: $k
      Entry: 10
      Data: 42
    - Name: $v
      Entry: 4
      Data: 0.3
    - Name: 
      Entry: 8
      Data: 
    - Name: 
      Entry: 7
      Data: 
    - Name: $k
      Entry: 10
      Data: 43
    - Name: $v
      Entry: 4
      Data: 0.3
    - Name: 
      Entry: 8
      Data: 
    - Name: 
      Entry: 7
      Data: 
    - Name: $k
      Entry: 10
      Data: 44
    - Name: $v
      Entry: 4
      Data: 0.3
    - Name: 
      Entry: 8
      Data: 
    - Name: 
      Entry: 7
      Data: 
    - Name: $k
      Entry: 10
      Data: 45
    - Name: $v
      Entry: 4
      Data: 0.3
    - Name: 
      Entry: 8
      Data: 
    - Name: 
      Entry: 7
      Data: 
    - Name: $k
      Entry: 10
      Data: 46
    - Name: $v
      Entry: 4
      Data: 0.3
    - Name: 
      Entry: 8
      Data: 
    - Name: 
      Entry: 7
      Data: 
    - Name: $k
      Entry: 10
      Data: 47
    - Name: $v
      Entry: 4
      Data: 0.3
    - Name: 
      Entry: 8
      Data: 
    - Name: 
      Entry: 7
      Data: 
    - Name: $k
      Entry: 10
      Data: 48
    - Name: $v
      Entry: 4
      Data: 0.3
    - Name: 
      Entry: 8
      Data: 
    - Name: 
      Entry: 7
      Data: 
    - Name: $k
      Entry: 10
      Data: 49
    - Name: $v
      Entry: 4
      Data: 0.3
    - Name: 
      Entry: 8
      Data: 
    - Name: 
      Entry: 7
      Data: 
    - Name: $k
      Entry: 10
      Data: 50
    - Name: $v
      Entry: 4
      Data: 0.3
    - Name: 
      Entry: 8
      Data: 
    - Name: 
      Entry: 7
      Data: 
    - Name: $k
      Entry: 10
      Data: 51
    - Name: $v
      Entry: 4
      Data: 0.3
    - Name: 
      Entry: 8
      Data: 
    - Name: 
      Entry: 7
      Data: 
    - Name: $k
      Entry: 10
      Data: 52
    - Name: $v
      Entry: 4
      Data: 0.3
    - Name: 
      Entry: 8
      Data: 
    - Name: 
      Entry: 7
      Data: 
    - Name: $k
      Entry: 10
      Data: 53
    - Name: $v
      Entry: 4
      Data: 0.3
    - Name: 
      Entry: 8
      Data: 
    - Name: 
      Entry: 7
      Data: 
    - Name: $k
      Entry: 10
      Data: 54
    - Name: $v
      Entry: 4
      Data: 0.3
    - Name: 
      Entry: 8
      Data: 
    - Name: 
      Entry: 7
      Data: 
    - Name: $k
      Entry: 10
      Data: 55
    - Name: $v
      Entry: 4
      Data: 0.3
    - Name: 
      Entry: 8
      Data: 
    - Name: 
      Entry: 7
      Data: 
    - Name: $k
      Entry: 10
      Data: 56
    - Name: $v
      Entry: 4
      Data: 0.3
    - Name: 
      Entry: 8
      Data: 
    - Name: 
      Entry: 7
      Data: 
    - Name: $k
      Entry: 10
      Data: 57
    - Name: $v
      Entry: 4
      Data: 0.3
    - Name: 
      Entry: 8
      Data: 
    - Name: 
      Entry: 7
      Data: 
    - Name: $k
      Entry: 10
      Data: 58
    - Name: $v
      Entry: 4
      Data: 0.3
    - Name: 
      Entry: 8
      Data: 
    - Name: 
      Entry: 7
      Data: 
    - Name: $k
      Entry: 10
      Data: 59
    - Name: $v
      Entry: 4
      Data: 0.3
    - Name: 
      Entry: 8
      Data: 
    - Name: 
      Entry: 7
      Data: 
    - Name: $k
      Entry: 10
      Data: 60
    - Name: $v
      Entry: 4
      Data: 0.3
    - Name: 
      Entry: 8
      Data: 
    - Name: 
      Entry: 7
      Data: 
    - Name: $k
      Entry: 10
      Data: 61
    - Name: $v
      Entry: 4
      Data: 0.65
    - Name: 
      Entry: 8
      Data: 
    - Name: 
      Entry: 7
      Data: 
    - Name: $k
      Entry: 10
      Data: 62
    - Name: $v
      Entry: 4
      Data: 0.65
    - Name: 
      Entry: 8
      Data: 
    - Name: 
      Entry: 7
      Data: 
    - Name: $k
      Entry: 10
      Data: 63
    - Name: $v
      Entry: 4
      Data: 0.65
    - Name: 
      Entry: 8
      Data: 
    - Name: 
      Entry: 7
      Data: 
    - Name: $k
      Entry: 10
      Data: 64
    - Name: $v
      Entry: 4
      Data: 0.65
    - Name: 
      Entry: 8
      Data: 
    - Name: 
      Entry: 7
      Data: 
    - Name: $k
      Entry: 10
      Data: 65
    - Name: $v
      Entry: 4
      Data: 0.65
    - Name: 
      Entry: 8
      Data: 
    - Name: 
      Entry: 7
      Data: 
    - Name: $k
      Entry: 10
      Data: 66
    - Name: $v
      Entry: 4
      Data: 0.65
    - Name: 
      Entry: 8
      Data: 
    - Name: 
      Entry: 7
      Data: 
    - Name: $k
      Entry: 10
      Data: 67
    - Name: $v
      Entry: 4
      Data: 0.65
    - Name: 
      Entry: 8
      Data: 
    - Name: 
      Entry: 13
      Data: 
    - Name: 
      Entry: 8
      Data: 
    - Name: <NpcBribers>k__BackingField
      Entry: 7
      Data: 2|System.Collections.Generic.Dictionary`2[[FreelancerDataTool.Interfaces.INpc,
        Assembly-CSharp],[System.Single, mscorlib]], mscorlib
    - Name: comparer
      Entry: 7
      Data: 3|System.Collections.Generic.ObjectEqualityComparer`1[[FreelancerDataTool.Interfaces.INpc,
        Assembly-CSharp]], mscorlib
    - Name: 
      Entry: 8
      Data: 
    - Name: 
      Entry: 12
      Data: 101
    - Name: 
      Entry: 7
      Data: 
    - Name: $k
      Entry: 10
      Data: 68
    - Name: $v
      Entry: 4
      Data: 840
    - Name: 
      Entry: 8
      Data: 
    - Name: 
      Entry: 7
      Data: 
    - Name: $k
      Entry: 10
      Data: 69
    - Name: $v
      Entry: 4
      Data: 840
    - Name: 
      Entry: 8
      Data: 
    - Name: 
      Entry: 7
      Data: 
    - Name: $k
      Entry: 10
      Data: 70
    - Name: $v
      Entry: 4
      Data: 840
    - Name: 
      Entry: 8
      Data: 
    - Name: 
      Entry: 7
      Data: 
    - Name: $k
      Entry: 10
      Data: 71
    - Name: $v
      Entry: 4
      Data: 840
    - Name: 
      Entry: 8
      Data: 
    - Name: 
      Entry: 7
      Data: 
    - Name: $k
      Entry: 10
      Data: 72
    - Name: $v
      Entry: 4
      Data: 840
    - Name: 
      Entry: 8
      Data: 
    - Name: 
      Entry: 7
      Data: 
    - Name: $k
      Entry: 10
      Data: 73
    - Name: $v
      Entry: 4
      Data: 840
    - Name: 
      Entry: 8
      Data: 
    - Name: 
      Entry: 7
      Data: 
    - Name: $k
      Entry: 10
      Data: 74
    - Name: $v
      Entry: 4
      Data: 840
    - Name: 
      Entry: 8
      Data: 
    - Name: 
      Entry: 7
      Data: 
    - Name: $k
      Entry: 10
      Data: 75
    - Name: $v
      Entry: 4
      Data: 840
    - Name: 
      Entry: 8
      Data: 
    - Name: 
      Entry: 7
      Data: 
    - Name: $k
      Entry: 10
      Data: 76
    - Name: $v
      Entry: 4
      Data: 840
    - Name: 
      Entry: 8
      Data: 
    - Name: 
      Entry: 7
      Data: 
    - Name: $k
      Entry: 10
      Data: 77
    - Name: $v
      Entry: 4
      Data: 840
    - Name: 
      Entry: 8
      Data: 
    - Name: 
      Entry: 7
      Data: 
    - Name: $k
      Entry: 10
      Data: 78
    - Name: $v
      Entry: 4
      Data: 840
    - Name: 
      Entry: 8
      Data: 
    - Name: 
      Entry: 7
      Data: 
    - Name: $k
      Entry: 10
      Data: 79
    - Name: $v
      Entry: 4
      Data: 840
    - Name: 
      Entry: 8
      Data: 
    - Name: 
      Entry: 7
      Data: 
    - Name: $k
      Entry: 10
      Data: 80
    - Name: $v
      Entry: 4
      Data: 840
    - Name: 
      Entry: 8
      Data: 
    - Name: 
      Entry: 7
      Data: 
    - Name: $k
      Entry: 10
      Data: 81
    - Name: $v
      Entry: 4
      Data: 840
    - Name: 
      Entry: 8
      Data: 
    - Name: 
      Entry: 7
      Data: 
    - Name: $k
      Entry: 10
      Data: 82
    - Name: $v
      Entry: 4
      Data: 840
    - Name: 
      Entry: 8
      Data: 
    - Name: 
      Entry: 7
      Data: 
    - Name: $k
      Entry: 10
      Data: 83
    - Name: $v
      Entry: 4
      Data: 840
    - Name: 
      Entry: 8
      Data: 
    - Name: 
      Entry: 7
      Data: 
    - Name: $k
      Entry: 10
      Data: 84
    - Name: $v
      Entry: 4
      Data: 840
    - Name: 
      Entry: 8
      Data: 
    - Name: 
      Entry: 7
      Data: 
    - Name: $k
      Entry: 10
      Data: 85
    - Name: $v
      Entry: 4
      Data: 840
    - Name: 
      Entry: 8
      Data: 
    - Name: 
      Entry: 7
      Data: 
    - Name: $k
      Entry: 10
      Data: 86
    - Name: $v
      Entry: 4
      Data: 840
    - Name: 
      Entry: 8
      Data: 
    - Name: 
      Entry: 7
      Data: 
    - Name: $k
      Entry: 10
      Data: 87
    - Name: $v
      Entry: 4
      Data: 840
    - Name: 
      Entry: 8
      Data: 
    - Name: 
      Entry: 7
      Data: 
    - Name: $k
      Entry: 10
      Data: 88
    - Name: $v
      Entry: 4
      Data: 840
    - Name: 
      Entry: 8
      Data: 
    - Name: 
      Entry: 7
      Data: 
    - Name: $k
      Entry: 10
      Data: 89
    - Name: $v
      Entry: 4
      Data: 840
    - Name: 
      Entry: 8
      Data: 
    - Name: 
      Entry: 7
      Data: 
    - Name: $k
      Entry: 10
      Data: 90
    - Name: $v
      Entry: 4
      Data: 840
    - Name: 
      Entry: 8
      Data: 
    - Name: 
      Entry: 7
      Data: 
    - Name: $k
      Entry: 10
      Data: 91
    - Name: $v
      Entry: 4
      Data: 840
    - Name: 
      Entry: 8
      Data: 
    - Name: 
      Entry: 7
      Data: 
    - Name: $k
      Entry: 10
      Data: 92
    - Name: $v
      Entry: 4
      Data: 840
    - Name: 
      Entry: 8
      Data: 
    - Name: 
      Entry: 7
      Data: 
    - Name: $k
      Entry: 10
      Data: 93
    - Name: $v
      Entry: 4
      Data: 840
    - Name: 
      Entry: 8
      Data: 
    - Name: 
      Entry: 7
      Data: 
    - Name: $k
      Entry: 10
      Data: 94
    - Name: $v
      Entry: 4
      Data: 840
    - Name: 
      Entry: 8
      Data: 
    - Name: 
      Entry: 7
      Data: 
    - Name: $k
      Entry: 10
      Data: 95
    - Name: $v
      Entry: 4
      Data: 840
    - Name: 
      Entry: 8
      Data: 
    - Name: 
      Entry: 7
      Data: 
    - Name: $k
      Entry: 10
      Data: 96
    - Name: $v
      Entry: 4
      Data: 840
    - Name: 
      Entry: 8
      Data: 
    - Name: 
      Entry: 7
      Data: 
    - Name: $k
      Entry: 10
      Data: 97
    - Name: $v
      Entry: 4
      Data: 840
    - Name: 
      Entry: 8
      Data: 
    - Name: 
      Entry: 7
      Data: 
    - Name: $k
      Entry: 10
      Data: 98
    - Name: $v
      Entry: 4
      Data: 840
    - Name: 
      Entry: 8
      Data: 
    - Name: 
      Entry: 7
      Data: 
    - Name: $k
      Entry: 10
      Data: 99
    - Name: $v
      Entry: 4
      Data: 840
    - Name: 
      Entry: 8
      Data: 
    - Name: 
      Entry: 7
      Data: 
    - Name: $k
      Entry: 10
      Data: 100
    - Name: $v
      Entry: 4
      Data: 840
    - Name: 
      Entry: 8
      Data: 
    - Name: 
      Entry: 7
      Data: 
    - Name: $k
      Entry: 10
      Data: 101
    - Name: $v
      Entry: 4
      Data: 840
    - Name: 
      Entry: 8
      Data: 
    - Name: 
      Entry: 7
      Data: 
    - Name: $k
      Entry: 10
      Data: 102
    - Name: $v
      Entry: 4
      Data: 840
    - Name: 
      Entry: 8
      Data: 
    - Name: 
      Entry: 7
      Data: 
    - Name: $k
      Entry: 10
      Data: 103
    - Name: $v
      Entry: 4
      Data: 840
    - Name: 
      Entry: 8
      Data: 
    - Name: 
      Entry: 7
      Data: 
    - Name: $k
      Entry: 10
      Data: 104
    - Name: $v
      Entry: 4
      Data: 840
    - Name: 
      Entry: 8
      Data: 
    - Name: 
      Entry: 7
      Data: 
    - Name: $k
      Entry: 10
      Data: 105
    - Name: $v
      Entry: 4
      Data: 840
    - Name: 
      Entry: 8
      Data: 
    - Name: 
      Entry: 7
      Data: 
    - Name: $k
      Entry: 10
      Data: 106
    - Name: $v
      Entry: 4
      Data: 840
    - Name: 
      Entry: 8
      Data: 
    - Name: 
      Entry: 7
      Data: 
    - Name: $k
      Entry: 10
      Data: 107
    - Name: $v
      Entry: 4
      Data: 840
    - Name: 
      Entry: 8
      Data: 
    - Name: 
      Entry: 7
      Data: 
    - Name: $k
      Entry: 10
      Data: 108
    - Name: $v
      Entry: 4
      Data: 840
    - Name: 
      Entry: 8
      Data: 
    - Name: 
      Entry: 7
      Data: 
    - Name: $k
      Entry: 10
      Data: 109
    - Name: $v
      Entry: 4
      Data: 840
    - Name: 
      Entry: 8
      Data: 
    - Name: 
      Entry: 7
      Data: 
    - Name: $k
      Entry: 10
      Data: 110
    - Name: $v
      Entry: 4
      Data: 840
    - Name: 
      Entry: 8
      Data: 
    - Name: 
      Entry: 7
      Data: 
    - Name: $k
      Entry: 10
      Data: 111
    - Name: $v
      Entry: 4
      Data: 840
    - Name: 
      Entry: 8
      Data: 
    - Name: 
      Entry: 7
      Data: 
    - Name: $k
      Entry: 10
      Data: 112
    - Name: $v
      Entry: 4
      Data: 840
    - Name: 
      Entry: 8
      Data: 
    - Name: 
      Entry: 7
      Data: 
    - Name: $k
      Entry: 10
      Data: 113
    - Name: $v
      Entry: 4
      Data: 840
    - Name: 
      Entry: 8
      Data: 
    - Name: 
      Entry: 7
      Data: 
    - Name: $k
      Entry: 10
      Data: 114
    - Name: $v
      Entry: 4
      Data: 840
    - Name: 
      Entry: 8
      Data: 
    - Name: 
      Entry: 7
      Data: 
    - Name: $k
      Entry: 10
      Data: 115
    - Name: $v
      Entry: 4
      Data: 840
    - Name: 
      Entry: 8
      Data: 
    - Name: 
      Entry: 7
      Data: 
    - Name: $k
      Entry: 10
      Data: 116
    - Name: $v
      Entry: 4
      Data: 840
    - Name: 
      Entry: 8
      Data: 
    - Name: 
      Entry: 7
      Data: 
    - Name: $k
      Entry: 10
      Data: 117
    - Name: $v
      Entry: 4
      Data: 840
    - Name: 
      Entry: 8
      Data: 
    - Name: 
      Entry: 7
      Data: 
    - Name: $k
      Entry: 10
      Data: 118
    - Name: $v
      Entry: 4
      Data: 840
    - Name: 
      Entry: 8
      Data: 
    - Name: 
      Entry: 7
      Data: 
    - Name: $k
      Entry: 10
      Data: 119
    - Name: $v
      Entry: 4
      Data: 840
    - Name: 
      Entry: 8
      Data: 
    - Name: 
      Entry: 7
      Data: 
    - Name: $k
      Entry: 10
      Data: 120
    - Name: $v
      Entry: 4
      Data: 840
    - Name: 
      Entry: 8
      Data: 
    - Name: 
      Entry: 7
      Data: 
    - Name: $k
      Entry: 10
      Data: 121
    - Name: $v
      Entry: 4
      Data: 840
    - Name: 
      Entry: 8
      Data: 
    - Name: 
      Entry: 7
      Data: 
    - Name: $k
      Entry: 10
      Data: 122
    - Name: $v
      Entry: 4
      Data: 840
    - Name: 
      Entry: 8
      Data: 
    - Name: 
      Entry: 7
      Data: 
    - Name: $k
      Entry: 10
      Data: 123
    - Name: $v
      Entry: 4
      Data: 840
    - Name: 
      Entry: 8
      Data: 
    - Name: 
      Entry: 7
      Data: 
    - Name: $k
      Entry: 10
      Data: 124
    - Name: $v
      Entry: 4
      Data: 840
    - Name: 
      Entry: 8
      Data: 
    - Name: 
      Entry: 7
      Data: 
    - Name: $k
      Entry: 10
      Data: 125
    - Name: $v
      Entry: 4
      Data: 840
    - Name: 
      Entry: 8
      Data: 
    - Name: 
      Entry: 7
      Data: 
    - Name: $k
      Entry: 10
      Data: 126
    - Name: $v
      Entry: 4
      Data: 840
    - Name: 
      Entry: 8
      Data: 
    - Name: 
      Entry: 7
      Data: 
    - Name: $k
      Entry: 10
      Data: 127
    - Name: $v
      Entry: 4
      Data: 840
    - Name: 
      Entry: 8
      Data: 
    - Name: 
      Entry: 7
      Data: 
    - Name: $k
      Entry: 10
      Data: 128
    - Name: $v
      Entry: 4
      Data: 840
    - Name: 
      Entry: 8
      Data: 
    - Name: 
      Entry: 7
      Data: 
    - Name: $k
      Entry: 10
      Data: 129
    - Name: $v
      Entry: 4
      Data: 840
    - Name: 
      Entry: 8
      Data: 
    - Name: 
      Entry: 7
      Data: 
    - Name: $k
      Entry: 10
      Data: 130
    - Name: $v
      Entry: 4
      Data: 840
    - Name: 
      Entry: 8
      Data: 
    - Name: 
      Entry: 7
      Data: 
    - Name: $k
      Entry: 10
      Data: 131
    - Name: $v
      Entry: 4
      Data: 840
    - Name: 
      Entry: 8
      Data: 
    - Name: 
      Entry: 7
      Data: 
    - Name: $k
      Entry: 10
      Data: 132
    - Name: $v
      Entry: 4
      Data: 840
    - Name: 
      Entry: 8
      Data: 
    - Name: 
      Entry: 7
      Data: 
    - Name: $k
      Entry: 10
      Data: 133
    - Name: $v
      Entry: 4
      Data: 840
    - Name: 
      Entry: 8
      Data: 
    - Name: 
      Entry: 7
      Data: 
    - Name: $k
      Entry: 10
      Data: 134
    - Name: $v
      Entry: 4
      Data: 840
    - Name: 
      Entry: 8
      Data: 
    - Name: 
      Entry: 7
      Data: 
    - Name: $k
      Entry: 10
      Data: 135
    - Name: $v
      Entry: 4
      Data: 840
    - Name: 
      Entry: 8
      Data: 
    - Name: 
      Entry: 7
      Data: 
    - Name: $k
      Entry: 10
      Data: 136
    - Name: $v
      Entry: 4
      Data: 840
    - Name: 
      Entry: 8
      Data: 
    - Name: 
      Entry: 7
      Data: 
    - Name: $k
      Entry: 10
      Data: 137
    - Name: $v
      Entry: 4
      Data: 840
    - Name: 
      Entry: 8
      Data: 
    - Name: 
      Entry: 7
      Data: 
    - Name: $k
      Entry: 10
      Data: 138
    - Name: $v
      Entry: 4
      Data: 840
    - Name: 
      Entry: 8
      Data: 
    - Name: 
      Entry: 7
      Data: 
    - Name: $k
      Entry: 10
      Data: 139
    - Name: $v
      Entry: 4
      Data: 840
    - Name: 
      Entry: 8
      Data: 
    - Name: 
      Entry: 7
      Data: 
    - Name: $k
      Entry: 10
      Data: 140
    - Name: $v
      Entry: 4
      Data: 840
    - Name: 
      Entry: 8
      Data: 
    - Name: 
      Entry: 7
      Data: 
    - Name: $k
      Entry: 10
      Data: 141
    - Name: $v
      Entry: 4
      Data: 840
    - Name: 
      Entry: 8
      Data: 
    - Name: 
      Entry: 7
      Data: 
    - Name: $k
      Entry: 10
      Data: 142
    - Name: $v
      Entry: 4
      Data: 840
    - Name: 
      Entry: 8
      Data: 
    - Name: 
      Entry: 7
      Data: 
    - Name: $k
      Entry: 10
      Data: 143
    - Name: $v
      Entry: 4
      Data: 840
    - Name: 
      Entry: 8
      Data: 
    - Name: 
      Entry: 7
      Data: 
    - Name: $k
      Entry: 10
      Data: 144
    - Name: $v
      Entry: 4
      Data: 840
    - Name: 
      Entry: 8
      Data: 
    - Name: 
      Entry: 7
      Data: 
    - Name: $k
      Entry: 10
      Data: 145
    - Name: $v
      Entry: 4
      Data: 840
    - Name: 
      Entry: 8
      Data: 
    - Name: 
      Entry: 7
      Data: 
    - Name: $k
      Entry: 10
      Data: 146
    - Name: $v
      Entry: 4
      Data: 840
    - Name: 
      Entry: 8
      Data: 
    - Name: 
      Entry: 7
      Data: 
    - Name: $k
      Entry: 10
      Data: 147
    - Name: $v
      Entry: 4
      Data: 840
    - Name: 
      Entry: 8
      Data: 
    - Name: 
      Entry: 7
      Data: 
    - Name: $k
      Entry: 10
      Data: 148
    - Name: $v
      Entry: 4
      Data: 840
    - Name: 
      Entry: 8
      Data: 
    - Name: 
      Entry: 7
      Data: 
    - Name: $k
      Entry: 10
      Data: 149
    - Name: $v
      Entry: 4
      Data: 840
    - Name: 
      Entry: 8
      Data: 
    - Name: 
      Entry: 7
      Data: 
    - Name: $k
      Entry: 10
      Data: 150
    - Name: $v
      Entry: 4
      Data: 840
    - Name: 
      Entry: 8
      Data: 
    - Name: 
      Entry: 7
      Data: 
    - Name: $k
      Entry: 10
      Data: 151
    - Name: $v
      Entry: 4
      Data: 840
    - Name: 
      Entry: 8
      Data: 
    - Name: 
      Entry: 7
      Data: 
    - Name: $k
      Entry: 10
      Data: 152
    - Name: $v
      Entry: 4
      Data: 840
    - Name: 
      Entry: 8
      Data: 
    - Name: 
      Entry: 7
      Data: 
    - Name: $k
      Entry: 10
      Data: 153
    - Name: $v
      Entry: 4
      Data: 840
    - Name: 
      Entry: 8
      Data: 
    - Name: 
      Entry: 7
      Data: 
    - Name: $k
      Entry: 10
      Data: 154
    - Name: $v
      Entry: 4
      Data: 840
    - Name: 
      Entry: 8
      Data: 
    - Name: 
      Entry: 7
      Data: 
    - Name: $k
      Entry: 10
      Data: 155
    - Name: $v
      Entry: 4
      Data: 840
    - Name: 
      Entry: 8
      Data: 
    - Name: 
      Entry: 7
      Data: 
    - Name: $k
      Entry: 10
      Data: 156
    - Name: $v
      Entry: 4
      Data: 840
    - Name: 
      Entry: 8
      Data: 
    - Name: 
      Entry: 7
      Data: 
    - Name: $k
      Entry: 10
      Data: 157
    - Name: $v
      Entry: 4
      Data: 840
    - Name: 
      Entry: 8
      Data: 
    - Name: 
      Entry: 7
      Data: 
    - Name: $k
      Entry: 10
      Data: 158
    - Name: $v
      Entry: 4
      Data: 840
    - Name: 
      Entry: 8
      Data: 
    - Name: 
      Entry: 7
      Data: 
    - Name: $k
      Entry: 10
      Data: 159
    - Name: $v
      Entry: 4
      Data: 840
    - Name: 
      Entry: 8
      Data: 
    - Name: 
      Entry: 7
      Data: 
    - Name: $k
      Entry: 10
      Data: 160
    - Name: $v
      Entry: 4
      Data: 840
    - Name: 
      Entry: 8
      Data: 
    - Name: 
      Entry: 7
      Data: 
    - Name: $k
      Entry: 10
      Data: 161
    - Name: $v
      Entry: 4
      Data: 840
    - Name: 
      Entry: 8
      Data: 
    - Name: 
      Entry: 7
      Data: 
    - Name: $k
      Entry: 10
      Data: 162
    - Name: $v
      Entry: 4
      Data: 840
    - Name: 
      Entry: 8
      Data: 
    - Name: 
      Entry: 7
      Data: 
    - Name: $k
      Entry: 10
      Data: 163
    - Name: $v
      Entry: 4
      Data: 840
    - Name: 
      Entry: 8
      Data: 
    - Name: 
      Entry: 7
      Data: 
    - Name: $k
      Entry: 10
      Data: 164
    - Name: $v
      Entry: 4
      Data: 840
    - Name: 
      Entry: 8
      Data: 
    - Name: 
      Entry: 7
      Data: 
    - Name: $k
      Entry: 10
      Data: 165
    - Name: $v
      Entry: 4
      Data: 840
    - Name: 
      Entry: 8
      Data: 
    - Name: 
      Entry: 7
      Data: 
    - Name: $k
      Entry: 10
      Data: 166
    - Name: $v
      Entry: 4
      Data: 840
    - Name: 
      Entry: 8
      Data: 
    - Name: 
      Entry: 7
      Data: 
    - Name: $k
      Entry: 10
      Data: 167
    - Name: $v
      Entry: 4
      Data: 840
    - Name: 
      Entry: 8
      Data: 
    - Name: 
      Entry: 7
      Data: 
    - Name: $k
      Entry: 10
      Data: 168
    - Name: $v
      Entry: 4
      Data: 840
    - Name: 
      Entry: 8
      Data: 
    - Name: 
      Entry: 13
      Data: 
    - Name: 
      Entry: 8
      Data: 
    - Name: <ShipsUsed>k__BackingField
      Entry: 7
      Data: 4|System.Collections.Generic.List`1[[FreelancerDataTool.Interfaces.IShip,
        Assembly-CSharp]], mscorlib
    - Name: 
      Entry: 12
      Data: 15
    - Name: 
      Entry: 10
      Data: 169
    - Name: 
      Entry: 10
      Data: 170
    - Name: 
      Entry: 10
      Data: 171
    - Name: 
      Entry: 10
      Data: 172
    - Name: 
      Entry: 10
      Data: 173
    - Name: 
      Entry: 10
      Data: 174
    - Name: 
      Entry: 10
      Data: 175
    - Name: 
      Entry: 10
      Data: 176
    - Name: 
      Entry: 10
      Data: 177
    - Name: 
      Entry: 10
      Data: 178
    - Name: 
      Entry: 10
      Data: 179
    - Name: 
      Entry: 10
      Data: 180
    - Name: 
      Entry: 10
      Data: 181
    - Name: 
      Entry: 10
      Data: 182
    - Name: 
      Entry: 10
      Data: 183
    - Name: 
      Entry: 13
      Data: 
    - Name: 
      Entry: 8
      Data: 
    - Name: <OwnedBases>k__BackingField
      Entry: 7
      Data: 5|System.Collections.Generic.List`1[[FreelancerDataTool.Interfaces.IBase,
        Assembly-CSharp]], mscorlib
    - Name: 
      Entry: 12
      Data: 1
    - Name: 
      Entry: 10
      Data: 184
    - Name: 
      Entry: 13
      Data: 
    - Name: 
      Entry: 8
      Data: 
    - Name: <Npcs>k__BackingField
      Entry: 7
      Data: 6|System.Collections.Generic.List`1[[FreelancerDataTool.Interfaces.INpc,
        Assembly-CSharp]], mscorlib
    - Name: 
      Entry: 12
      Data: 31
    - Name: 
      Entry: 10
      Data: 69
    - Name: 
      Entry: 10
      Data: 70
    - Name: 
      Entry: 10
      Data: 75
    - Name: 
      Entry: 10
      Data: 185
    - Name: 
      Entry: 10
      Data: 186
    - Name: 
      Entry: 10
      Data: 187
    - Name: 
      Entry: 10
      Data: 188
    - Name: 
      Entry: 10
      Data: 189
    - Name: 
      Entry: 10
      Data: 80
    - Name: 
      Entry: 10
      Data: 83
    - Name: 
      Entry: 10
      Data: 190
    - Name: 
      Entry: 10
      Data: 90
    - Name: 
      Entry: 10
      Data: 191
    - Name: 
      Entry: 10
      Data: 96
    - Name: 
      Entry: 10
      Data: 100
    - Name: 
      Entry: 10
      Data: 192
    - Name: 
      Entry: 10
      Data: 109
    - Name: 
      Entry: 10
      Data: 127
    - Name: 
      Entry: 10
      Data: 129
    - Name: 
      Entry: 10
      Data: 135
    - Name: 
      Entry: 10
      Data: 139
    - Name: 
      Entry: 10
      Data: 148
    - Name: 
      Entry: 10
      Data: 193
    - Name: 
      Entry: 10
      Data: 194
    - Name: 
      Entry: 10
      Data: 195
    - Name: 
      Entry: 10
      Data: 196
    - Name: 
      Entry: 10
      Data: 197
    - Name: 
      Entry: 10
      Data: 198
    - Name: 
      Entry: 10
      Data: 156
    - Name: 
      Entry: 10
      Data: 158
    - Name: 
      Entry: 10
      Data: 166
    - Name: 
      Entry: 13
      Data: 
    - Name: 
      Entry: 8
      Data: 
  <Nickname>k__BackingField: co_nws_grp
  <Logo>k__BackingField: {fileID: 21300000, guid: ef45dea461d474e75b02ea151dccc648, type: 3}
  <Legality>k__BackingField: lawful
  <JumpPreference>k__BackingField: any
  <ScanAnnounce>k__BackingField: 0
  <ScanChance>k__BackingField: 0
