%YAML 1.1
%TAG !u! tag:unity3d.com,2011:
--- !u!114 &11400000
MonoBehaviour:
  m_ObjectHideFlags: 0
  m_CorrespondingSourceObject: {fileID: 0}
  m_PrefabInstance: {fileID: 0}
  m_PrefabAsset: {fileID: 0}
  m_GameObject: {fileID: 0}
  m_Enabled: 1
  m_EditorHideFlags: 0
  m_Script: {fileID: 11500000, guid: 182eb47472f64de388dd50183c0411d8, type: 3}
  m_Name: SO_Infocard_488340
  m_EditorClassIdentifier: 
  <Key>k__BackingField: 488340
  <Value>k__BackingField: 'Pennsylvania doesn''t usually require large quantities
    of Pharmaceuticals. The medical facilities on this planet are the only ones that
    really use them. Most of the people on this planet don''t have the credits for
    any "lifestyle supplements" either, so usually we don''t take cargo here. <br>


'
