%YAML 1.1
%TAG !u! tag:unity3d.com,2011:
--- !u!114 &11400000
MonoBehaviour:
  m_ObjectHideFlags: 0
  m_CorrespondingSourceObject: {fileID: 0}
  m_PrefabInstance: {fileID: 0}
  m_PrefabAsset: {fileID: 0}
  m_GameObject: {fileID: 0}
  m_Enabled: 1
  m_EditorHideFlags: 0
  m_Script: {fileID: 11500000, guid: 182eb47472f64de388dd50183c0411d8, type: 3}
  m_Name: SO_Infocard_131414
  m_EditorClassIdentifier: 
  <Key>k__BackingField: 131414
  <Value>k__BackingField: 'We maintain a presence here at the IC headquarters as
    a show of support. After all, IC has been insuring investments throughout Liberty
    for a very long time. This corporation is very interested in curbing piracy.
    Of course not entirely, or no one would need IC anymore. <br><nbsp><br>


'
