%YAML 1.1
%TAG !u! tag:unity3d.com,2011:
--- !u!114 &11400000
MonoBehaviour:
  m_ObjectHideFlags: 0
  m_CorrespondingSourceObject: {fileID: 0}
  m_PrefabInstance: {fileID: 0}
  m_PrefabAsset: {fileID: 0}
  m_GameObject: {fileID: 0}
  m_Enabled: 1
  m_EditorHideFlags: 0
  m_Script: {fileID: 11500000, guid: 182eb47472f64de388dd50183c0411d8, type: 3}
  m_Name: SO_Infocard_132541
  m_EditorClassIdentifier: 
  <Key>k__BackingField: 132541
  <Value>k__BackingField: 'I''m on the Kensington circuit. We usually import H-Fuel
    or Gold. On the outbound trip it could be Luxury Food or Pharmaceuticals. We
    don''t make a lot of profit, but it''s a fairly safe trip, since you don''t need
    to cross a Borderworld to get where you need to be. <br>


'
