%YAML 1.1
%TAG !u! tag:unity3d.com,2011:
--- !u!114 &11400000
MonoBehaviour:
  m_ObjectHideFlags: 0
  m_CorrespondingSourceObject: {fileID: 0}
  m_PrefabInstance: {fileID: 0}
  m_PrefabAsset: {fileID: 0}
  m_GameObject: {fileID: 0}
  m_Enabled: 1
  m_EditorHideFlags: 0
  m_Script: {fileID: 11500000, guid: 182eb47472f64de388dd50183c0411d8, type: 3}
  m_Name: SO_Infocard_133880
  m_EditorClassIdentifier: 
  <Key>k__BackingField: 133880
  <Value>k__BackingField: 'We use this base to attack the Republican Shipping imperialists
    within New Berlin. It''s also a convenient place to purchase proper Rheinland
    Side Arms at a good price. Most of our brothers in arms are in Hamburg, waiting
    in the asteroid fields for any opportunities that may present themselves. <br><nbsp><br>


'
