%YAML 1.1
%TAG !u! tag:unity3d.com,2011:
--- !u!114 &11400000
MonoBehaviour:
  m_ObjectHideFlags: 0
  m_CorrespondingSourceObject: {fileID: 0}
  m_PrefabInstance: {fileID: 0}
  m_PrefabAsset: {fileID: 0}
  m_GameObject: {fileID: 0}
  m_Enabled: 1
  m_EditorHideFlags: 0
  m_Script: {fileID: 11500000, guid: 182eb47472f64de388dd50183c0411d8, type: 3}
  m_Name: SO_Infocard_468743
  m_EditorClassIdentifier: 
  <Key>k__BackingField: 468743
  <Value>k__BackingField: 'The CDI has been drawing recruits directly from Sprauge
    - a lot of the men and women who volunteer think it''ll get them off planet again.
    A notable few are doing it for patriotic reasons and want to protect their new
    home. We need the ships and the manpower more than anything, so quality has gone
    through the floor. The BPA won''t ever drop the facade of incorruptibility, so
    that falls to us. We''re the sump that collects the refuse they don''t want.
    <br>


'
