%YAML 1.1
%TAG !u! tag:unity3d.com,2011:
--- !u!114 &11400000
MonoBehaviour:
  m_ObjectHideFlags: 0
  m_CorrespondingSourceObject: {fileID: 0}
  m_PrefabInstance: {fileID: 0}
  m_PrefabAsset: {fileID: 0}
  m_GameObject: {fileID: 0}
  m_Enabled: 1
  m_EditorHideFlags: 0
  m_Script: {fileID: 11500000, guid: 182eb47472f64de388dd50183c0411d8, type: 3}
  m_Name: SO_Infocard_134298
  m_EditorClassIdentifier: 
  <Key>k__BackingField: 134298
  <Value>k__BackingField: 'During the Freeport 7 attack, a brief communication was
    received on Freeport 9 from a Bounty Hunter named Jim Adams. He had managed to
    make it into the Kunashir Cloud, but still had hostiles in hot pursuit. Most
    people figure he was trying to make it to the Jump Hole to Omicron Theta. He
    never made it here.<br>


'
