%YAML 1.1
%TAG !u! tag:unity3d.com,2011:
--- !u!114 &11400000
MonoBehaviour:
  m_ObjectHideFlags: 0
  m_CorrespondingSourceObject: {fileID: 0}
  m_PrefabInstance: {fileID: 0}
  m_PrefabAsset: {fileID: 0}
  m_GameObject: {fileID: 0}
  m_Enabled: 1
  m_EditorHideFlags: 0
  m_Script: {fileID: 11500000, guid: 182eb47472f64de388dd50183c0411d8, type: 3}
  m_Name: SO_Infocard_132176
  m_EditorClassIdentifier: 
  <Key>k__BackingField: 132176
  <Value>k__BackingField: 'The Shetland was presumed lost after the Gallic invasion
    - but miraculously turned up at the edge of the Dublin system with her cruise
    engines disabled and stores severely depleted. It turns out the ship had to flee
    to deep space after Gallic forces tried to board her. They failed but left the
    ship crippled. It took almost a year for it to cross the vast interstellar space
    between the systems. It was sheer luck that her captain had a keen interest in
    early Sirian colonial space travel - before the Jump Gates existed. He knew how
    to navigate between the stars. Over 1200 souls owe their life to that. <br>


'
