%YAML 1.1
%TAG !u! tag:unity3d.com,2011:
--- !u!114 &11400000
MonoBehaviour:
  m_ObjectHideFlags: 0
  m_CorrespondingSourceObject: {fileID: 0}
  m_PrefabInstance: {fileID: 0}
  m_PrefabAsset: {fileID: 0}
  m_GameObject: {fileID: 0}
  m_Enabled: 1
  m_EditorHideFlags: 0
  m_Script: {fileID: 11500000, guid: 182eb47472f64de388dd50183c0411d8, type: 3}
  m_Name: SO_Infocard_133844
  m_EditorClassIdentifier: 
  <Key>k__BackingField: 133844
  <Value>k__BackingField: 'We supply this operation with Optical Chips from Houston.
    I guess they use them in their Mining Machinery-manufacturing process for control
    devices. On the return trip to Liberty, we haul the Mining Machinery needed by
    the Dallas Debris Field prison crews and the Pittsburgh Boron-extraction operation.
    <br><nbsp><br>


'
