%YAML 1.1
%TAG !u! tag:unity3d.com,2011:
--- !u!114 &11400000
MonoBehaviour:
  m_ObjectHideFlags: 0
  m_CorrespondingSourceObject: {fileID: 0}
  m_PrefabInstance: {fileID: 0}
  m_PrefabAsset: {fileID: 0}
  m_GameObject: {fileID: 0}
  m_Enabled: 1
  m_EditorHideFlags: 0
  m_Script: {fileID: 11500000, guid: 182eb47472f64de388dd50183c0411d8, type: 3}
  m_Name: SO_Infocard_131543
  m_EditorClassIdentifier: 
  <Key>k__BackingField: 131543
  <Value>k__BackingField: 'I won a sweepstakes, that''s why I''m here -- it''s not
    something I could afford on a navy pilot''s salary. I''m originally from Leeds,
    so oxygen-rich air like they have on Curacao is a definite pleasure. My mood
    is improving already. <br><nbsp><br>


'
