%YAML 1.1
%TAG !u! tag:unity3d.com,2011:
--- !u!114 &11400000
MonoBehaviour:
  m_ObjectHideFlags: 0
  m_CorrespondingSourceObject: {fileID: 0}
  m_PrefabInstance: {fileID: 0}
  m_PrefabAsset: {fileID: 0}
  m_GameObject: {fileID: 0}
  m_Enabled: 1
  m_EditorHideFlags: 0
  m_Script: {fileID: 11500000, guid: 182eb47472f64de388dd50183c0411d8, type: 3}
  m_Name: SO_Infocard_515077
  m_EditorClassIdentifier: 
  <Key>k__BackingField: 515077
  <Value>k__BackingField: 'Nearly a million dead...hundreds of fighters, cruisers
    and transports destroyed...our headquarters lost...what are we going to do? Our
    losses are just...incomprehensible...I don''t even know what to say anymore.
    I lost friends...family...and for what? We spent all this time studying, scouting,
    fighting...and still nobody saw this coming. And with one swift masterstroke,
    they have almost destroyed the Order. How long have they planned this? Was it
    purely for revenge? What do they WANT from us?<br>


'
