%YAML 1.1
%TAG !u! tag:unity3d.com,2011:
--- !u!114 &11400000
MonoBehaviour:
  m_ObjectHideFlags: 0
  m_CorrespondingSourceObject: {fileID: 0}
  m_PrefabInstance: {fileID: 0}
  m_PrefabAsset: {fileID: 0}
  m_GameObject: {fileID: 0}
  m_Enabled: 1
  m_EditorHideFlags: 0
  m_Script: {fileID: 11500000, guid: 182eb47472f64de388dd50183c0411d8, type: 3}
  m_Name: SO_Infocard_132273
  m_EditorClassIdentifier: 
  <Key>k__BackingField: 132273
  <Value>k__BackingField: 'The Corsairs are fairly indiscriminate in their targets.
    They seem to hate everybody, and relish confrontation. They will never allow
    themselves to be captured. I''ve seen more than a few attempts to ram you even
    with their ship afire and weapons knocked out. I guess it''s more honorable for
    them to die than surrender. Not to say we haven''t caught a few of them - there''s
    a wing in Newgate reserved for Corsairs. Can''t mix those up with the Mollys
    or there''ll be blood, and lots of it. <br>


'
