%YAML 1.1
%TAG !u! tag:unity3d.com,2011:
--- !u!114 &11400000
MonoBehaviour:
  m_ObjectHideFlags: 0
  m_CorrespondingSourceObject: {fileID: 0}
  m_PrefabInstance: {fileID: 0}
  m_PrefabAsset: {fileID: 0}
  m_GameObject: {fileID: 0}
  m_Enabled: 1
  m_EditorHideFlags: 0
  m_Script: {fileID: 11500000, guid: 182eb47472f64de388dd50183c0411d8, type: 3}
  m_Name: SO_Infocard_132254
  m_EditorClassIdentifier: 
  <Key>k__BackingField: 132254
  <Value>k__BackingField: 'The Lane Hackers'' theft of our proprietary technology
    has been most unfortunate. Ageira is in the process of patching the software
    and modifying the hardware scanners to make it Lane Hacker proof, at which point
    we feel that full confidence in IC and Ageira will be restored. Problem is, so
    far they seem to keep up with the changes we make. I don''t like it, it suggests
    either Ageira or ourselves have a leak quite high in the organization. <br>


'
