%YAML 1.1
%TAG !u! tag:unity3d.com,2011:
--- !u!114 &11400000
MonoBehaviour:
  m_ObjectHideFlags: 0
  m_CorrespondingSourceObject: {fileID: 0}
  m_PrefabInstance: {fileID: 0}
  m_PrefabAsset: {fileID: 0}
  m_GameObject: {fileID: 0}
  m_Enabled: 1
  m_EditorHideFlags: 0
  m_Script: {fileID: 11500000, guid: 182eb47472f64de388dd50183c0411d8, type: 3}
  m_Name: SO_Infocard_133087
  m_EditorClassIdentifier: 
  <Key>k__BackingField: 133087
  <Value>k__BackingField: 'The best way to catch a Molly is to use bait. If you can
    take out one of their engines, the other Mollys are going to stay behind and
    try to rescue the distressed pilot. That''s when you find out if you are good
    enough to do this job. <br>


'
