%YAML 1.1
%TAG !u! tag:unity3d.com,2011:
--- !u!114 &11400000
MonoBehaviour:
  m_ObjectHideFlags: 0
  m_CorrespondingSourceObject: {fileID: 0}
  m_PrefabInstance: {fileID: 0}
  m_PrefabAsset: {fileID: 0}
  m_GameObject: {fileID: 0}
  m_Enabled: 1
  m_EditorHideFlags: 0
  m_Script: {fileID: 11500000, guid: 182eb47472f64de388dd50183c0411d8, type: 3}
  m_Name: SO_Infocard_131608
  m_EditorClassIdentifier: 
  <Key>k__BackingField: 131608
  <Value>k__BackingField: 'Although we sell much of the information we retrieve from
    Universal''s data banks, we use some of the data ourselves to attack the most
    tempting targets. There are four jump holes in this system. The two most valuable
    to the Lane Hackers are the jump holes to Colorado and Kepler.<br>


'
