%YAML 1.1
%TAG !u! tag:unity3d.com,2011:
--- !u!114 &11400000
MonoBehaviour:
  m_ObjectHideFlags: 0
  m_CorrespondingSourceObject: {fileID: 0}
  m_PrefabInstance: {fileID: 0}
  m_PrefabAsset: {fileID: 0}
  m_GameObject: {fileID: 0}
  m_Enabled: 1
  m_EditorHideFlags: 0
  m_Script: {fileID: 11500000, guid: 182eb47472f64de388dd50183c0411d8, type: 3}
  m_Name: SO_Infocard_479017
  m_EditorClassIdentifier: 
  <Key>k__BackingField: 479017
  <Value>k__BackingField: 'This place is enormous. We''re sending out scouting parties
    into the tunnels daily and we still haven''t found where they end. Been with
    them a couple times. Gotta tell you, when you''re used to living, you know, not
    underground, you tend to get a little claustrophobic, even if the ceiling is
    often a hundred meters above you at least.<br>


'
