%YAML 1.1
%TAG !u! tag:unity3d.com,2011:
--- !u!114 &11400000
MonoBehaviour:
  m_ObjectHideFlags: 0
  m_CorrespondingSourceObject: {fileID: 0}
  m_PrefabInstance: {fileID: 0}
  m_PrefabAsset: {fileID: 0}
  m_GameObject: {fileID: 0}
  m_Enabled: 1
  m_EditorHideFlags: 0
  m_Script: {fileID: 11500000, guid: 182eb47472f64de388dd50183c0411d8, type: 3}
  m_Name: SO_Infocard_131213
  m_EditorClassIdentifier: 
  <Key>k__BackingField: 131213
  <Value>k__BackingField: 'The Niobium that we get from the IMG at Java is brought
    here to sell. It is a long and dangerous run. We constantly get attacked by the
    Hogosha in Kusari and then have to deal with the Xenos in Liberty.<br>


'
