%YAML 1.1
%TAG !u! tag:unity3d.com,2011:
--- !u!114 &11400000
MonoBehaviour:
  m_ObjectHideFlags: 0
  m_CorrespondingSourceObject: {fileID: 0}
  m_PrefabInstance: {fileID: 0}
  m_PrefabAsset: {fileID: 0}
  m_GameObject: {fileID: 0}
  m_Enabled: 1
  m_EditorHideFlags: 0
  m_Script: {fileID: 11500000, guid: 182eb47472f64de388dd50183c0411d8, type: 3}
  m_Name: SO_Infocard_460421
  m_EditorClassIdentifier: 
  <Key>k__BackingField: 460421
  <Value>k__BackingField: 'This is a pretty good job. There are so many foreigners
    coming through here that I never get bored from having to hear the same stories
    over and over again. Sure, lady trouble is lady trouble, but at least the babes
    have different names.<br>


'
