%YAML 1.1
%TAG !u! tag:unity3d.com,2011:
--- !u!114 &11400000
MonoBehaviour:
  m_ObjectHideFlags: 0
  m_CorrespondingSourceObject: {fileID: 0}
  m_PrefabInstance: {fileID: 0}
  m_PrefabAsset: {fileID: 0}
  m_GameObject: {fileID: 0}
  m_Enabled: 1
  m_EditorHideFlags: 0
  m_Script: {fileID: 11500000, guid: 182eb47472f64de388dd50183c0411d8, type: 3}
  m_Name: SO_Infocard_513404
  m_EditorClassIdentifier: 
  <Key>k__BackingField: 513404
  <Value>k__BackingField: 'War tends to bring a people together despite their political
    differences. The Mollys responded with patriotism to the Kusari invasion, decreasing
    their attacks against the Crown and even helping fight the KNF in some skirmishes.
    The Gaians, though, they seem to have become bolder somehow...like they had something
    to gain from Kusari invading.<br>


'
