%YAML 1.1
%TAG !u! tag:unity3d.com,2011:
--- !u!114 &11400000
MonoBehaviour:
  m_ObjectHideFlags: 0
  m_CorrespondingSourceObject: {fileID: 0}
  m_PrefabInstance: {fileID: 0}
  m_PrefabAsset: {fileID: 0}
  m_GameObject: {fileID: 0}
  m_Enabled: 1
  m_EditorHideFlags: 0
  m_Script: {fileID: 11500000, guid: 182eb47472f64de388dd50183c0411d8, type: 3}
  m_Name: SO_Infocard_131306
  m_EditorClassIdentifier: 
  <Key>k__BackingField: 131306
  <Value>k__BackingField: 'Being a Bounty Hunter is a tough job; nobody likes you
    and a lot of guys would enjoy killing you. But, that''s why I like it. Bounty
    Hunters don''t really operate like they used to. There was a time when we were
    paid to bring criminals in -- now we are paid to make criminals disappear.<br><nbsp><br>


'
