%YAML 1.1
%TAG !u! tag:unity3d.com,2011:
--- !u!114 &11400000
MonoBehaviour:
  m_ObjectHideFlags: 0
  m_CorrespondingSourceObject: {fileID: 0}
  m_PrefabInstance: {fileID: 0}
  m_PrefabAsset: {fileID: 0}
  m_GameObject: {fileID: 0}
  m_Enabled: 1
  m_EditorHideFlags: 0
  m_Script: {fileID: 11500000, guid: 182eb47472f64de388dd50183c0411d8, type: 3}
  m_Name: SO_Infocard_504890
  m_EditorClassIdentifier: 
  <Key>k__BackingField: 504890
  <Value>k__BackingField: 'Now that the Ryugu Comet is gone, the nearby mining operations
    have also come to an end until it passes through here again. For raiders like
    me that is a setback. Fortunately for me, Samura has uncovered a more lasting
    source of platinum elsewhere in the system, a legacy of the same comet of sorts.
    Sadly the location of this enterprise if far beyond the safety of the nebula,
    so more risk involved. So time to slap on some more armor, heavier guns, and
    start blasting those Samuroaches.<br>


'
