%YAML 1.1
%TAG !u! tag:unity3d.com,2011:
--- !u!114 &11400000
MonoBehaviour:
  m_ObjectHideFlags: 0
  m_CorrespondingSourceObject: {fileID: 0}
  m_PrefabInstance: {fileID: 0}
  m_PrefabAsset: {fileID: 0}
  m_GameObject: {fileID: 0}
  m_Enabled: 1
  m_EditorHideFlags: 0
  m_Script: {fileID: 11500000, guid: 182eb47472f64de388dd50183c0411d8, type: 3}
  m_Name: SO_Infocard_503725
  m_EditorClassIdentifier: 
  <Key>k__BackingField: 503725
  <Value>k__BackingField: '<b>ALLIES:<nbsp> <br></b>LPI, Liberty Navy, LSF, Liberty
    Corporations<br><b><nbsp><br>ENEMIES:<nbsp> <br></b>Liberty Rogues, Lane Hackers,
    Outcasts, Criminals<br><nbsp><br>Deep Space Engineering has an exclusive contract
    with fellow Liberty company Ageira Technologies to build Jump Gates and Trade
    Lanes throughout the Sirius Sector.<br>


'
