%YAML 1.1
%TAG !u! tag:unity3d.com,2011:
--- !u!114 &11400000
MonoBehaviour:
  m_ObjectHideFlags: 0
  m_CorrespondingSourceObject: {fileID: 0}
  m_PrefabInstance: {fileID: 0}
  m_PrefabAsset: {fileID: 0}
  m_GameObject: {fileID: 0}
  m_Enabled: 1
  m_EditorHideFlags: 0
  m_Script: {fileID: 11500000, guid: 182eb47472f64de388dd50183c0411d8, type: 3}
  m_Name: SO_Infocard_471670
  m_EditorClassIdentifier: 
  <Key>k__BackingField: 471670
  <Value>k__BackingField: 'At first I was glad I was assigned to this ship. Being
    on this ship is probably the safest place to be on in the sector, but that''s
    the problem, it''s too safe. We are supposed to guard the back door from the
    Hispanics but we have barely seen any action. Most of the time, by the time we
    are launching the Daishouri''s weapons have already neutralised any threat. I
    almost wish I was on the Ayakashi. I hear they are finding no end of excitement.
    <br>


'
