%YAML 1.1
%TAG !u! tag:unity3d.com,2011:
--- !u!114 &11400000
MonoBehaviour:
  m_ObjectHideFlags: 0
  m_CorrespondingSourceObject: {fileID: 0}
  m_PrefabInstance: {fileID: 0}
  m_PrefabAsset: {fileID: 0}
  m_GameObject: {fileID: 0}
  m_Enabled: 1
  m_EditorHideFlags: 0
  m_Script: {fileID: 11500000, guid: 182eb47472f64de388dd50183c0411d8, type: 3}
  m_Name: SO_Infocard_521260
  m_EditorClassIdentifier: 
  <Key>k__BackingField: 521260
  <Value>k__BackingField: " <br><b><p align=\"center\">Stats<br></b><p align=\"left\">
    <br>Gun/Turret Mounts: 0/6<br>Base Armor: 349600<br>Cargo Space: 205<br>Power
    Output: 35875/684000<br>Thruster Energy: 200/2000<br>Batteries/NanoBots: 1450/585<br>Equipment
    Mounts: CM CD <br> <br><b><p align=\"center\">Maneuverability<br></b><p align=\"left\">
    <br>Max Turn Rate: 39.67\xB0<br>Time to Max Turn: 2.88s<br>Time to turn 180\xB0:
    4.95s<br>Maximum Strafe Speed: 9.71m/s<br>Distance Strafed in 0.5s: 1.9m<br>\n\n"
