%YAML 1.1
%TAG !u! tag:unity3d.com,2011:
--- !u!114 &11400000
MonoBehaviour:
  m_ObjectHideFlags: 0
  m_CorrespondingSourceObject: {fileID: 0}
  m_PrefabInstance: {fileID: 0}
  m_PrefabAsset: {fileID: 0}
  m_GameObject: {fileID: 0}
  m_Enabled: 1
  m_EditorHideFlags: 0
  m_Script: {fileID: 11500000, guid: 182eb47472f64de388dd50183c0411d8, type: 3}
  m_Name: SO_Infocard_133648
  m_EditorClassIdentifier: 
  <Key>k__BackingField: 133648
  <Value>k__BackingField: 'Omega-5 is the hub for all travel in this part of the
    Border Worlds. In this system you will find five Jump Holes that lead to Omega-3,
    Omega-7, Cambridge, Omega-11, and Omega-41. That''s why it is so important we
    hold this system as Corsair space. <br><nbsp><br>


'
