%YAML 1.1
%TAG !u! tag:unity3d.com,2011:
--- !u!114 &11400000
MonoBehaviour:
  m_ObjectHideFlags: 0
  m_CorrespondingSourceObject: {fileID: 0}
  m_PrefabInstance: {fileID: 0}
  m_PrefabAsset: {fileID: 0}
  m_GameObject: {fileID: 0}
  m_Enabled: 1
  m_EditorHideFlags: 0
  m_Script: {fileID: 11500000, guid: 182eb47472f64de388dd50183c0411d8, type: 3}
  m_Name: SO_Infocard_132297
  m_EditorClassIdentifier: 
  <Key>k__BackingField: 132297
  <Value>k__BackingField: 'I almost caught me a Corsair smuggler crossing the Manchester
    Trade Lane the other day. Saw him scurry across in front of us. We pursued him,
    but lost him in the fields. The Corsairs mostly ship Artifacts, which wouldn''t
    be a business model if those idiot aristocrats back in London would stop buying
    them. <br>


'
