%YAML 1.1
%TAG !u! tag:unity3d.com,2011:
--- !u!114 &11400000
MonoBehaviour:
  m_ObjectHideFlags: 0
  m_CorrespondingSourceObject: {fileID: 0}
  m_PrefabInstance: {fileID: 0}
  m_PrefabAsset: {fileID: 0}
  m_GameObject: {fileID: 0}
  m_Enabled: 1
  m_EditorHideFlags: 0
  m_Script: {fileID: 11500000, guid: 182eb47472f64de388dd50183c0411d8, type: 3}
  m_Name: SO_Infocard_132330
  m_EditorClassIdentifier: 
  <Key>k__BackingField: 132330
  <Value>k__BackingField: 'We buy Engine Components, Basic Alloys, Side Arms, and
    other basic necessities in New London. That''s all legal, of course. We run those
    goods in small freighters by the dozens, and tag none of them. Those burocrats
    at docking control never could keep track of us that way. <br>


'
