%YAML 1.1
%TAG !u! tag:unity3d.com,2011:
--- !u!114 &11400000
MonoBehaviour:
  m_ObjectHideFlags: 0
  m_CorrespondingSourceObject: {fileID: 0}
  m_PrefabInstance: {fileID: 0}
  m_PrefabAsset: {fileID: 0}
  m_GameObject: {fileID: 0}
  m_Enabled: 1
  m_EditorHideFlags: 0
  m_Script: {fileID: 11500000, guid: 182eb47472f64de388dd50183c0411d8, type: 3}
  m_Name: SO_Infocard_468203
  m_EditorClassIdentifier: 
  <Key>k__BackingField: 468203
  <Value>k__BackingField: 'Border World Exports has stepped up it''s shipments to
    and from Gran Canaria over the past years. Usually they head for the Bretonian
    refugee camps here on Big Can. I guess people are getting desperate out in Leeds
    if they pay Bowex enough to cross both the Mollies in Dublin and the usual Corsair
    ambush in this system. <br>


'
