%YAML 1.1
%TAG !u! tag:unity3d.com,2011:
--- !u!114 &11400000
MonoBehaviour:
  m_ObjectHideFlags: 0
  m_CorrespondingSourceObject: {fileID: 0}
  m_PrefabInstance: {fileID: 0}
  m_PrefabAsset: {fileID: 0}
  m_GameObject: {fileID: 0}
  m_Enabled: 1
  m_EditorHideFlags: 0
  m_Script: {fileID: 11500000, guid: 182eb47472f64de388dd50183c0411d8, type: 3}
  m_Name: SO_Infocard_132752
  m_EditorClassIdentifier: 
  <Key>k__BackingField: 132752
  <Value>k__BackingField: 'The Alien Organisms found on this world and elsewhere
    in the Edge Worlds, there is no doubt about it, they were engineered. Just like
    Cardamine. There is no chance that either the Cardamine grass or these alien
    organisms evolved naturally. Once we knew that, it was a matter of reverse engineering
    the process - no simple task, and we''ve not perfected it yet, but it has allowed
    us to synthesize a Cardamine-like substance at long last.  <br>


'
