%YAML 1.1
%TAG !u! tag:unity3d.com,2011:
--- !u!114 &11400000
MonoBehaviour:
  m_ObjectHideFlags: 0
  m_CorrespondingSourceObject: {fileID: 0}
  m_PrefabInstance: {fileID: 0}
  m_PrefabAsset: {fileID: 0}
  m_GameObject: {fileID: 0}
  m_Enabled: 1
  m_EditorHideFlags: 0
  m_Script: {fileID: 11500000, guid: 182eb47472f64de388dd50183c0411d8, type: 3}
  m_Name: SO_Infocard_460334
  m_EditorClassIdentifier: 
  <Key>k__BackingField: 460334
  <Value>k__BackingField: 'Although our company policy forbids it, some of my escort
    fighters have been chomping at the bit to get some shots into the Gauls. One
    time two of them broke away from me and joined in a fight that looked even. One
    of them bit it, the other one was fired the day after. Funny thing is, he''s
    now flying a Crusader rather then his old Eagle, so I guess it worked out allright
    for him. <br>


'
