%YAML 1.1
%TAG !u! tag:unity3d.com,2011:
--- !u!114 &11400000
MonoBehaviour:
  m_ObjectHideFlags: 0
  m_CorrespondingSourceObject: {fileID: 0}
  m_PrefabInstance: {fileID: 0}
  m_PrefabAsset: {fileID: 0}
  m_GameObject: {fileID: 0}
  m_Enabled: 1
  m_EditorHideFlags: 0
  m_Script: {fileID: 11500000, guid: 182eb47472f64de388dd50183c0411d8, type: 3}
  m_Name: SO_Infocard_131790
  m_EditorClassIdentifier: 
  <Key>k__BackingField: 131790
  <Value>k__BackingField: 'The LPI does its best in this part of space, but it just
    doesn''t have the agents or the ships to protect all the shipping that passes
    through this system. IC, which insures much of our cargo, has been a close Ageira
    ally since Trade Lanes first went into mass production back in 215 AS. <br><nbsp><br>


'
