%YAML 1.1
%TAG !u! tag:unity3d.com,2011:
--- !u!114 &11400000
MonoBehaviour:
  m_ObjectHideFlags: 0
  m_CorrespondingSourceObject: {fileID: 0}
  m_PrefabInstance: {fileID: 0}
  m_PrefabAsset: {fileID: 0}
  m_GameObject: {fileID: 0}
  m_Enabled: 1
  m_EditorHideFlags: 0
  m_Script: {fileID: 11500000, guid: 182eb47472f64de388dd50183c0411d8, type: 3}
  m_Name: SO_Infocard_133439
  m_EditorClassIdentifier: 
  <Key>k__BackingField: 133439
  <Value>k__BackingField: 'This prison used to be in New Tokyo, but the government
    felt it was a bad idea to keep so many criminals in the capitol system, especially
    when half of the convicts here are Gaijin. Fuchu was moved here because it is
    the closest system to the Border Worlds, and there is but one habitable planet.<br>


'
