%YAML 1.1
%TAG !u! tag:unity3d.com,2011:
--- !u!114 &11400000
MonoBehaviour:
  m_ObjectHideFlags: 0
  m_CorrespondingSourceObject: {fileID: 0}
  m_PrefabInstance: {fileID: 0}
  m_PrefabAsset: {fileID: 0}
  m_GameObject: {fileID: 0}
  m_Enabled: 1
  m_EditorHideFlags: 0
  m_Script: {fileID: 11500000, guid: 182eb47472f64de388dd50183c0411d8, type: 3}
  m_Name: SO_Infocard_131207
  m_EditorClassIdentifier: 
  <Key>k__BackingField: 131207
  <Value>k__BackingField: 'DSE is an important part of the machinery of Liberty power
    in Sirius, so you will see that we have adequate protection within her space.
    Unfortunately, many of our Trade Lane and Jump Gate construction projects are
    found far outside the safety of Liberty, where our affairs can often fall victim
    to pirates and vandals. <br>


'
