%YAML 1.1
%TAG !u! tag:unity3d.com,2011:
--- !u!114 &11400000
MonoBehaviour:
  m_ObjectHideFlags: 0
  m_CorrespondingSourceObject: {fileID: 0}
  m_PrefabInstance: {fileID: 0}
  m_PrefabAsset: {fileID: 0}
  m_GameObject: {fileID: 0}
  m_Enabled: 1
  m_EditorHideFlags: 0
  m_Script: {fileID: 11500000, guid: 182eb47472f64de388dd50183c0411d8, type: 3}
  m_Name: SO_Infocard_513042
  m_EditorClassIdentifier: 
  <Key>k__BackingField: 513042
  <Value>k__BackingField: 'Our war with Gallia must be fought differently. We cannot
    possibly survive a frontal assault against their fleets, not while we are not
    unified in our own house. Our course has returned us to the edge of Kusari space,
    but we must wait for all our brothers to join us, before we return home. Leaving
    soldiers behind is not -our- way. <br>


'
