%YAML 1.1
%TAG !u! tag:unity3d.com,2011:
--- !u!114 &11400000
MonoBehaviour:
  m_ObjectHideFlags: 0
  m_CorrespondingSourceObject: {fileID: 0}
  m_PrefabInstance: {fileID: 0}
  m_PrefabAsset: {fileID: 0}
  m_GameObject: {fileID: 0}
  m_Enabled: 1
  m_EditorHideFlags: 0
  m_Script: {fileID: 11500000, guid: 182eb47472f64de388dd50183c0411d8, type: 3}
  m_Name: SO_Infocard_133630
  m_EditorClassIdentifier: 
  <Key>k__BackingField: 133630
  <Value>k__BackingField: 'Ya know, I was chatting with a mate in the BPA a little
    while back, and he reckons that Daumann''s reports for Corsair attacks in this
    area have dropped through the floor. Makes ya suspicious, dunnit? I know them
    Hessians prefer to hit Daumann to us, but they ain''t too picky either way if
    they find something on the lanes. This is something else altogether. <br>


'
