%YAML 1.1
%TAG !u! tag:unity3d.com,2011:
--- !u!114 &11400000
MonoBehaviour:
  m_ObjectHideFlags: 0
  m_CorrespondingSourceObject: {fileID: 0}
  m_PrefabInstance: {fileID: 0}
  m_PrefabAsset: {fileID: 0}
  m_GameObject: {fileID: 0}
  m_Enabled: 1
  m_EditorHideFlags: 0
  m_Script: {fileID: 11500000, guid: a9d7e182f1a5473f8cb5b7a8a258a22b, type: 3}
  m_Name: SO_Ship_Hammerhead
  m_EditorClassIdentifier: 
  serializationData:
    SerializedFormat: 2
    SerializedBytes: 
    ReferencedUnityObjects:
    - {fileID: 11400000, guid: cd9610c5d00204ebdac44f3da30422a1, type: 2}
    - {fileID: 11400000, guid: 88661b88b9a09451f91a8a47bf80ebca, type: 2}
    SerializedBytesString: 
    Prefab: {fileID: 0}
    PrefabModificationsReferencedUnityObjects: []
    PrefabModifications: []
    SerializationNodes:
    - Name: <Name>k__BackingField
      Entry: 10
      Data: 0
    - Name: <Infocard>k__BackingField
      Entry: 10
      Data: 1
    - Name: <SteeringTorque>k__BackingField
      Entry: 7
      Data: 0|System.Tuple`3[[System.Single, mscorlib],[System.Single, mscorlib],[System.Single,
        mscorlib]], mscorlib
    - Name: m_Item1
      Entry: 4
      Data: 47000
    - Name: m_Item2
      Entry: 4
      Data: 47000
    - Name: m_Item3
      Entry: 4
      Data: 112000
    - Name: 
      Entry: 8
      Data: 
    - Name: <AngularDrag>k__BackingField
      Entry: 7
      Data: 1|System.Tuple`3[[System.Single, mscorlib],[System.Single, mscorlib],[System.Single,
        mscorlib]], mscorlib
    - Name: m_Item1
      Entry: 4
      Data: 38000
    - Name: m_Item2
      Entry: 4
      Data: 38000
    - Name: m_Item3
      Entry: 4
      Data: 38000
    - Name: 
      Entry: 8
      Data: 
    - Name: <RotationInertia>k__BackingField
      Entry: 7
      Data: 2|System.Tuple`3[[System.Single, mscorlib],[System.Single, mscorlib],[System.Single,
        mscorlib]], mscorlib
    - Name: m_Item1
      Entry: 4
      Data: 7500
    - Name: m_Item2
      Entry: 4
      Data: 7500
    - Name: m_Item3
      Entry: 4
      Data: 8500
    - Name: 
      Entry: 8
      Data: 
  <Nickname>k__BackingField: dsy_bh_elite3
  <Model>k__BackingField: {fileID: 0}
  <HoldSize>k__BackingField: 80
  <HitPoints>k__BackingField: 12800
  <Nanobots>k__BackingField: 65
  <ShieldBats>k__BackingField: 65
  <ShipClass>k__BackingField: 3
  <ShipType>k__BackingField: 1
  <Mass>k__BackingField: 150
  <StrafeForce>k__BackingField: 20000
  <StrafePowerUsage>k__BackingField: 2
  <MaxBankAngle>k__BackingField: 40
  <LinearDrag>k__BackingField: 1
  <NudgeForce>k__BackingField: 30000
