%YAML 1.1
%TAG !u! tag:unity3d.com,2011:
--- !u!114 &11400000
MonoBehaviour:
  m_ObjectHideFlags: 0
  m_CorrespondingSourceObject: {fileID: 0}
  m_PrefabInstance: {fileID: 0}
  m_PrefabAsset: {fileID: 0}
  m_GameObject: {fileID: 0}
  m_Enabled: 1
  m_EditorHideFlags: 0
  m_Script: {fileID: 11500000, guid: 182eb47472f64de388dd50183c0411d8, type: 3}
  m_Name: SO_Infocard_502234
  m_EditorClassIdentifier: 
  <Key>k__BackingField: 502234
  <Value>k__BackingField: '<b>ALLIES: <br></b>Gallic Brigands<br><b> <br>ENEMIES:
    <br></b>Outcasts<br> <br>A highly organized crime syndicate that follows traditions
    of the Corsican mafia of Earth, the families of the Unione Corse are known for
    their secrecy and resourcefulness, and even hold the support of some high ranking
    government officials. The group was formed circa 100-110 AGS on Planet New Paris,
    and has since expanded into all populated planets of Gallia. Most notably on
    Planet Marseille, the Unione Corse were instrumental in the formation of the
    Syndicated Minarchy of Provence, who some consider a puppet state of the Corsicans.
    As a result, the Unione Corse enjoy great freedom within Minarchy space, and
    are involved both openly and clandestinely with many of the state''s affairs.<br>
    <br>The legality of the Unione Corse within Gallia has always been a gray area,
    as they themselves are almost never implicated directly in criminal acts, preferring
    more subtle business ventures such as racketeering and the Nox trade, which they
    have cornered the market on.  As a result, the Corse were tolerated by the Royal
    Police and remain tolerated by the Confederacy''s Gendarmerie today, though they
    are always treated with a measure of suspicion. Despite their unique diplomacy,
    the Corse maintain only one standing enemy - the Outcasts, whose Cardamine trade
    they see as competition. Because of this, the Unione Corse have a vested interest
    in keeping Gallia free of the Outcasts, and the two have become bitter enemies
    in their bordering systems.<br>


'
