%YAML 1.1
%TAG !u! tag:unity3d.com,2011:
--- !u!114 &11400000
MonoBehaviour:
  m_ObjectHideFlags: 0
  m_CorrespondingSourceObject: {fileID: 0}
  m_PrefabInstance: {fileID: 0}
  m_PrefabAsset: {fileID: 0}
  m_GameObject: {fileID: 0}
  m_Enabled: 1
  m_EditorHideFlags: 0
  m_Script: {fileID: 11500000, guid: 182eb47472f64de388dd50183c0411d8, type: 3}
  m_Name: SO_Infocard_133736
  m_EditorClassIdentifier: 
  <Key>k__BackingField: 133736
  <Value>k__BackingField: 'If you want to find Diamonds cheaply, go out into Omega-11.
    That''s where the Hessians find them. They bring ''em in to Kreuzberg, we sell
    them to the Berlin Diamond traders. It''s all perfectly legitimate. <br><nbsp><br>


'
