%YAML 1.1
%TAG !u! tag:unity3d.com,2011:
--- !u!114 &11400000
MonoBehaviour:
  m_ObjectHideFlags: 0
  m_CorrespondingSourceObject: {fileID: 0}
  m_PrefabInstance: {fileID: 0}
  m_PrefabAsset: {fileID: 0}
  m_GameObject: {fileID: 0}
  m_Enabled: 1
  m_EditorHideFlags: 0
  m_Script: {fileID: 11500000, guid: 182eb47472f64de388dd50183c0411d8, type: 3}
  m_Name: SO_Infocard_131204
  m_EditorClassIdentifier: 
  <Key>k__BackingField: 131204
  <Value>k__BackingField: 'With all that Cryer does to make the people of Sirius
    healthy and safe it still appalls me to see those poor Cardamine junkies dying
    in plain view. One day soon Cryer will make a synthetic Cardamine that isn''t
    addictive or harmful. Cryer is dedicated to a healthy and fun lifestyle that
    doesn''t reduce worker productivity. <br>


'
