%YAML 1.1
%TAG !u! tag:unity3d.com,2011:
--- !u!114 &11400000
MonoBehaviour:
  m_ObjectHideFlags: 0
  m_CorrespondingSourceObject: {fileID: 0}
  m_PrefabInstance: {fileID: 0}
  m_PrefabAsset: {fileID: 0}
  m_GameObject: {fileID: 0}
  m_Enabled: 1
  m_EditorHideFlags: 0
  m_Script: {fileID: 11500000, guid: 182eb47472f64de388dd50183c0411d8, type: 3}
  m_Name: SO_Infocard_488297
  m_EditorClassIdentifier: 
  <Key>k__BackingField: 488297
  <Value>k__BackingField: 'Erie is a nice place to live if you like roughing it.
    A lot of the planet is still uninhabited, and I hear the wildlife is quite a
    challenge. ''Though I suppose, after chasing Outcasts in California, a couple
    of predatory tripeds will seem like vacation. My kind of vacation. <br>


'
