%YAML 1.1
%TAG !u! tag:unity3d.com,2011:
--- !u!114 &11400000
MonoBehaviour:
  m_ObjectHideFlags: 0
  m_CorrespondingSourceObject: {fileID: 0}
  m_PrefabInstance: {fileID: 0}
  m_PrefabAsset: {fileID: 0}
  m_GameObject: {fileID: 0}
  m_Enabled: 1
  m_EditorHideFlags: 0
  m_Script: {fileID: 11500000, guid: 182eb47472f64de388dd50183c0411d8, type: 3}
  m_Name: SO_Infocard_513601
  m_EditorClassIdentifier: 
  <Key>k__BackingField: 513601
  <Value>k__BackingField: 'The work here isn''t that hard, the problem is getting
    through station security. Security checks are constantly going on around here.
    Even if you are just moving from one level to another, you have to go through
    at least one layer. This is especially true for the core decks.<br>


'
