%YAML 1.1
%TAG !u! tag:unity3d.com,2011:
--- !u!114 &11400000
MonoBehaviour:
  m_ObjectHideFlags: 0
  m_CorrespondingSourceObject: {fileID: 0}
  m_PrefabInstance: {fileID: 0}
  m_PrefabAsset: {fileID: 0}
  m_GameObject: {fileID: 0}
  m_Enabled: 1
  m_EditorHideFlags: 0
  m_Script: {fileID: 11500000, guid: 182eb47472f64de388dd50183c0411d8, type: 3}
  m_Name: SO_Infocard_133534
  m_EditorClassIdentifier: 
  <Key>k__BackingField: 133534
  <Value>k__BackingField: 'The Farmers Alliance focuses its attacks on foreigners''
    commodities moving through Shikoku, especially those produced by Synth Foods,
    who undermines the hard work that we the farmers do. The Alliance has also been
    known to make accidental attacks on Kishiro shipping convoys moving through the
    system. How unfortunate for Kishiro, to think I used to have some sympathy for
    them. Not anymore, not after their betrayal of our Emperor and our people.<br>


'
