%YAML 1.1
%TAG !u! tag:unity3d.com,2011:
--- !u!114 &11400000
MonoBehaviour:
  m_ObjectHideFlags: 0
  m_CorrespondingSourceObject: {fileID: 0}
  m_PrefabInstance: {fileID: 0}
  m_PrefabAsset: {fileID: 0}
  m_GameObject: {fileID: 0}
  m_Enabled: 1
  m_EditorHideFlags: 0
  m_Script: {fileID: 11500000, guid: 182eb47472f64de388dd50183c0411d8, type: 3}
  m_Name: SO_Infocard_465385
  m_EditorClassIdentifier: 
  <Key>k__BackingField: 465385
  <Value>k__BackingField: 'We are happy to see DSE gone. It is not the corporation
    itself that had us worried, we work with them all the time.It is the fact that
    they are a precursor to Liberty annexing a system. We spent 7 years putting Paisley
    together and are not interested in it being taken out from under us.<br>


'
