%YAML 1.1
%TAG !u! tag:unity3d.com,2011:
--- !u!114 &11400000
MonoBehaviour:
  m_ObjectHideFlags: 0
  m_CorrespondingSourceObject: {fileID: 0}
  m_PrefabInstance: {fileID: 0}
  m_PrefabAsset: {fileID: 0}
  m_GameObject: {fileID: 0}
  m_Enabled: 1
  m_EditorHideFlags: 0
  m_Script: {fileID: 11500000, guid: 182eb47472f64de388dd50183c0411d8, type: 3}
  m_Name: SO_Infocard_133029
  m_EditorClassIdentifier: 
  <Key>k__BackingField: 133029
  <Value>k__BackingField: 'Trade between Rheinland and Kusari has been steadily increasing
    over the past years. The two Houses are growing closer to eachother, which is
    good for us. It stabilises the region. Corsair and Outcast raiders remain a problem
    however, so ships do tend to get damaged. It is another reason why a shipyard
    in this system is not a bad thing to have. <br>


'
