%YAML 1.1
%TAG !u! tag:unity3d.com,2011:
--- !u!114 &11400000
MonoBehaviour:
  m_ObjectHideFlags: 0
  m_CorrespondingSourceObject: {fileID: 0}
  m_PrefabInstance: {fileID: 0}
  m_PrefabAsset: {fileID: 0}
  m_GameObject: {fileID: 0}
  m_Enabled: 1
  m_EditorHideFlags: 0
  m_Script: {fileID: 11500000, guid: 182eb47472f64de388dd50183c0411d8, type: 3}
  m_Name: SO_Infocard_131699
  m_EditorClassIdentifier: 
  <Key>k__BackingField: 131699
  <Value>k__BackingField: 'They''re always trying to cut costs at LPI, make everyone
    meet their criminal quotas of the week. Guess that''s what you get with privatized
    police. I heard they don''t do it that way in the other Houses. Those guys seem
    pretty happy. Go figure. <br>


'
