%YAML 1.1
%TAG !u! tag:unity3d.com,2011:
--- !u!114 &11400000
MonoBehaviour:
  m_ObjectHideFlags: 0
  m_CorrespondingSourceObject: {fileID: 0}
  m_PrefabInstance: {fileID: 0}
  m_PrefabAsset: {fileID: 0}
  m_GameObject: {fileID: 0}
  m_Enabled: 1
  m_EditorHideFlags: 0
  m_Script: {fileID: 11500000, guid: 182eb47472f64de388dd50183c0411d8, type: 3}
  m_Name: SO_Infocard_134329
  m_EditorClassIdentifier: 
  <Key>k__BackingField: 134329
  <Value>k__BackingField: 'The Shibuya Maru was making a Cardamine shipment across
    the southern end of the Shikoku system when it was intercepted by a Bounty Hunter
    named Jake Rush. He swears that he opened fire and badly wounded the ship. He
    searched the cloud for some time, but never found the Shibuya. The word around
    Deshima is that it never made it to the Galileo system. It''s probably out there
    somewhere in the Keiun Cloud. <br><nbsp><br>


'
