%YAML 1.1
%TAG !u! tag:unity3d.com,2011:
--- !u!114 &11400000
MonoBehaviour:
  m_ObjectHideFlags: 0
  m_CorrespondingSourceObject: {fileID: 0}
  m_PrefabInstance: {fileID: 0}
  m_PrefabAsset: {fileID: 0}
  m_GameObject: {fileID: 0}
  m_Enabled: 1
  m_EditorHideFlags: 0
  m_Script: {fileID: 11500000, guid: 182eb47472f64de388dd50183c0411d8, type: 3}
  m_Name: SO_Infocard_488272
  m_EditorClassIdentifier: 
  <Key>k__BackingField: 488272
  <Value>k__BackingField: 'Among all the spies you may usually find on a Zoner Base
    the Gallians are the most enduring and cunning. Usually we''re quite open to
    any kind of relations, with a comfortable attitude for all the petitioners to
    our intelligence services, but Gallic intelligence services are a completely
    different matter: we don''t like them, but we still don''t know how many Zoners
    are working for them. So take care who you''re trusting when trying to open secret
    channels. <br>


'
