%YAML 1.1
%TAG !u! tag:unity3d.com,2011:
--- !u!114 &11400000
MonoBehaviour:
  m_ObjectHideFlags: 0
  m_CorrespondingSourceObject: {fileID: 0}
  m_PrefabInstance: {fileID: 0}
  m_PrefabAsset: {fileID: 0}
  m_GameObject: {fileID: 0}
  m_Enabled: 1
  m_EditorHideFlags: 0
  m_Script: {fileID: 11500000, guid: 182eb47472f64de388dd50183c0411d8, type: 3}
  m_Name: SO_Infocard_266749
  m_EditorClassIdentifier: 
  <Key>k__BackingField: 266749
  <Value>k__BackingField: 'As far as our agents can tell, Core is just putting up
    a front to their shareholders about their situation here. Right now if you want
    to leave Delta back to House space you need to go either through Theta or Mu,
    there''s no way they''re not deeply in the red.


'
