%YAML 1.1
%TAG !u! tag:unity3d.com,2011:
--- !u!114 &11400000
MonoBehaviour:
  m_ObjectHideFlags: 0
  m_CorrespondingSourceObject: {fileID: 0}
  m_PrefabInstance: {fileID: 0}
  m_PrefabAsset: {fileID: 0}
  m_GameObject: {fileID: 0}
  m_Enabled: 1
  m_EditorHideFlags: 0
  m_Script: {fileID: 11500000, guid: 182eb47472f64de388dd50183c0411d8, type: 3}
  m_Name: SO_Infocard_460324
  m_EditorClassIdentifier: 
  <Key>k__BackingField: 460324
  <Value>k__BackingField: 'Welcome to the Stirling, good sir. You''re among one of
    the most battle-hardened crews in Bretonia, you are. We''ve been slugging it
    out with Kusari since those damned rascals found their way into the system, and
    now those Gauls have followed in their wake. But we''re the most dogged soldiers
    in the fleet. They won''t get past us, no sir. <br>


'
