%YAML 1.1
%TAG !u! tag:unity3d.com,2011:
--- !u!114 &11400000
MonoBehaviour:
  m_ObjectHideFlags: 0
  m_CorrespondingSourceObject: {fileID: 0}
  m_PrefabInstance: {fileID: 0}
  m_PrefabAsset: {fileID: 0}
  m_GameObject: {fileID: 0}
  m_Enabled: 1
  m_EditorHideFlags: 0
  m_Script: {fileID: 11500000, guid: 182eb47472f64de388dd50183c0411d8, type: 3}
  m_Name: SO_Infocard_502228
  m_EditorClassIdentifier: 
  <Key>k__BackingField: 502228
  <Value>k__BackingField: '<b>ALLIES: <br></b>Gallic Navy, GNI, Gallic Corporations<br><b>
    <br>ENEMIES: <br></b>Gallic Brigands, Outcasts,The Maquis<br> <br>Ile-de-France
    Shipping was founded in 501 AGS during the First Gallic War, where old shipping
    companies refused to participate. IDF dominated in risky wartime logistics, and
    as a result they quickly began to curry favor with the Gallic Crown. In the years
    that followed, IDF became the leading shipping corporation in Gallic space, accounting
    for the majority of the civilian transportation market.<br> <br>When the Confederacy
    formed, IDF''s downfall had begun. A plethora of independent shipping companies
    began to surface who competed against IDF. In mere months, IDF''s market share
    plunged catastrophically, making the corporation secretly supply the Gallic Royal
    Navy in hope for a day of redemption. When Kusari occupied La Charite at the
    break of the Kusari Invasion, it left IDF in a crippled economic state. Market
    experts estimate IDF''s future is very, very short.<br>


'
