%YAML 1.1
%TAG !u! tag:unity3d.com,2011:
--- !u!114 &11400000
MonoBehaviour:
  m_ObjectHideFlags: 0
  m_CorrespondingSourceObject: {fileID: 0}
  m_PrefabInstance: {fileID: 0}
  m_PrefabAsset: {fileID: 0}
  m_GameObject: {fileID: 0}
  m_Enabled: 1
  m_EditorHideFlags: 0
  m_Script: {fileID: 11500000, guid: 182eb47472f64de388dd50183c0411d8, type: 3}
  m_Name: SO_Infocard_132570
  m_EditorClassIdentifier: 
  <Key>k__BackingField: 132570
  <Value>k__BackingField: 'Omega-3 is a sea of ice asteroids. Corsairs are more of
    a problem in our end of the system; the Red Hessians take over at the east end.
    They''re more focused on that Daumann installation, Rugen, but they still pose
    a threat to shippers near the Omega-7 gate. Daumann doesn''t like us around their
    installation. Suits me, they can deal with those pirates themselves then. <br>


'
