%YAML 1.1
%TAG !u! tag:unity3d.com,2011:
--- !u!114 &11400000
MonoBehaviour:
  m_ObjectHideFlags: 0
  m_CorrespondingSourceObject: {fileID: 0}
  m_PrefabInstance: {fileID: 0}
  m_PrefabAsset: {fileID: 0}
  m_GameObject: {fileID: 0}
  m_Enabled: 1
  m_EditorHideFlags: 0
  m_Script: {fileID: 11500000, guid: 182eb47472f64de388dd50183c0411d8, type: 3}
  m_Name: SO_Infocard_515029
  m_EditorClassIdentifier: 
  <Key>k__BackingField: 515029
  <Value>k__BackingField: 'Before ending up here I used to be a pirate that took
    his chance in Rheinland. Under-equipped federals were only a minor threat to
    anyone who knew how not to draw attention to yourself. Sadly, my luck has run
    out years ago and I was destined to rot in a planetary prison until my life ended,
    if it weren''t for the Core. They took me out of there under the condition that
    I will be working for them. Legal slavery if you ask me. I took my first opportunity
    to sign with The Order as they flooded this station.<br>


'
