%YAML 1.1
%TAG !u! tag:unity3d.com,2011:
--- !u!114 &11400000
MonoBehaviour:
  m_ObjectHideFlags: 0
  m_CorrespondingSourceObject: {fileID: 0}
  m_PrefabInstance: {fileID: 0}
  m_PrefabAsset: {fileID: 0}
  m_GameObject: {fileID: 0}
  m_Enabled: 1
  m_EditorHideFlags: 0
  m_Script: {fileID: 11500000, guid: 182eb47472f64de388dd50183c0411d8, type: 3}
  m_Name: SO_Infocard_468744
  m_EditorClassIdentifier: 
  <Key>k__BackingField: 468744
  <Value>k__BackingField: 'I can''t help but feel I''m protecting another corporate
    haven. Bowex and BMM have already applied for monopoly charters for Nottingham
    minerals and exports. BMM must have found something here to warrant that. Are
    the government really going to stand by and permit a second Leeds? The Gaians
    may be traitors, but they had a point. Besides, with security as it is, letting
    those corporations handle matters is setting this planet up for a fullscale riot,
    which would be well outside of our ability to handle right now. <br>


'
