%YAML 1.1
%TAG !u! tag:unity3d.com,2011:
--- !u!114 &11400000
MonoBehaviour:
  m_ObjectHideFlags: 0
  m_CorrespondingSourceObject: {fileID: 0}
  m_PrefabInstance: {fileID: 0}
  m_PrefabAsset: {fileID: 0}
  m_GameObject: {fileID: 0}
  m_Enabled: 1
  m_EditorHideFlags: 0
  m_Script: {fileID: 11500000, guid: 182eb47472f64de388dd50183c0411d8, type: 3}
  m_Name: SO_Infocard_470151
  m_EditorClassIdentifier: 
  <Key>k__BackingField: 470151
  <Value>k__BackingField: 'The new jumpgate makes this mining operation very interesting
    for IDF Shipping. These miners used to ship a lot to Bretonia, and that surplus
    is now going to Gallia instead. If we''d needed to conquer mining bases like
    these, it would have been years before they would be operational again. <br>


'
