%YAML 1.1
%TAG !u! tag:unity3d.com,2011:
--- !u!114 &11400000
MonoBehaviour:
  m_ObjectHideFlags: 0
  m_CorrespondingSourceObject: {fileID: 0}
  m_PrefabInstance: {fileID: 0}
  m_PrefabAsset: {fileID: 0}
  m_GameObject: {fileID: 0}
  m_Enabled: 1
  m_EditorHideFlags: 0
  m_Script: {fileID: 11500000, guid: 182eb47472f64de388dd50183c0411d8, type: 3}
  m_Name: SO_Infocard_134219
  m_EditorClassIdentifier: 
  <Key>k__BackingField: 134219
  <Value>k__BackingField: 'What a fitting place this cloud is; formed from the sulfurous
    waste of the smelting plants in the system, crafted by Daumann and Kruger''s
    heedlessness. Now it hides their greatest threat: the Red Hessians. It also hides
    the Jump Holes to New Berlin and Stuttgart. <br><nbsp><br>


'
