%YAML 1.1
%TAG !u! tag:unity3d.com,2011:
--- !u!114 &11400000
MonoBehaviour:
  m_ObjectHideFlags: 0
  m_CorrespondingSourceObject: {fileID: 0}
  m_PrefabInstance: {fileID: 0}
  m_PrefabAsset: {fileID: 0}
  m_GameObject: {fileID: 0}
  m_Enabled: 1
  m_EditorHideFlags: 0
  m_Script: {fileID: 11500000, guid: 182eb47472f64de388dd50183c0411d8, type: 3}
  m_Name: SO_Infocard_134345
  m_EditorClassIdentifier: 
  <Key>k__BackingField: 134345
  <Value>k__BackingField: 'There are multiple dead ships floating in a radiation
    pocket of the Ruhrfeld. They are most likely Unioners, maybe a Red Hessian or
    two. Most of them have been stripped clean, but there may still be a few with
    one or two weapons left on them. <br><nbsp><br>


'
