%YAML 1.1
%TAG !u! tag:unity3d.com,2011:
--- !u!114 &11400000
MonoBehaviour:
  m_ObjectHideFlags: 0
  m_CorrespondingSourceObject: {fileID: 0}
  m_PrefabInstance: {fileID: 0}
  m_PrefabAsset: {fileID: 0}
  m_GameObject: {fileID: 0}
  m_Enabled: 1
  m_EditorHideFlags: 0
  m_Script: {fileID: 11500000, guid: 182eb47472f64de388dd50183c0411d8, type: 3}
  m_Name: SO_Infocard_131929
  m_EditorClassIdentifier: 
  <Key>k__BackingField: 131929
  <Value>k__BackingField: 'Heaviest action in the system is by the Cortez Hole in
    the Tahoe Cloud. You better come in with your guns blazing if you want a chance
    of going home that night. Been trying to talk a few of my buddies into doing
    it, but they all keep backing out. <br>


'
