%YAML 1.1
%TAG !u! tag:unity3d.com,2011:
--- !u!114 &11400000
MonoBehaviour:
  m_ObjectHideFlags: 0
  m_CorrespondingSourceObject: {fileID: 0}
  m_PrefabInstance: {fileID: 0}
  m_PrefabAsset: {fileID: 0}
  m_GameObject: {fileID: 0}
  m_Enabled: 1
  m_EditorHideFlags: 0
  m_Script: {fileID: 11500000, guid: b271f90cda31432883e1182aa0b8027c, type: 3}
  m_Name: SO_Faction_UnionerGuard
  m_EditorClassIdentifier: 
  serializationData:
    SerializedFormat: 2
    SerializedBytes: 
    ReferencedUnityObjects:
    - {fileID: 11400000, guid: 05c1ba828579746eca96d44db10a78ab, type: 2}
    - {fileID: 11400000, guid: 92ea0fd4c1d1e488d94ab876692b1b10, type: 2}
    - {fileID: 11400000, guid: e019efef5bcae4080a96ce681e29d727, type: 2}
    - {fileID: 11400000, guid: bf6609ff962bf43ba9f1edb605bc91af, type: 2}
    - {fileID: 11400000, guid: d324f66a3e2414fccbdd15ffe1902df5, type: 2}
    - {fileID: 11400000, guid: 1afd41308bbb6433390e74af2066c1ca, type: 2}
    - {fileID: 11400000, guid: 6b4a63a649535455091c84df3485059e, type: 2}
    - {fileID: 11400000, guid: 7d79efbcecbfa4ee489948f04ab61ba1, type: 2}
    - {fileID: 11400000, guid: cec6002b426154c94bba7ff771f75e9d, type: 2}
    - {fileID: 11400000, guid: 9876c6066afbe4c278e6df7867203c51, type: 2}
    - {fileID: 11400000, guid: 2a4aa9edecc634ccca403dbb9cd658c9, type: 2}
    - {fileID: 11400000, guid: b107a784d30094a869f63dee472bac63, type: 2}
    - {fileID: 11400000, guid: 10449b69f19c24d90ad54ed9d60b7256, type: 2}
    - {fileID: 11400000, guid: 03783c18edc5f40eead1c7d09289700f, type: 2}
    - {fileID: 11400000, guid: 4402e096209084785ab194afa25da1b1, type: 2}
    - {fileID: 11400000, guid: f5db549bc6f544772bfb28f33cb59ded, type: 2}
    - {fileID: 11400000, guid: 9d5bbb291524b4141b849f086d39319b, type: 2}
    - {fileID: 11400000, guid: 68290904865fd48c2bb4b37d37aa6993, type: 2}
    - {fileID: 11400000, guid: 5e23e20842aa4496882b507b57edb054, type: 2}
    - {fileID: 11400000, guid: 4fcafd485d33849e285f88ecc469d40f, type: 2}
    - {fileID: 11400000, guid: d4a232a65085147f1b3a4dcc0abc94d4, type: 2}
    - {fileID: 11400000, guid: 45069beacc2f04a15a79da10c79e74a0, type: 2}
    - {fileID: 11400000, guid: 0d46b2c39269747c59579a4408c34643, type: 2}
    - {fileID: 11400000, guid: 447a49d7c8e51492793ced160f8d42cb, type: 2}
    - {fileID: 11400000, guid: 268a155ae7caf4ba2affe4f1fe49578d, type: 2}
    - {fileID: 11400000, guid: 5ddc301b56cfb4344a71e27badc22f8a, type: 2}
    - {fileID: 11400000, guid: 42ace5e27ed2e4d45b6ba3eec1febb3b, type: 2}
    - {fileID: 11400000, guid: a70b59cc9080e4dde8635e2b48d833ae, type: 2}
    - {fileID: 11400000, guid: f794371ec12354f8c9020ccde5db8c20, type: 2}
    - {fileID: 11400000, guid: 811beb3ff1e3244508d2f3b576da2d4e, type: 2}
    - {fileID: 11400000, guid: ad4d58060aa8c4b47814b8a7114ce222, type: 2}
    - {fileID: 11400000, guid: 40c3ce01a8b4c4d379e10a23e2c69545, type: 2}
    - {fileID: 11400000, guid: 2d47234e1ac254c7c9e9e107a5263bfc, type: 2}
    - {fileID: 11400000, guid: 20a265fbdf95149f497432f16d37dfa7, type: 2}
    - {fileID: 11400000, guid: a0a9e1fca1e0848c4978f1141be4fe14, type: 2}
    - {fileID: 11400000, guid: 4a88d66dcecb34024b890710a6406b16, type: 2}
    - {fileID: 11400000, guid: c93e4331be9f64a31a15f0a044b6f220, type: 2}
    - {fileID: 11400000, guid: 65cb16ea8ce8a4ad9ab06dc5f0ce29c3, type: 2}
    - {fileID: 11400000, guid: b1a8e52b1e65b4a6b9268c5332375666, type: 2}
    - {fileID: 11400000, guid: 0508c29c7342545818479a1c76e6131b, type: 2}
    - {fileID: 11400000, guid: 4d73ec3a6d088418fad3112db70e7447, type: 2}
    - {fileID: 11400000, guid: 92ea5a3f8686640ec99793b705cda8c1, type: 2}
    - {fileID: 11400000, guid: c8061fc561e714aca9e492105eab1b66, type: 2}
    - {fileID: 11400000, guid: 49355e79c95cd4eb3b8045facaa333dd, type: 2}
    - {fileID: 11400000, guid: 9f76544856a1046bd86cba5663b90d4b, type: 2}
    - {fileID: 11400000, guid: 640e4703f46254de4b3d03cb86f8e38a, type: 2}
    - {fileID: 11400000, guid: d12290a2f163343adb9885399f2ff3a7, type: 2}
    - {fileID: 11400000, guid: a53bc43b3e05f4e34b56af51134478ce, type: 2}
    - {fileID: 11400000, guid: 3fe0416fa393e4d5d85cc27414d17313, type: 2}
    - {fileID: 11400000, guid: 0b7372911ddca4c41afc4a519e8789cc, type: 2}
    - {fileID: 11400000, guid: 03837e36b34bb4cc397529402f904f02, type: 2}
    - {fileID: 11400000, guid: 39861eec566044a80bf7d19edb385517, type: 2}
    - {fileID: 11400000, guid: 17ca187d2c0e0435799c00a483fe495f, type: 2}
    - {fileID: 11400000, guid: 6a56ebfd596f2409ba6c1378638411a2, type: 2}
    - {fileID: 11400000, guid: 0c148135663eb4d27a1d495c34dfdfb7, type: 2}
    - {fileID: 11400000, guid: 4d255a13a9aa74a5bbc933f6612cfbd8, type: 2}
    - {fileID: 11400000, guid: fa4eae277dff14ddeaf77f2e6d8733e9, type: 2}
    - {fileID: 11400000, guid: cdc2a0f492bb8492ba7e596718895362, type: 2}
    - {fileID: 11400000, guid: 9838cd2a642214500bb05f4d2651a4f7, type: 2}
    - {fileID: 11400000, guid: a8ccb27f7c05c4eec8bce2cec0734151, type: 2}
    - {fileID: 11400000, guid: 047290a2a69cb4ec7815417d5119f332, type: 2}
    - {fileID: 11400000, guid: c20e2369e36794562a74b7eb82be664f, type: 2}
    SerializedBytesString: 
    Prefab: {fileID: 0}
    PrefabModificationsReferencedUnityObjects: []
    PrefabModifications: []
    SerializationNodes:
    - Name: <Name>k__BackingField
      Entry: 10
      Data: 0
    - Name: <ShortName>k__BackingField
      Entry: 10
      Data: 1
    - Name: <Infocard>k__BackingField
      Entry: 10
      Data: 2
    - Name: <Reputations>k__BackingField
      Entry: 7
      Data: 0|System.Collections.Generic.Dictionary`2[[FreelancerDataTool.Interfaces.IFaction,
        Assembly-CSharp],[System.Single, mscorlib]], mscorlib
    - Name: comparer
      Entry: 7
      Data: 1|System.Collections.Generic.ObjectEqualityComparer`1[[FreelancerDataTool.Interfaces.IFaction,
        Assembly-CSharp]], mscorlib
    - Name: 
      Entry: 8
      Data: 
    - Name: 
      Entry: 12
      Data: 58
    - Name: 
      Entry: 7
      Data: 
    - Name: $k
      Entry: 10
      Data: 3
    - Name: $v
      Entry: 4
      Data: -0.65
    - Name: 
      Entry: 8
      Data: 
    - Name: 
      Entry: 7
      Data: 
    - Name: $k
      Entry: 10
      Data: 4
    - Name: $v
      Entry: 4
      Data: -0.65
    - Name: 
      Entry: 8
      Data: 
    - Name: 
      Entry: 7
      Data: 
    - Name: $k
      Entry: 10
      Data: 5
    - Name: $v
      Entry: 4
      Data: -0.65
    - Name: 
      Entry: 8
      Data: 
    - Name: 
      Entry: 7
      Data: 
    - Name: $k
      Entry: 10
      Data: 6
    - Name: $v
      Entry: 4
      Data: -0.65
    - Name: 
      Entry: 8
      Data: 
    - Name: 
      Entry: 7
      Data: 
    - Name: $k
      Entry: 10
      Data: 7
    - Name: $v
      Entry: 4
      Data: -0.65
    - Name: 
      Entry: 8
      Data: 
    - Name: 
      Entry: 7
      Data: 
    - Name: $k
      Entry: 10
      Data: 8
    - Name: $v
      Entry: 4
      Data: -0.65
    - Name: 
      Entry: 8
      Data: 
    - Name: 
      Entry: 7
      Data: 
    - Name: $k
      Entry: 10
      Data: 9
    - Name: $v
      Entry: 4
      Data: -0.65
    - Name: 
      Entry: 8
      Data: 
    - Name: 
      Entry: 7
      Data: 
    - Name: $k
      Entry: 10
      Data: 10
    - Name: $v
      Entry: 4
      Data: -0.65
    - Name: 
      Entry: 8
      Data: 
    - Name: 
      Entry: 7
      Data: 
    - Name: $k
      Entry: 10
      Data: 11
    - Name: $v
      Entry: 4
      Data: -0.65
    - Name: 
      Entry: 8
      Data: 
    - Name: 
      Entry: 7
      Data: 
    - Name: $k
      Entry: 10
      Data: 12
    - Name: $v
      Entry: 4
      Data: -0.65
    - Name: 
      Entry: 8
      Data: 
    - Name: 
      Entry: 7
      Data: 
    - Name: $k
      Entry: 10
      Data: 13
    - Name: $v
      Entry: 4
      Data: -0.65
    - Name: 
      Entry: 8
      Data: 
    - Name: 
      Entry: 7
      Data: 
    - Name: $k
      Entry: 10
      Data: 14
    - Name: $v
      Entry: 4
      Data: -0.65
    - Name: 
      Entry: 8
      Data: 
    - Name: 
      Entry: 7
      Data: 
    - Name: $k
      Entry: 10
      Data: 15
    - Name: $v
      Entry: 4
      Data: -0.65
    - Name: 
      Entry: 8
      Data: 
    - Name: 
      Entry: 7
      Data: 
    - Name: $k
      Entry: 10
      Data: 16
    - Name: $v
      Entry: 4
      Data: -0.65
    - Name: 
      Entry: 8
      Data: 
    - Name: 
      Entry: 7
      Data: 
    - Name: $k
      Entry: 10
      Data: 17
    - Name: $v
      Entry: 4
      Data: -0.65
    - Name: 
      Entry: 8
      Data: 
    - Name: 
      Entry: 7
      Data: 
    - Name: $k
      Entry: 10
      Data: 18
    - Name: $v
      Entry: 4
      Data: -0.65
    - Name: 
      Entry: 8
      Data: 
    - Name: 
      Entry: 7
      Data: 
    - Name: $k
      Entry: 10
      Data: 19
    - Name: $v
      Entry: 4
      Data: -0.65
    - Name: 
      Entry: 8
      Data: 
    - Name: 
      Entry: 7
      Data: 
    - Name: $k
      Entry: 10
      Data: 20
    - Name: $v
      Entry: 4
      Data: -0.65
    - Name: 
      Entry: 8
      Data: 
    - Name: 
      Entry: 7
      Data: 
    - Name: $k
      Entry: 10
      Data: 21
    - Name: $v
      Entry: 4
      Data: -0.65
    - Name: 
      Entry: 8
      Data: 
    - Name: 
      Entry: 7
      Data: 
    - Name: $k
      Entry: 10
      Data: 22
    - Name: $v
      Entry: 4
      Data: -0.65
    - Name: 
      Entry: 8
      Data: 
    - Name: 
      Entry: 7
      Data: 
    - Name: $k
      Entry: 10
      Data: 23
    - Name: $v
      Entry: 4
      Data: -0.65
    - Name: 
      Entry: 8
      Data: 
    - Name: 
      Entry: 7
      Data: 
    - Name: $k
      Entry: 10
      Data: 24
    - Name: $v
      Entry: 4
      Data: -0.65
    - Name: 
      Entry: 8
      Data: 
    - Name: 
      Entry: 7
      Data: 
    - Name: $k
      Entry: 10
      Data: 25
    - Name: $v
      Entry: 4
      Data: -0.65
    - Name: 
      Entry: 8
      Data: 
    - Name: 
      Entry: 7
      Data: 
    - Name: $k
      Entry: 10
      Data: 26
    - Name: $v
      Entry: 4
      Data: -0.65
    - Name: 
      Entry: 8
      Data: 
    - Name: 
      Entry: 7
      Data: 
    - Name: $k
      Entry: 10
      Data: 27
    - Name: $v
      Entry: 4
      Data: -0.65
    - Name: 
      Entry: 8
      Data: 
    - Name: 
      Entry: 7
      Data: 
    - Name: $k
      Entry: 10
      Data: 28
    - Name: $v
      Entry: 4
      Data: -0.65
    - Name: 
      Entry: 8
      Data: 
    - Name: 
      Entry: 7
      Data: 
    - Name: $k
      Entry: 10
      Data: 29
    - Name: $v
      Entry: 4
      Data: -0.65
    - Name: 
      Entry: 8
      Data: 
    - Name: 
      Entry: 7
      Data: 
    - Name: $k
      Entry: 10
      Data: 30
    - Name: $v
      Entry: 4
      Data: -0.65
    - Name: 
      Entry: 8
      Data: 
    - Name: 
      Entry: 7
      Data: 
    - Name: $k
      Entry: 10
      Data: 31
    - Name: $v
      Entry: 4
      Data: -0.65
    - Name: 
      Entry: 8
      Data: 
    - Name: 
      Entry: 7
      Data: 
    - Name: $k
      Entry: 10
      Data: 32
    - Name: $v
      Entry: 4
      Data: -0.65
    - Name: 
      Entry: 8
      Data: 
    - Name: 
      Entry: 7
      Data: 
    - Name: $k
      Entry: 10
      Data: 33
    - Name: $v
      Entry: 4
      Data: -0.65
    - Name: 
      Entry: 8
      Data: 
    - Name: 
      Entry: 7
      Data: 
    - Name: $k
      Entry: 10
      Data: 34
    - Name: $v
      Entry: 4
      Data: -0.65
    - Name: 
      Entry: 8
      Data: 
    - Name: 
      Entry: 7
      Data: 
    - Name: $k
      Entry: 10
      Data: 35
    - Name: $v
      Entry: 4
      Data: -0.65
    - Name: 
      Entry: 8
      Data: 
    - Name: 
      Entry: 7
      Data: 
    - Name: $k
      Entry: 10
      Data: 36
    - Name: $v
      Entry: 4
      Data: -0.65
    - Name: 
      Entry: 8
      Data: 
    - Name: 
      Entry: 7
      Data: 
    - Name: $k
      Entry: 10
      Data: 37
    - Name: $v
      Entry: 4
      Data: -0.65
    - Name: 
      Entry: 8
      Data: 
    - Name: 
      Entry: 7
      Data: 
    - Name: $k
      Entry: 10
      Data: 38
    - Name: $v
      Entry: 4
      Data: -0.65
    - Name: 
      Entry: 8
      Data: 
    - Name: 
      Entry: 7
      Data: 
    - Name: $k
      Entry: 10
      Data: 39
    - Name: $v
      Entry: 4
      Data: -0.65
    - Name: 
      Entry: 8
      Data: 
    - Name: 
      Entry: 7
      Data: 
    - Name: $k
      Entry: 10
      Data: 40
    - Name: $v
      Entry: 4
      Data: -0.65
    - Name: 
      Entry: 8
      Data: 
    - Name: 
      Entry: 7
      Data: 
    - Name: $k
      Entry: 10
      Data: 41
    - Name: $v
      Entry: 4
      Data: -0.65
    - Name: 
      Entry: 8
      Data: 
    - Name: 
      Entry: 7
      Data: 
    - Name: $k
      Entry: 10
      Data: 42
    - Name: $v
      Entry: 4
      Data: -0.65
    - Name: 
      Entry: 8
      Data: 
    - Name: 
      Entry: 7
      Data: 
    - Name: $k
      Entry: 10
      Data: 43
    - Name: $v
      Entry: 4
      Data: -0.65
    - Name: 
      Entry: 8
      Data: 
    - Name: 
      Entry: 7
      Data: 
    - Name: $k
      Entry: 10
      Data: 44
    - Name: $v
      Entry: 4
      Data: -0.65
    - Name: 
      Entry: 8
      Data: 
    - Name: 
      Entry: 7
      Data: 
    - Name: $k
      Entry: 10
      Data: 45
    - Name: $v
      Entry: 4
      Data: -0.65
    - Name: 
      Entry: 8
      Data: 
    - Name: 
      Entry: 7
      Data: 
    - Name: $k
      Entry: 10
      Data: 46
    - Name: $v
      Entry: 4
      Data: -0.65
    - Name: 
      Entry: 8
      Data: 
    - Name: 
      Entry: 7
      Data: 
    - Name: $k
      Entry: 10
      Data: 47
    - Name: $v
      Entry: 4
      Data: -0.65
    - Name: 
      Entry: 8
      Data: 
    - Name: 
      Entry: 7
      Data: 
    - Name: $k
      Entry: 10
      Data: 48
    - Name: $v
      Entry: 4
      Data: -0.65
    - Name: 
      Entry: 8
      Data: 
    - Name: 
      Entry: 7
      Data: 
    - Name: $k
      Entry: 10
      Data: 49
    - Name: $v
      Entry: 4
      Data: -0.3
    - Name: 
      Entry: 8
      Data: 
    - Name: 
      Entry: 7
      Data: 
    - Name: $k
      Entry: 10
      Data: 50
    - Name: $v
      Entry: 4
      Data: -0.3
    - Name: 
      Entry: 8
      Data: 
    - Name: 
      Entry: 7
      Data: 
    - Name: $k
      Entry: 10
      Data: 51
    - Name: $v
      Entry: 4
      Data: 0.3
    - Name: 
      Entry: 8
      Data: 
    - Name: 
      Entry: 7
      Data: 
    - Name: $k
      Entry: 10
      Data: 52
    - Name: $v
      Entry: 4
      Data: 0.65
    - Name: 
      Entry: 8
      Data: 
    - Name: 
      Entry: 7
      Data: 
    - Name: $k
      Entry: 10
      Data: 53
    - Name: $v
      Entry: 4
      Data: 0.65
    - Name: 
      Entry: 8
      Data: 
    - Name: 
      Entry: 7
      Data: 
    - Name: $k
      Entry: 10
      Data: 54
    - Name: $v
      Entry: 4
      Data: 0.65
    - Name: 
      Entry: 8
      Data: 
    - Name: 
      Entry: 7
      Data: 
    - Name: $k
      Entry: 10
      Data: 55
    - Name: $v
      Entry: 4
      Data: 0.65
    - Name: 
      Entry: 8
      Data: 
    - Name: 
      Entry: 7
      Data: 
    - Name: $k
      Entry: 10
      Data: 56
    - Name: $v
      Entry: 4
      Data: 0.65
    - Name: 
      Entry: 8
      Data: 
    - Name: 
      Entry: 7
      Data: 
    - Name: $k
      Entry: 10
      Data: 57
    - Name: $v
      Entry: 4
      Data: 0.65
    - Name: 
      Entry: 8
      Data: 
    - Name: 
      Entry: 7
      Data: 
    - Name: $k
      Entry: 10
      Data: 58
    - Name: $v
      Entry: 4
      Data: 0.65
    - Name: 
      Entry: 8
      Data: 
    - Name: 
      Entry: 7
      Data: 
    - Name: $k
      Entry: 10
      Data: 59
    - Name: $v
      Entry: 4
      Data: 0.65
    - Name: 
      Entry: 8
      Data: 
    - Name: 
      Entry: 7
      Data: 
    - Name: $k
      Entry: 10
      Data: 60
    - Name: $v
      Entry: 4
      Data: 0.91
    - Name: 
      Entry: 8
      Data: 
    - Name: 
      Entry: 13
      Data: 
    - Name: 
      Entry: 8
      Data: 
    - Name: <NpcBribers>k__BackingField
      Entry: 7
      Data: 2|System.Collections.Generic.Dictionary`2[[FreelancerDataTool.Interfaces.INpc,
        Assembly-CSharp],[System.Single, mscorlib]], mscorlib
    - Name: comparer
      Entry: 7
      Data: 3|System.Collections.Generic.ObjectEqualityComparer`1[[FreelancerDataTool.Interfaces.INpc,
        Assembly-CSharp]], mscorlib
    - Name: 
      Entry: 8
      Data: 
    - Name: 
      Entry: 12
      Data: 0
    - Name: 
      Entry: 13
      Data: 
    - Name: 
      Entry: 8
      Data: 
    - Name: <ShipsUsed>k__BackingField
      Entry: 7
      Data: 4|System.Collections.Generic.List`1[[FreelancerDataTool.Interfaces.IShip,
        Assembly-CSharp]], mscorlib
    - Name: 
      Entry: 12
      Data: 1
    - Name: 
      Entry: 10
      Data: 61
    - Name: 
      Entry: 13
      Data: 
    - Name: 
      Entry: 8
      Data: 
    - Name: <OwnedBases>k__BackingField
      Entry: 7
      Data: 5|System.Collections.Generic.List`1[[FreelancerDataTool.Interfaces.IBase,
        Assembly-CSharp]], mscorlib
    - Name: 
      Entry: 12
      Data: 0
    - Name: 
      Entry: 13
      Data: 
    - Name: 
      Entry: 8
      Data: 
    - Name: <Npcs>k__BackingField
      Entry: 7
      Data: 6|System.Collections.Generic.List`1[[FreelancerDataTool.Interfaces.INpc,
        Assembly-CSharp]], mscorlib
    - Name: 
      Entry: 12
      Data: 0
    - Name: 
      Entry: 13
      Data: 
    - Name: 
      Entry: 8
      Data: 
  <Nickname>k__BackingField: fc_u_guardian
  <Logo>k__BackingField: {fileID: 0}
  <Legality>k__BackingField: unlawful
  <JumpPreference>k__BackingField: jumphole
  <ScanAnnounce>k__BackingField: 0
  <ScanChance>k__BackingField: 0.3
