%YAML 1.1
%TAG !u! tag:unity3d.com,2011:
--- !u!114 &11400000
MonoBehaviour:
  m_ObjectHideFlags: 0
  m_CorrespondingSourceObject: {fileID: 0}
  m_PrefabInstance: {fileID: 0}
  m_PrefabAsset: {fileID: 0}
  m_GameObject: {fileID: 0}
  m_Enabled: 1
  m_EditorHideFlags: 0
  m_Script: {fileID: 11500000, guid: 182eb47472f64de388dd50183c0411d8, type: 3}
  m_Name: SO_Infocard_132260
  m_EditorClassIdentifier: 
  <Key>k__BackingField: 132260
  <Value>k__BackingField: 'Universal hauls Trade Lanes Parts wherever there are Trade
    Lanes between Liberty and the House capitols. Interspace has stations like this
    one in all the capitol systems, which are used to store the Gate and Lane Parts
    temporarily. Then Deep Space takes over and ships them to the actual construction
    or repair sites. <br>


'
