%YAML 1.1
%TAG !u! tag:unity3d.com,2011:
--- !u!114 &11400000
MonoBehaviour:
  m_ObjectHideFlags: 0
  m_CorrespondingSourceObject: {fileID: 0}
  m_PrefabInstance: {fileID: 0}
  m_PrefabAsset: {fileID: 0}
  m_GameObject: {fileID: 0}
  m_Enabled: 1
  m_EditorHideFlags: 0
  m_Script: {fileID: 11500000, guid: 182eb47472f64de388dd50183c0411d8, type: 3}
  m_Name: SO_Infocard_134316
  m_EditorClassIdentifier: 
  <Key>k__BackingField: 134316
  <Value>k__BackingField: 'There is a legend that a secret Jump Hole lies at the
    center of the Graveyard of the Innocents in the Malvada Cloud. A young Corsair
    completing his adulthood initiation rites stumbled across it while trying to
    find his Artifact. He entered it and emerged in an uncharted system. Strange
    alien ships soon appeared in the distance, and he fled for his life back to known
    territory. Few people believe the story. <br><nbsp><br>


'
