%YAML 1.1
%TAG !u! tag:unity3d.com,2011:
--- !u!114 &11400000
MonoBehaviour:
  m_ObjectHideFlags: 0
  m_CorrespondingSourceObject: {fileID: 0}
  m_PrefabInstance: {fileID: 0}
  m_PrefabAsset: {fileID: 0}
  m_GameObject: {fileID: 0}
  m_Enabled: 1
  m_EditorHideFlags: 0
  m_Script: {fileID: 11500000, guid: 182eb47472f64de388dd50183c0411d8, type: 3}
  m_Name: SO_Infocard_133291
  m_EditorClassIdentifier: 
  <Key>k__BackingField: 133291
  <Value>k__BackingField: 'You must understand that Kusari palates are more sensitive
    to delicate Foods than foreigners. We can detect a great difference in quality
    between Kusari Food Pastes and Synth Food imports. That is why the Kusari people
    will pay so much more for Kyushu Food products. Now that we have extra produce
    from Tottori coming in, we can even compete on price.<br>


'
