%YAML 1.1
%TAG !u! tag:unity3d.com,2011:
--- !u!114 &11400000
MonoBehaviour:
  m_ObjectHideFlags: 0
  m_CorrespondingSourceObject: {fileID: 0}
  m_PrefabInstance: {fileID: 0}
  m_PrefabAsset: {fileID: 0}
  m_GameObject: {fileID: 0}
  m_Enabled: 1
  m_EditorHideFlags: 0
  m_Script: {fileID: 11500000, guid: 182eb47472f64de388dd50183c0411d8, type: 3}
  m_Name: SO_Infocard_133289
  m_EditorClassIdentifier: 
  <Key>k__BackingField: 133289
  <Value>k__BackingField: 'Samura still makes the daily Food run from Kyushu, but
    we may need to reduce it soon to bi-weekly. People are no longer eating Kyushu
    Rice like they did. Those Synth Food invaders have been granted landing rights
    on Honshu at the insistence of Kishiro. It will not last, not with agriculture
    on the rise in Tottori. Synth Foods is but a small asteroid along the tradelane
    to prosperity for our Foods Division.<br>


'
