%YAML 1.1
%TAG !u! tag:unity3d.com,2011:
--- !u!114 &11400000
MonoBehaviour:
  m_ObjectHideFlags: 0
  m_CorrespondingSourceObject: {fileID: 0}
  m_PrefabInstance: {fileID: 0}
  m_PrefabAsset: {fileID: 0}
  m_GameObject: {fileID: 0}
  m_Enabled: 1
  m_EditorHideFlags: 0
  m_Script: {fileID: 11500000, guid: 182eb47472f64de388dd50183c0411d8, type: 3}
  m_Name: SO_Infocard_131208
  m_EditorClassIdentifier: 
  <Key>k__BackingField: 131208
  <Value>k__BackingField: 'In Manhattan we purchase Water, Oxygen, Food, and Basic
    Alloy for use at our Rochester base. It''s completely legit -- so if you ever
    want to run supplies for us Junkers without getting your hands dirty, you can.<br>


'
