%YAML 1.1
%TAG !u! tag:unity3d.com,2011:
--- !u!114 &11400000
MonoBehaviour:
  m_ObjectHideFlags: 0
  m_CorrespondingSourceObject: {fileID: 0}
  m_PrefabInstance: {fileID: 0}
  m_PrefabAsset: {fileID: 0}
  m_GameObject: {fileID: 0}
  m_Enabled: 1
  m_EditorHideFlags: 0
  m_Script: {fileID: 11500000, guid: 182eb47472f64de388dd50183c0411d8, type: 3}
  m_Name: SO_Infocard_133622
  m_EditorClassIdentifier: 
  <Key>k__BackingField: 133622
  <Value>k__BackingField: 'After the Eighty Years War we lost nearly everything.
    My family worked for Kruger in those days. When the bottom fell out of the economy
    we lost our jobs and the bonuses that had been promised us. Worse than that,
    more than half of my ancestors were killed trying to mine gases in contested
    space. My brother joined the Hessians, but I am not a violent man, I joined Daumann.
    I hope I will never meet him again, or our family will be down at least one sibling.
    <br>


'
