%YAML 1.1
%TAG !u! tag:unity3d.com,2011:
--- !u!114 &11400000
MonoBehaviour:
  m_ObjectHideFlags: 0
  m_CorrespondingSourceObject: {fileID: 0}
  m_PrefabInstance: {fileID: 0}
  m_PrefabAsset: {fileID: 0}
  m_GameObject: {fileID: 0}
  m_Enabled: 1
  m_EditorHideFlags: 0
  m_Script: {fileID: 11500000, guid: 182eb47472f64de388dd50183c0411d8, type: 3}
  m_Name: SO_Infocard_131617
  m_EditorClassIdentifier: 
  <Key>k__BackingField: 131617
  <Value>k__BackingField: 'This is the cheapest place to buy Side Arms within Hogosha
    territory, if you can call this black rock fragment in a dark matter cloud "territory"
    in the conventional sense. Within Kusari space Side Arms cost considerably more.
    <br>


'
