%YAML 1.1
%TAG !u! tag:unity3d.com,2011:
--- !u!114 &11400000
MonoBehaviour:
  m_ObjectHideFlags: 0
  m_CorrespondingSourceObject: {fileID: 0}
  m_PrefabInstance: {fileID: 0}
  m_PrefabAsset: {fileID: 0}
  m_GameObject: {fileID: 0}
  m_Enabled: 1
  m_EditorHideFlags: 0
  m_Script: {fileID: 11500000, guid: 182eb47472f64de388dd50183c0411d8, type: 3}
  m_Name: SO_Infocard_513441
  m_EditorClassIdentifier: 
  <Key>k__BackingField: 513441
  <Value>k__BackingField: 'The Armed Forces gave no warning of their withdrawal from
    Harris. We just happened to arrive early enough on our supply run that we weren''t
    left behind when Gallic forces showed up. You''d think the admiralty would be
    more interested in preventing the supplies they paid for from being delivered
    right into enemy hands, but they have a different set of priorities, it seems.
    <br>


'
