%YAML 1.1
%TAG !u! tag:unity3d.com,2011:
--- !u!114 &11400000
MonoBehaviour:
  m_ObjectHideFlags: 0
  m_CorrespondingSourceObject: {fileID: 0}
  m_PrefabInstance: {fileID: 0}
  m_PrefabAsset: {fileID: 0}
  m_GameObject: {fileID: 0}
  m_Enabled: 1
  m_EditorHideFlags: 0
  m_Script: {fileID: 11500000, guid: 182eb47472f64de388dd50183c0411d8, type: 3}
  m_Name: SO_Infocard_132097
  m_EditorClassIdentifier: 
  <Key>k__BackingField: 132097
  <Value>k__BackingField: 'Many of the civilians in this system have four choices:
    work for LPI on one of the penal ships, become a Bounty Hunter, work at Houston
    in the Nanocapacitor plants, or become a criminal. I chose working for LPI; it
    was the safest choice. <br>


'
