%YAML 1.1
%TAG !u! tag:unity3d.com,2011:
--- !u!114 &11400000
MonoBehaviour:
  m_ObjectHideFlags: 0
  m_CorrespondingSourceObject: {fileID: 0}
  m_PrefabInstance: {fileID: 0}
  m_PrefabAsset: {fileID: 0}
  m_GameObject: {fileID: 0}
  m_Enabled: 1
  m_EditorHideFlags: 0
  m_Script: {fileID: 11500000, guid: 182eb47472f64de388dd50183c0411d8, type: 3}
  m_Name: SO_Infocard_66596
  m_EditorClassIdentifier: 
  <Key>k__BackingField: 66596
  <Value>k__BackingField: '<b><p align="center">Rheinland "Bismarck"-class Battleship<br></b><p
    align="left"><nbsp><br>Chief among vessels in the Chancellor''s fleet, this class
    of ship is the tactical "checkmate move" in the operations of the Rheinland military.<br>


'
