%YAML 1.1
%TAG !u! tag:unity3d.com,2011:
--- !u!114 &11400000
MonoBehaviour:
  m_ObjectHideFlags: 0
  m_CorrespondingSourceObject: {fileID: 0}
  m_PrefabInstance: {fileID: 0}
  m_PrefabAsset: {fileID: 0}
  m_GameObject: {fileID: 0}
  m_Enabled: 1
  m_EditorHideFlags: 0
  m_Script: {fileID: 11500000, guid: 182eb47472f64de388dd50183c0411d8, type: 3}
  m_Name: SO_Infocard_525307
  m_EditorClassIdentifier: 
  <Key>k__BackingField: 525307
  <Value>k__BackingField: 'With Leeds as it is, the nearest Bretonian popultion center
    to get some rest on is New London. Carlisle is slowly getting populated but it
    is not much to write home about yet.<br>


'
