%YAML 1.1
%TAG !u! tag:unity3d.com,2011:
--- !u!114 &11400000
MonoBehaviour:
  m_ObjectHideFlags: 0
  m_CorrespondingSourceObject: {fileID: 0}
  m_PrefabInstance: {fileID: 0}
  m_PrefabAsset: {fileID: 0}
  m_GameObject: {fileID: 0}
  m_Enabled: 1
  m_EditorHideFlags: 0
  m_Script: {fileID: 11500000, guid: a9d7e182f1a5473f8cb5b7a8a258a22b, type: 3}
  m_Name: SO_Ship_Eagle(Damaged)
  m_EditorClassIdentifier: 
  serializationData:
    SerializedFormat: 2
    SerializedBytes: 
    ReferencedUnityObjects:
    - {fileID: 11400000, guid: df1dd1c19d87f43d4b8eb89d5131d004, type: 2}
    - {fileID: 11400000, guid: c1cda4361090441968cb76c094dca0dd, type: 2}
    SerializedBytesString: 
    Prefab: {fileID: 0}
    PrefabModificationsReferencedUnityObjects: []
    PrefabModifications: []
    SerializationNodes:
    - Name: <Name>k__BackingField
      Entry: 10
      Data: 0
    - Name: <Infocard>k__BackingField
      Entry: 10
      Data: 1
    - Name: <SteeringTorque>k__BackingField
      Entry: 7
      Data: 0|System.Tuple`3[[System.Single, mscorlib],[System.Single, mscorlib],[System.Single,
        mscorlib]], mscorlib
    - Name: m_Item1
      Entry: 4
      Data: 49706
    - Name: m_Item2
      Entry: 4
      Data: 49706
    - Name: m_Item3
      Entry: 4
      Data: 109308
    - Name: 
      Entry: 8
      Data: 
    - Name: <AngularDrag>k__BackingField
      Entry: 7
      Data: 1|System.Tuple`3[[System.Single, mscorlib],[System.Single, mscorlib],[System.Single,
        mscorlib]], mscorlib
    - Name: m_Item1
      Entry: 4
      Data: 39750
    - Name: m_Item2
      Entry: 4
      Data: 39750
    - Name: m_Item3
      Entry: 4
      Data: 39750
    - Name: 
      Entry: 8
      Data: 
    - Name: <RotationInertia>k__BackingField
      Entry: 7
      Data: 2|System.Tuple`3[[System.Single, mscorlib],[System.Single, mscorlib],[System.Single,
        mscorlib]], mscorlib
    - Name: m_Item1
      Entry: 4
      Data: 7590
    - Name: m_Item2
      Entry: 4
      Data: 7590
    - Name: m_Item3
      Entry: 4
      Data: 3600
    - Name: 
      Entry: 8
      Data: 
  <Nickname>k__BackingField: cv_classic
  <Model>k__BackingField: {fileID: 0}
  <HoldSize>k__BackingField: 64
  <HitPoints>k__BackingField: 11500
  <Nanobots>k__BackingField: 59
  <ShieldBats>k__BackingField: 59
  <ShipClass>k__BackingField: 3
  <ShipType>k__BackingField: 1
  <Mass>k__BackingField: 150
  <StrafeForce>k__BackingField: 20000
  <StrafePowerUsage>k__BackingField: 2
  <MaxBankAngle>k__BackingField: 30
  <LinearDrag>k__BackingField: 1
  <NudgeForce>k__BackingField: 30000
