%YAML 1.1
%TAG !u! tag:unity3d.com,2011:
--- !u!114 &11400000
MonoBehaviour:
  m_ObjectHideFlags: 0
  m_CorrespondingSourceObject: {fileID: 0}
  m_PrefabInstance: {fileID: 0}
  m_PrefabAsset: {fileID: 0}
  m_GameObject: {fileID: 0}
  m_Enabled: 1
  m_EditorHideFlags: 0
  m_Script: {fileID: 11500000, guid: 182eb47472f64de388dd50183c0411d8, type: 3}
  m_Name: SO_Infocard_131901
  m_EditorClassIdentifier: 
  <Key>k__BackingField: 131901
  <Value>k__BackingField: 'Los Angeles is the dream post for an LPI trooper. Nice
    climate, and they give you a special cost of living adjustment for all the high
    prices. Living quarters are kind of tight, but you take what you can get. <br><nbsp><br>


'
