%YAML 1.1
%TAG !u! tag:unity3d.com,2011:
--- !u!114 &11400000
MonoBehaviour:
  m_ObjectHideFlags: 0
  m_CorrespondingSourceObject: {fileID: 0}
  m_PrefabInstance: {fileID: 0}
  m_PrefabAsset: {fileID: 0}
  m_GameObject: {fileID: 0}
  m_Enabled: 1
  m_EditorHideFlags: 0
  m_Script: {fileID: 11500000, guid: 182eb47472f64de388dd50183c0411d8, type: 3}
  m_Name: SO_Infocard_131153
  m_EditorClassIdentifier: 
  <Key>k__BackingField: 131153
  <Value>k__BackingField: 'Our boys here in Alcatraz like to "tax" all the goods
    moving through the Trade Lanes between Bretonia and Liberty. Los Angeles is filled
    with those snobby successful types who buy loads of Luxury Goods from Manhattan.
    It ain''t right that they get all the good things in life just ''cuz they were
    born with money, so we take some of it off their hands. <br>


'
