%YAML 1.1
%TAG !u! tag:unity3d.com,2011:
--- !u!114 &11400000
MonoBehaviour:
  m_ObjectHideFlags: 0
  m_CorrespondingSourceObject: {fileID: 0}
  m_PrefabInstance: {fileID: 0}
  m_PrefabAsset: {fileID: 0}
  m_GameObject: {fileID: 0}
  m_Enabled: 1
  m_EditorHideFlags: 0
  m_Script: {fileID: 11500000, guid: 182eb47472f64de388dd50183c0411d8, type: 3}
  m_Name: SO_Infocard_133034
  m_EditorClassIdentifier: 
  <Key>k__BackingField: 133034
  <Value>k__BackingField: 'Officially the Rheinland Military were not allowed in
    the system until recently, but at least the GMG had the respect to make one exception
    - The Seewinde, a burial ship. Thousands of sailors perished in the Yanagi battle,
    and many bodies were still sealed inside the wrecks. The Seewinde took these
    sailors home, and gave them a proper burial. <br>


'
