%YAML 1.1
%TAG !u! tag:unity3d.com,2011:
--- !u!114 &11400000
MonoBehaviour:
  m_ObjectHideFlags: 0
  m_CorrespondingSourceObject: {fileID: 0}
  m_PrefabInstance: {fileID: 0}
  m_PrefabAsset: {fileID: 0}
  m_GameObject: {fileID: 0}
  m_Enabled: 1
  m_EditorHideFlags: 0
  m_Script: {fileID: 11500000, guid: 182eb47472f64de388dd50183c0411d8, type: 3}
  m_Name: SO_Infocard_132927
  m_EditorClassIdentifier: 
  <Key>k__BackingField: 132927
  <Value>k__BackingField: 'The life of a Kusari State Police Junsa is not really
    very exciting most of the time, unless you are posted in Hokkaido. Sapporo is
    the most dangerous assignment on the force. It is all clouds and radiation up
    there. You never know when the Blood Dragons or Golden C. will strike.<br>


'
