%YAML 1.1
%TAG !u! tag:unity3d.com,2011:
--- !u!114 &11400000
MonoBehaviour:
  m_ObjectHideFlags: 0
  m_CorrespondingSourceObject: {fileID: 0}
  m_PrefabInstance: {fileID: 0}
  m_PrefabAsset: {fileID: 0}
  m_GameObject: {fileID: 0}
  m_Enabled: 1
  m_EditorHideFlags: 0
  m_Script: {fileID: 11500000, guid: 182eb47472f64de388dd50183c0411d8, type: 3}
  m_Name: SO_Infocard_132739
  m_EditorClassIdentifier: 
  <Key>k__BackingField: 132739
  <Value>k__BackingField: 'The Bounty Hunters at this base are being paid by Kishiro,
    mostly in an effort to curb Outcast piracy. So far they are meeting with limited
    success. Other Bounty Hunters have been hired by Bretonian or Libertonian firms,
    and they have come up here tracking Outcasts back from House space. I wonder
    why Kishiro is so interested in paying Bounty Hunters to hit Outcast Cardamine
    shipments out by the Shinkaku field. I thought they usually don''t help Samura
    out. <br>


'
