%YAML 1.1
%TAG !u! tag:unity3d.com,2011:
--- !u!114 &11400000
MonoBehaviour:
  m_ObjectHideFlags: 0
  m_CorrespondingSourceObject: {fileID: 0}
  m_PrefabInstance: {fileID: 0}
  m_PrefabAsset: {fileID: 0}
  m_GameObject: {fileID: 0}
  m_Enabled: 1
  m_EditorHideFlags: 0
  m_Script: {fileID: 11500000, guid: 182eb47472f64de388dd50183c0411d8, type: 3}
  m_Name: SO_Infocard_488353
  m_EditorClassIdentifier: 
  <Key>k__BackingField: 488353
  <Value>k__BackingField: 'I got into a scrape with a few Xenos on the lane the other
    day. I''m not sure what they were up to, but they fell back as soon as I caught
    sight of them. Didn''t pursue them too far - too risky to get caught alone out
    there. They probably had a few buddies waiting in the asteroid field. The lane
    was clear again, that''s all they pay me for. Let the Hunters chase them down
    in the roids, that''s what Interspace pays -them- for. <br>


'
