%YAML 1.1
%TAG !u! tag:unity3d.com,2011:
--- !u!114 &11400000
MonoBehaviour:
  m_ObjectHideFlags: 0
  m_CorrespondingSourceObject: {fileID: 0}
  m_PrefabInstance: {fileID: 0}
  m_PrefabAsset: {fileID: 0}
  m_GameObject: {fileID: 0}
  m_Enabled: 1
  m_EditorHideFlags: 0
  m_Script: {fileID: 11500000, guid: 182eb47472f64de388dd50183c0411d8, type: 3}
  m_Name: SO_Infocard_488291
  m_EditorClassIdentifier: 
  <Key>k__BackingField: 488291
  <Value>k__BackingField: 'Samura pilots often file complaints about Xeno attacks.
    We do what we can to prevent them, but frankly, there''s just too much ground
    to cover. What annoys me is the tone in which they complain, as if they''re entitled
    to be escorted. That doesn''t help to motivate our officers. <br>


'
