%YAML 1.1
%TAG !u! tag:unity3d.com,2011:
--- !u!114 &11400000
MonoBehaviour:
  m_ObjectHideFlags: 0
  m_CorrespondingSourceObject: {fileID: 0}
  m_PrefabInstance: {fileID: 0}
  m_PrefabAsset: {fileID: 0}
  m_GameObject: {fileID: 0}
  m_Enabled: 1
  m_EditorHideFlags: 0
  m_Script: {fileID: 11500000, guid: a9d7e182f1a5473f8cb5b7a8a258a22b, type: 3}
  m_Name: SO_Ship_Raven'sTalon
  m_EditorClassIdentifier: 
  serializationData:
    SerializedFormat: 2
    SerializedBytes: 
    ReferencedUnityObjects:
    - {fileID: 11400000, guid: b8ba9826794d044ca8e824d9b0c6ddfa, type: 2}
    - {fileID: 11400000, guid: 5c4459bf87feb4c0eace897f834b0808, type: 2}
    SerializedBytesString: 
    Prefab: {fileID: 0}
    PrefabModificationsReferencedUnityObjects: []
    PrefabModifications: []
    SerializationNodes:
    - Name: <Name>k__BackingField
      Entry: 10
      Data: 0
    - Name: <Infocard>k__BackingField
      Entry: 10
      Data: 1
    - Name: <SteeringTorque>k__BackingField
      Entry: 7
      Data: 0|System.Tuple`3[[System.Single, mscorlib],[System.Single, mscorlib],[System.Single,
        mscorlib]], mscorlib
    - Name: m_Item1
      Entry: 4
      Data: 48000
    - Name: m_Item2
      Entry: 4
      Data: 48000
    - Name: m_Item3
      Entry: 4
      Data: 200000
    - Name: 
      Entry: 8
      Data: 
    - Name: <AngularDrag>k__BackingField
      Entry: 7
      Data: 1|System.Tuple`3[[System.Single, mscorlib],[System.Single, mscorlib],[System.Single,
        mscorlib]], mscorlib
    - Name: m_Item1
      Entry: 4
      Data: 41670
    - Name: m_Item2
      Entry: 4
      Data: 41670
    - Name: m_Item3
      Entry: 4
      Data: 102000
    - Name: 
      Entry: 8
      Data: 
    - Name: <RotationInertia>k__BackingField
      Entry: 7
      Data: 2|System.Tuple`3[[System.Single, mscorlib],[System.Single, mscorlib],[System.Single,
        mscorlib]], mscorlib
    - Name: m_Item1
      Entry: 4
      Data: 7630
    - Name: m_Item2
      Entry: 4
      Data: 7630
    - Name: m_Item3
      Entry: 4
      Data: 6250
    - Name: 
      Entry: 8
      Data: 
  <Nickname>k__BackingField: dsy_raventalon
  <Model>k__BackingField: {fileID: 0}
  <HoldSize>k__BackingField: 75
  <HitPoints>k__BackingField: 13600
  <Nanobots>k__BackingField: 67
  <ShieldBats>k__BackingField: 67
  <ShipClass>k__BackingField: 3
  <ShipType>k__BackingField: 1
  <Mass>k__BackingField: 150
  <StrafeForce>k__BackingField: 20000
  <StrafePowerUsage>k__BackingField: 2
  <MaxBankAngle>k__BackingField: 35
  <LinearDrag>k__BackingField: 1
  <NudgeForce>k__BackingField: 30000
