%YAML 1.1
%TAG !u! tag:unity3d.com,2011:
--- !u!114 &11400000
MonoBehaviour:
  m_ObjectHideFlags: 0
  m_CorrespondingSourceObject: {fileID: 0}
  m_PrefabInstance: {fileID: 0}
  m_PrefabAsset: {fileID: 0}
  m_GameObject: {fileID: 0}
  m_Enabled: 1
  m_EditorHideFlags: 0
  m_Script: {fileID: 11500000, guid: 182eb47472f64de388dd50183c0411d8, type: 3}
  m_Name: SO_Infocard_131500
  m_EditorClassIdentifier: 
  <Key>k__BackingField: 131500
  <Value>k__BackingField: 'As much as Xenos hate Junkers, we aren''t strong enough
    to get rid of those scavengers... yet. They run the shipping points for inbound
    drug shipments into Liberty, which makes them buddies of both the Outcasts and
    Liberty Rogues. We don''t want that stinking drug peddling in Liberty, so we
    have to oppose all three of them. That can be rough at times, but there ain''t
    a Xeno alive that can''t handle rough. <br>


'
