%YAML 1.1
%TAG !u! tag:unity3d.com,2011:
--- !u!114 &11400000
MonoBehaviour:
  m_ObjectHideFlags: 0
  m_CorrespondingSourceObject: {fileID: 0}
  m_PrefabInstance: {fileID: 0}
  m_PrefabAsset: {fileID: 0}
  m_GameObject: {fileID: 0}
  m_Enabled: 1
  m_EditorHideFlags: 0
  m_Script: {fileID: 11500000, guid: 182eb47472f64de388dd50183c0411d8, type: 3}
  m_Name: SO_Infocard_131981
  m_EditorClassIdentifier: 
  <Key>k__BackingField: 131981
  <Value>k__BackingField: 'This base was opened up in 700 to more carefully study
    the Alien Organisms that are brought back from the Omicron systems. They figured
    this field would be a good place to study their interaction with ammonia and
    methane, which are far more common frozen gases than water in the California
    system. <br>


'
