%YAML 1.1
%TAG !u! tag:unity3d.com,2011:
--- !u!114 &11400000
MonoBehaviour:
  m_ObjectHideFlags: 0
  m_CorrespondingSourceObject: {fileID: 0}
  m_PrefabInstance: {fileID: 0}
  m_PrefabAsset: {fileID: 0}
  m_GameObject: {fileID: 0}
  m_Enabled: 1
  m_EditorHideFlags: 0
  m_Script: {fileID: 11500000, guid: 182eb47472f64de388dd50183c0411d8, type: 3}
  m_Name: SO_Infocard_470156
  m_EditorClassIdentifier: 
  <Key>k__BackingField: 470156
  <Value>k__BackingField: 'The Jump Hole to Tau-37 remains hidden to most amongst
    the asteroids that populate this system. Unfortunately the IMG found their way
    there. Beyond it you will find the way to Omicron Alpha, which is the location
    of our home planet, Malta. <br>


'
