%YAML 1.1
%TAG !u! tag:unity3d.com,2011:
--- !u!114 &11400000
MonoBehaviour:
  m_ObjectHideFlags: 0
  m_CorrespondingSourceObject: {fileID: 0}
  m_PrefabInstance: {fileID: 0}
  m_PrefabAsset: {fileID: 0}
  m_GameObject: {fileID: 0}
  m_Enabled: 1
  m_EditorHideFlags: 0
  m_Script: {fileID: 11500000, guid: 182eb47472f64de388dd50183c0411d8, type: 3}
  m_Name: SO_Infocard_134284
  m_EditorClassIdentifier: 
  <Key>k__BackingField: 134284
  <Value>k__BackingField: 'The Henry Jones Gold convoy was bound for Rheinland when
    it was attacked by Corsairs near the Omega-3 Gate. Its escorts were destroyed,
    and the ship was commandeered. An Armed Forces patrol responding to the initial
    distress call intercepted the raiding party near the edge of the Grasmere Cloud,
    and a bloody firefight ensued. The heavily damaged armored transport was the
    only pirate ship able to escape into the safety of the Grasmere Cloud. Its crew
    is believed to have perished in there before establishing contact with other
    Corsairs in the area. <br>


'
