%YAML 1.1
%TAG !u! tag:unity3d.com,2011:
--- !u!114 &11400000
MonoBehaviour:
  m_ObjectHideFlags: 0
  m_CorrespondingSourceObject: {fileID: 0}
  m_PrefabInstance: {fileID: 0}
  m_PrefabAsset: {fileID: 0}
  m_GameObject: {fileID: 0}
  m_Enabled: 1
  m_EditorHideFlags: 0
  m_Script: {fileID: 11500000, guid: 182eb47472f64de388dd50183c0411d8, type: 3}
  m_Name: SO_Infocard_509600
  m_EditorClassIdentifier: 
  <Key>k__BackingField: 509600
  <Value>k__BackingField: 'The Croix-Rousse region of Planet Metz has a large number
    of Nox customers. The diamond miners seem to especially like it after a hard
    day''s work. Or maybe they like it during a hard day''s work. Or maybe before
    they go to work. Frankly, I couldn''t care less when they like it, so long as
    they keep buying it.<br>


'
