%YAML 1.1
%TAG !u! tag:unity3d.com,2011:
--- !u!114 &11400000
MonoBehaviour:
  m_ObjectHideFlags: 0
  m_CorrespondingSourceObject: {fileID: 0}
  m_PrefabInstance: {fileID: 0}
  m_PrefabAsset: {fileID: 0}
  m_GameObject: {fileID: 0}
  m_Enabled: 1
  m_EditorHideFlags: 0
  m_Script: {fileID: 11500000, guid: 182eb47472f64de388dd50183c0411d8, type: 3}
  m_Name: SO_Infocard_132705
  m_EditorClassIdentifier: 
  <Key>k__BackingField: 132705
  <Value>k__BackingField: 'I get an opportunity to see my family on Junyo when I
    fly HydroGro there from this base. Then I pick up Mining Machinery at New Tokyo,
    or Rice from Kyushu for the return trip. Although the trip to this base from
    the Kyushu system is not long, it is very dangerous because the Outcasts try
    to attack us almost every time. It is like they know we are coming.  <br>


'
