%YAML 1.1
%TAG !u! tag:unity3d.com,2011:
--- !u!114 &11400000
MonoBehaviour:
  m_ObjectHideFlags: 0
  m_CorrespondingSourceObject: {fileID: 0}
  m_PrefabInstance: {fileID: 0}
  m_PrefabAsset: {fileID: 0}
  m_GameObject: {fileID: 0}
  m_Enabled: 1
  m_EditorHideFlags: 0
  m_Script: {fileID: 11500000, guid: 182eb47472f64de388dd50183c0411d8, type: 3}
  m_Name: SO_Infocard_525687
  m_EditorClassIdentifier: 
  <Key>k__BackingField: 525687
  <Value>k__BackingField: 'Between you and me, Ageira''s been really interested in
    Kepler after the storm settled. Apparently it''s safe, well at least safe enough,
    to keep the network here online. They''ve hired us to cull the rabble running
    around every so often, probably to keep their own teams investigating in the
    system safe.<br>


'
