%YAML 1.1
%TAG !u! tag:unity3d.com,2011:
--- !u!114 &11400000
MonoBehaviour:
  m_ObjectHideFlags: 0
  m_CorrespondingSourceObject: {fileID: 0}
  m_PrefabInstance: {fileID: 0}
  m_PrefabAsset: {fileID: 0}
  m_GameObject: {fileID: 0}
  m_Enabled: 1
  m_EditorHideFlags: 0
  m_Script: {fileID: 11500000, guid: 182eb47472f64de388dd50183c0411d8, type: 3}
  m_Name: SO_Infocard_132052
  m_EditorClassIdentifier: 
  <Key>k__BackingField: 132052
  <Value>k__BackingField: 'The Xenos are strong in this system; they harass foreign
    shipping resources on the way to Houston from Kusari and Bretonia, or in the
    past from Rheinland to the rest of Liberty. Those governments and their corporations
    are displeased with the lack of action from LPI, so oftentimes we get hired to
    reduce the Xeno population in the system.<br>


'
