%YAML 1.1
%TAG !u! tag:unity3d.com,2011:
--- !u!114 &11400000
MonoBehaviour:
  m_ObjectHideFlags: 0
  m_CorrespondingSourceObject: {fileID: 0}
  m_PrefabInstance: {fileID: 0}
  m_PrefabAsset: {fileID: 0}
  m_GameObject: {fileID: 0}
  m_Enabled: 1
  m_EditorHideFlags: 0
  m_Script: {fileID: 11500000, guid: 182eb47472f64de388dd50183c0411d8, type: 3}
  m_Name: SO_Infocard_488339
  m_EditorClassIdentifier: 
  <Key>k__BackingField: 488339
  <Value>k__BackingField: 'Neon is very important in our medicinal production facilities.
    Nearly all cryostatic equipment relies on it as an energy transfer agent. Erie
    is one of the cheapest sources of this gas, and because of it''s inert nature
    it is not classified as a hazardous material, so transporting it does not require
    any special security measures. <br>


'
