%YAML 1.1
%TAG !u! tag:unity3d.com,2011:
--- !u!114 &11400000
MonoBehaviour:
  m_ObjectHideFlags: 0
  m_CorrespondingSourceObject: {fileID: 0}
  m_PrefabInstance: {fileID: 0}
  m_PrefabAsset: {fileID: 0}
  m_GameObject: {fileID: 0}
  m_Enabled: 1
  m_EditorHideFlags: 0
  m_Script: {fileID: 11500000, guid: 182eb47472f64de388dd50183c0411d8, type: 3}
  m_Name: SO_Infocard_515051
  m_EditorClassIdentifier: 
  <Key>k__BackingField: 515051
  <Value>k__BackingField: 'The Order has been here way before us. As we set up our
    shop in the deeper Omicrons, they only had few minor regulations to which I would
    happily oblige if it kept the peace. As long we followed very few and simple
    directions we were left to pursue almost any goals a Zoner could have. Many if
    not all of the later restrictions are things I do not want to have anything in
    common with to begin with. I do not need volatile Nomad technology to be happy,
    they can take it all. With all the ships I lose to these aliens, I am happy to
    have as little to do with them as possible. I know that a minority would like
    to think of us Zoners as strong entity that can stand their ground against everything
    around the different homes that different Zoners built. I only wish that their
    death makes others realise how dependent we are on the neutrality with our neighbors.
    Freeport 11 would definitely cease to exist if we have more enemies than the
    Nomads to worry about.<br>


'
