%YAML 1.1
%TAG !u! tag:unity3d.com,2011:
--- !u!114 &11400000
MonoBehaviour:
  m_ObjectHideFlags: 0
  m_CorrespondingSourceObject: {fileID: 0}
  m_PrefabInstance: {fileID: 0}
  m_PrefabAsset: {fileID: 0}
  m_GameObject: {fileID: 0}
  m_Enabled: 1
  m_EditorHideFlags: 0
  m_Script: {fileID: 11500000, guid: 182eb47472f64de388dd50183c0411d8, type: 3}
  m_Name: SO_Infocard_131892
  m_EditorClassIdentifier: 
  <Key>k__BackingField: 131892
  <Value>k__BackingField: 'I haul Fertilizers from Shinkaku Station all the way here.
    You really have to push it to make it through the Tau war zone. We typically
    pick up a load of Optical Chips for Waterloo on the return. That''s less time-sensitive
    but more dangerous for the Lane Hackers in Cortez and Magellan. They always seem
    to know when we''re coming. Waterloo always has Passengers ready to head out
    to Dublin''s Graves Station, and from there it''s through the Taus again with
    Gold to Narita. From there, it''s an easy trip with Mining Machinery back to
    Shinkaku. Not a circuit for the fainthearted, to be sure.<br>


'
