%YAML 1.1
%TAG !u! tag:unity3d.com,2011:
--- !u!114 &11400000
MonoBehaviour:
  m_ObjectHideFlags: 0
  m_CorrespondingSourceObject: {fileID: 0}
  m_PrefabInstance: {fileID: 0}
  m_PrefabAsset: {fileID: 0}
  m_GameObject: {fileID: 0}
  m_Enabled: 1
  m_EditorHideFlags: 0
  m_Script: {fileID: 11500000, guid: 77745e53922c405d884b74e75f714afa, type: 3}
  m_Name: SO_Npc_XenosOurayBartenderRichardYork
  m_EditorClassIdentifier: 
  serializationData:
    SerializedFormat: 2
    SerializedBytes: 
    ReferencedUnityObjects:
    - {fileID: 11400000, guid: 0d750757bdd5d4b6f822ca11a29d6919, type: 2}
    - {fileID: 11400000, guid: 1aa5db40b0b85430a96fc34921526896, type: 2}
    - {fileID: 11400000, guid: ad4d58060aa8c4b47814b8a7114ce222, type: 2}
    - {fileID: 11400000, guid: 8b52b728b14cc4e17ace5c5815b1bba0, type: 2}
    - {fileID: 11400000, guid: 01bcb2a99eecd4a84af41ea3976baf88, type: 2}
    - {fileID: 11400000, guid: 5b6854d6b3884499c9d310c53304af81, type: 2}
    - {fileID: 11400000, guid: 804282d9d090d4578a2c3c73cbb39853, type: 2}
    - {fileID: 11400000, guid: 6cb754f07d49d4c0f96744607c9db764, type: 2}
    - {fileID: 11400000, guid: 220f9ea41e22b49bbb024606f31c1ba9, type: 2}
    SerializedBytesString: 
    Prefab: {fileID: 0}
    PrefabModificationsReferencedUnityObjects: []
    PrefabModifications: []
    SerializationNodes:
    - Name: <Name>k__BackingField
      Entry: 10
      Data: 0
    - Name: <Base>k__BackingField
      Entry: 10
      Data: 1
    - Name: <Affiliation>k__BackingField
      Entry: 10
      Data: 2
    - Name: <Bribes>k__BackingField
      Entry: 7
      Data: 0|System.Collections.Generic.Dictionary`2[[FreelancerDataTool.Interfaces.IFaction,
        Assembly-CSharp],[System.Int32, mscorlib]], mscorlib
    - Name: comparer
      Entry: 7
      Data: 1|System.Collections.Generic.ObjectEqualityComparer`1[[FreelancerDataTool.Interfaces.IFaction,
        Assembly-CSharp]], mscorlib
    - Name: 
      Entry: 8
      Data: 
    - Name: 
      Entry: 12
      Data: 1
    - Name: 
      Entry: 7
      Data: 
    - Name: $k
      Entry: 10
      Data: 2
    - Name: $v
      Entry: 3
      Data: 840
    - Name: 
      Entry: 8
      Data: 
    - Name: 
      Entry: 13
      Data: 
    - Name: 
      Entry: 8
      Data: 
    - Name: <Rumors>k__BackingField
      Entry: 7
      Data: 2|System.Collections.Generic.List`1[[FreelancerDataTool.Interfaces.IInfocard,
        Assembly-CSharp]], mscorlib
    - Name: 
      Entry: 12
      Data: 6
    - Name: 
      Entry: 10
      Data: 3
    - Name: 
      Entry: 10
      Data: 4
    - Name: 
      Entry: 10
      Data: 5
    - Name: 
      Entry: 10
      Data: 6
    - Name: 
      Entry: 10
      Data: 7
    - Name: 
      Entry: 10
      Data: 8
    - Name: 
      Entry: 13
      Data: 
    - Name: 
      Entry: 8
      Data: 
  <Nickname>k__BackingField: li0303_fix_bartender
  <Room>k__BackingField: 
