%YAML 1.1
%TAG !u! tag:unity3d.com,2011:
--- !u!114 &11400000
MonoBehaviour:
  m_ObjectHideFlags: 0
  m_CorrespondingSourceObject: {fileID: 0}
  m_PrefabInstance: {fileID: 0}
  m_PrefabAsset: {fileID: 0}
  m_GameObject: {fileID: 0}
  m_Enabled: 1
  m_EditorHideFlags: 0
  m_Script: {fileID: 11500000, guid: 182eb47472f64de388dd50183c0411d8, type: 3}
  m_Name: SO_Infocard_509238
  m_EditorClassIdentifier: 
  <Key>k__BackingField: 509238
  <Value>k__BackingField: 'The Maquis carry no honor in life nor in death. They attack
    women, children, and civilians without remorse. We shall not rest until they
    are all brought to justice. <br>


'
