%YAML 1.1
%TAG !u! tag:unity3d.com,2011:
--- !u!114 &11400000
MonoBehaviour:
  m_ObjectHideFlags: 0
  m_CorrespondingSourceObject: {fileID: 0}
  m_PrefabInstance: {fileID: 0}
  m_PrefabAsset: {fileID: 0}
  m_GameObject: {fileID: 0}
  m_Enabled: 1
  m_EditorHideFlags: 0
  m_Script: {fileID: 11500000, guid: 182eb47472f64de388dd50183c0411d8, type: 3}
  m_Name: SO_Infocard_525286
  m_EditorClassIdentifier: 
  <Key>k__BackingField: 525286
  <Value>k__BackingField: 'We sometimes send scouts into the Galloway ice cloud to
    look for new deposits of Hydrocarbons amidst the ice, but in recent years it
    has become increasingly dangerous, as more and more Outcasts have flooded into
    the area. We believe they may have built a base somewhere in the field, though
    we don''t know where. Gallia has also found their way through, most likely through
    the Tau-31 jump hole, and has begun probing the Bretonian defenses in the system.
    At least they won''t be able to move their battleships through that way - the
    Tau-31 asteroid field is far too dense for those massive ships to maneuver through.
    <br>


'
