%YAML 1.1
%TAG !u! tag:unity3d.com,2011:
--- !u!114 &11400000
MonoBehaviour:
  m_ObjectHideFlags: 0
  m_CorrespondingSourceObject: {fileID: 0}
  m_PrefabInstance: {fileID: 0}
  m_PrefabAsset: {fileID: 0}
  m_GameObject: {fileID: 0}
  m_Enabled: 1
  m_EditorHideFlags: 0
  m_Script: {fileID: 11500000, guid: 182eb47472f64de388dd50183c0411d8, type: 3}
  m_Name: SO_Infocard_460403
  m_EditorClassIdentifier: 
  <Key>k__BackingField: 460403
  <Value>k__BackingField: 'Marines are routinely rotated up here for duty. West Point
    Academy is their embarkation point. You can''t station any Marine company in
    one location too long. They tend to get too comfortable and then they become
    more trouble than help.<br>


'
