%YAML 1.1
%TAG !u! tag:unity3d.com,2011:
--- !u!114 &11400000
MonoBehaviour:
  m_ObjectHideFlags: 0
  m_CorrespondingSourceObject: {fileID: 0}
  m_PrefabInstance: {fileID: 0}
  m_PrefabAsset: {fileID: 0}
  m_GameObject: {fileID: 0}
  m_Enabled: 1
  m_EditorHideFlags: 0
  m_Script: {fileID: 11500000, guid: 77745e53922c405d884b74e75f714afa, type: 3}
  m_Name: SO_Npc_AgeiraTechnologiesOliviaWatkins
  m_EditorClassIdentifier: 
  serializationData:
    SerializedFormat: 2
    SerializedBytes: 
    ReferencedUnityObjects:
    - {fileID: 11400000, guid: 0169414b809434cb39cc4e0670e96908, type: 2}
    - {fileID: 11400000, guid: 4dab97181801a4712a8ec817125ee649, type: 2}
    - {fileID: 11400000, guid: 45069beacc2f04a15a79da10c79e74a0, type: 2}
    - {fileID: 11400000, guid: 2626ddb4936464d60942ab14e2d320f6, type: 2}
    - {fileID: 11400000, guid: acc43c6b535f44d0fb2153e4995cfa97, type: 2}
    - {fileID: 11400000, guid: 1c8fe78562da8469eb0667fb6fe54394, type: 2}
    - {fileID: 11400000, guid: 553a96a9207fa48bfa35022e0f5e0518, type: 2}
    - {fileID: 11400000, guid: 4a4a49b11817e439f82d35556642e020, type: 2}
    - {fileID: 11400000, guid: 73bd10da981c04a0b911d7cc4e371016, type: 2}
    - {fileID: 11400000, guid: 11f009c64e3974f658a1b3f7465b0075, type: 2}
    - {fileID: 11400000, guid: e0b96206f031345b389960f8b4b17091, type: 2}
    - {fileID: 11400000, guid: 26dbc0dbd19d84b7e9ccc8b01f525781, type: 2}
    SerializedBytesString: 
    Prefab: {fileID: 0}
    PrefabModificationsReferencedUnityObjects: []
    PrefabModifications: []
    SerializationNodes:
    - Name: <Name>k__BackingField
      Entry: 10
      Data: 0
    - Name: <Base>k__BackingField
      Entry: 10
      Data: 1
    - Name: <Affiliation>k__BackingField
      Entry: 10
      Data: 2
    - Name: <Bribes>k__BackingField
      Entry: 7
      Data: 0|System.Collections.Generic.Dictionary`2[[FreelancerDataTool.Interfaces.IFaction,
        Assembly-CSharp],[System.Int32, mscorlib]], mscorlib
    - Name: comparer
      Entry: 7
      Data: 1|System.Collections.Generic.ObjectEqualityComparer`1[[FreelancerDataTool.Interfaces.IFaction,
        Assembly-CSharp]], mscorlib
    - Name: 
      Entry: 8
      Data: 
    - Name: 
      Entry: 12
      Data: 0
    - Name: 
      Entry: 13
      Data: 
    - Name: 
      Entry: 8
      Data: 
    - Name: <Rumors>k__BackingField
      Entry: 7
      Data: 2|System.Collections.Generic.List`1[[FreelancerDataTool.Interfaces.IInfocard,
        Assembly-CSharp]], mscorlib
    - Name: 
      Entry: 12
      Data: 9
    - Name: 
      Entry: 10
      Data: 3
    - Name: 
      Entry: 10
      Data: 4
    - Name: 
      Entry: 10
      Data: 5
    - Name: 
      Entry: 10
      Data: 6
    - Name: 
      Entry: 10
      Data: 7
    - Name: 
      Entry: 10
      Data: 8
    - Name: 
      Entry: 10
      Data: 9
    - Name: 
      Entry: 10
      Data: 10
    - Name: 
      Entry: 10
      Data: 11
    - Name: 
      Entry: 13
      Data: 
    - Name: 
      Entry: 8
      Data: 
  <Nickname>k__BackingField: li0304_ageira_002_f
  <Room>k__BackingField: bar
