%YAML 1.1
%TAG !u! tag:unity3d.com,2011:
--- !u!114 &11400000
MonoBehaviour:
  m_ObjectHideFlags: 0
  m_CorrespondingSourceObject: {fileID: 0}
  m_PrefabInstance: {fileID: 0}
  m_PrefabAsset: {fileID: 0}
  m_GameObject: {fileID: 0}
  m_Enabled: 1
  m_EditorHideFlags: 0
  m_Script: {fileID: 11500000, guid: 182eb47472f64de388dd50183c0411d8, type: 3}
  m_Name: SO_Infocard_132034
  m_EditorClassIdentifier: 
  <Key>k__BackingField: 132034
  <Value>k__BackingField: 'Kishiro distributes most of the H-Fuel produced by the
    GMG throughout Sirius. That contract used to be held by Samura, but they overplayed
    their hand by trying to squeeze too much from the GMG. Now they have nothing,
    and we have a solid partnership with the Gas Miners. The mixture I sold here
    comes from our new Ogashawa complex in Sigma-19, a joint venture between Kishiro
    and the GMG. <br>


'
