%YAML 1.1
%TAG !u! tag:unity3d.com,2011:
--- !u!114 &11400000
MonoBehaviour:
  m_ObjectHideFlags: 0
  m_CorrespondingSourceObject: {fileID: 0}
  m_PrefabInstance: {fileID: 0}
  m_PrefabAsset: {fileID: 0}
  m_GameObject: {fileID: 0}
  m_Enabled: 1
  m_EditorHideFlags: 0
  m_Script: {fileID: 11500000, guid: 182eb47472f64de388dd50183c0411d8, type: 3}
  m_Name: SO_Infocard_525303
  m_EditorClassIdentifier: 
  <Key>k__BackingField: 525303
  <Value>k__BackingField: 'The Outcasts just don''t give up. There are dozens of
    their fighter wrecks dotted around this area, and a looter would have a field
    day here. Still, they''ve hurt our lads from time to time, too. One time we even
    lost a prototype weapon in the test phase somewhere out in the system. Unfortunately
    we never found the craft that was carrying it - presumably floating deep in the
    field somewhere. <br>


'
