%YAML 1.1
%TAG !u! tag:unity3d.com,2011:
--- !u!114 &11400000
MonoBehaviour:
  m_ObjectHideFlags: 0
  m_CorrespondingSourceObject: {fileID: 0}
  m_PrefabInstance: {fileID: 0}
  m_PrefabAsset: {fileID: 0}
  m_GameObject: {fileID: 0}
  m_Enabled: 1
  m_EditorHideFlags: 0
  m_Script: {fileID: 11500000, guid: 77745e53922c405d884b74e75f714afa, type: 3}
  m_Name: SO_Npc_JunkersGeoffBeer
  m_EditorClassIdentifier: 
  serializationData:
    SerializedFormat: 2
    SerializedBytes: 
    ReferencedUnityObjects:
    - {fileID: 11400000, guid: ad0125dd1ffeb42b9bee51707b8a57ac, type: 2}
    - {fileID: 11400000, guid: c310b0c4daa8d421097ce78db66629c7, type: 2}
    - {fileID: 11400000, guid: 478dd9a7b9f5d43c79896e4180bbcc88, type: 2}
    - {fileID: 11400000, guid: 6a1fdc84606844c1297badaef0a4e176, type: 2}
    - {fileID: 11400000, guid: f416cf2f9a9db46b19050e55f035e4e0, type: 2}
    - {fileID: 11400000, guid: 76bd45f6553cc4958944cba1dd3a7475, type: 2}
    - {fileID: 11400000, guid: 313e1c04f32674b85a4c3661bedd2ddd, type: 2}
    SerializedBytesString: 
    Prefab: {fileID: 0}
    PrefabModificationsReferencedUnityObjects: []
    PrefabModifications: []
    SerializationNodes:
    - Name: <Name>k__BackingField
      Entry: 10
      Data: 0
    - Name: <Base>k__BackingField
      Entry: 10
      Data: 1
    - Name: <Affiliation>k__BackingField
      Entry: 10
      Data: 2
    - Name: <Bribes>k__BackingField
      Entry: 7
      Data: 0|System.Collections.Generic.Dictionary`2[[FreelancerDataTool.Interfaces.IFaction,
        Assembly-CSharp],[System.Int32, mscorlib]], mscorlib
    - Name: comparer
      Entry: 7
      Data: 1|System.Collections.Generic.ObjectEqualityComparer`1[[FreelancerDataTool.Interfaces.IFaction,
        Assembly-CSharp]], mscorlib
    - Name: 
      Entry: 8
      Data: 
    - Name: 
      Entry: 12
      Data: 0
    - Name: 
      Entry: 13
      Data: 
    - Name: 
      Entry: 8
      Data: 
    - Name: <Rumors>k__BackingField
      Entry: 7
      Data: 2|System.Collections.Generic.List`1[[FreelancerDataTool.Interfaces.IInfocard,
        Assembly-CSharp]], mscorlib
    - Name: 
      Entry: 12
      Data: 4
    - Name: 
      Entry: 10
      Data: 3
    - Name: 
      Entry: 10
      Data: 4
    - Name: 
      Entry: 10
      Data: 5
    - Name: 
      Entry: 10
      Data: 6
    - Name: 
      Entry: 13
      Data: 
    - Name: 
      Entry: 8
      Data: 
  <Nickname>k__BackingField: br0108_junkers_001_m
  <Room>k__BackingField: bar
