%YAML 1.1
%TAG !u! tag:unity3d.com,2011:
--- !u!114 &11400000
MonoBehaviour:
  m_ObjectHideFlags: 0
  m_CorrespondingSourceObject: {fileID: 0}
  m_PrefabInstance: {fileID: 0}
  m_PrefabAsset: {fileID: 0}
  m_GameObject: {fileID: 0}
  m_Enabled: 1
  m_EditorHideFlags: 0
  m_Script: {fileID: 11500000, guid: ac6f300716fb477b98dee1a497bbb338, type: 3}
  m_Name: SO_Base_ReimsStation
  m_EditorClassIdentifier: 
  serializationData:
    SerializedFormat: 2
    SerializedBytes: 
    ReferencedUnityObjects:
    - {fileID: 11400000, guid: d458b2e2f16d0451da9fa93d26103817, type: 2}
    - {fileID: 11400000, guid: 874add5d48e174265befaa9bc00b813c, type: 2}
    - {fileID: 11400000, guid: 005181376514645e4a26809378756d92, type: 2}
    - {fileID: 11400000, guid: 63f81cb22e1e7454ba7048f7ea3df974, type: 2}
    SerializedBytesString: 
    Prefab: {fileID: 0}
    PrefabModificationsReferencedUnityObjects: []
    PrefabModifications: []
    SerializationNodes:
    - Name: <Name>k__BackingField
      Entry: 10
      Data: 0
    - Name: <Infocard>k__BackingField
      Entry: 10
      Data: 1
    - Name: <System>k__BackingField
      Entry: 10
      Data: 2
    - Name: <Reputation>k__BackingField
      Entry: 10
      Data: 3
  <Nickname>k__BackingField: EW16_03_Base
