%YAML 1.1
%TAG !u! tag:unity3d.com,2011:
--- !u!114 &11400000
MonoBehaviour:
  m_ObjectHideFlags: 0
  m_CorrespondingSourceObject: {fileID: 0}
  m_PrefabInstance: {fileID: 0}
  m_PrefabAsset: {fileID: 0}
  m_GameObject: {fileID: 0}
  m_Enabled: 1
  m_EditorHideFlags: 0
  m_Script: {fileID: 11500000, guid: 77745e53922c405d884b74e75f714afa, type: 3}
  m_Name: SO_Npc_RedHessiansArnimFromm
  m_EditorClassIdentifier: 
  serializationData:
    SerializedFormat: 2
    SerializedBytes: 
    ReferencedUnityObjects:
    - {fileID: 11400000, guid: 69236ee7068bf45759c9763a2fd41a05, type: 2}
    - {fileID: 11400000, guid: 95e3039486fb44bbf952ecc8545c2e31, type: 2}
    - {fileID: 11400000, guid: a8ccb27f7c05c4eec8bce2cec0734151, type: 2}
    - {fileID: 11400000, guid: 54392d30b3eb04c5c9b9148a99db2a3f, type: 2}
    - {fileID: 11400000, guid: 6f6cd6de09a444cd59ffb3a29a7a687a, type: 2}
    - {fileID: 11400000, guid: 8d44394ff6a29453c93dd07792fb5953, type: 2}
    - {fileID: 11400000, guid: 42c4af62009ee4918b291729d1d217e1, type: 2}
    - {fileID: 11400000, guid: 15e37d245979744eaa1002afdf0aeebb, type: 2}
    - {fileID: 11400000, guid: 00b78ac4b37784f34b5c74fb9db0bfce, type: 2}
    - {fileID: 11400000, guid: 40db8236b232b4cf18f8490b38c23188, type: 2}
    - {fileID: 11400000, guid: 2e423a737f9424eac86d26bfefbe186b, type: 2}
    - {fileID: 11400000, guid: fd348e90d7f2d4f00857d1753253c6ee, type: 2}
    - {fileID: 11400000, guid: 61995778c77d44f619c871d466264f85, type: 2}
    - {fileID: 11400000, guid: d2b368108411847bea2f2aa923a63cb1, type: 2}
    SerializedBytesString: 
    Prefab: {fileID: 0}
    PrefabModificationsReferencedUnityObjects: []
    PrefabModifications: []
    SerializationNodes:
    - Name: <Name>k__BackingField
      Entry: 10
      Data: 0
    - Name: <Base>k__BackingField
      Entry: 10
      Data: 1
    - Name: <Affiliation>k__BackingField
      Entry: 10
      Data: 2
    - Name: <Bribes>k__BackingField
      Entry: 7
      Data: 0|System.Collections.Generic.Dictionary`2[[FreelancerDataTool.Interfaces.IFaction,
        Assembly-CSharp],[System.Int32, mscorlib]], mscorlib
    - Name: comparer
      Entry: 7
      Data: 1|System.Collections.Generic.ObjectEqualityComparer`1[[FreelancerDataTool.Interfaces.IFaction,
        Assembly-CSharp]], mscorlib
    - Name: 
      Entry: 8
      Data: 
    - Name: 
      Entry: 12
      Data: 0
    - Name: 
      Entry: 13
      Data: 
    - Name: 
      Entry: 8
      Data: 
    - Name: <Rumors>k__BackingField
      Entry: 7
      Data: 2|System.Collections.Generic.List`1[[FreelancerDataTool.Interfaces.IInfocard,
        Assembly-CSharp]], mscorlib
    - Name: 
      Entry: 12
      Data: 11
    - Name: 
      Entry: 10
      Data: 3
    - Name: 
      Entry: 10
      Data: 4
    - Name: 
      Entry: 10
      Data: 5
    - Name: 
      Entry: 10
      Data: 6
    - Name: 
      Entry: 10
      Data: 7
    - Name: 
      Entry: 10
      Data: 8
    - Name: 
      Entry: 10
      Data: 9
    - Name: 
      Entry: 10
      Data: 10
    - Name: 
      Entry: 10
      Data: 11
    - Name: 
      Entry: 10
      Data: 12
    - Name: 
      Entry: 10
      Data: 13
    - Name: 
      Entry: 13
      Data: 
    - Name: 
      Entry: 8
      Data: 
  <Nickname>k__BackingField: rh0504_hessians_001_m
  <Room>k__BackingField: bar
