%YAML 1.1
%TAG !u! tag:unity3d.com,2011:
--- !u!114 &11400000
MonoBehaviour:
  m_ObjectHideFlags: 0
  m_CorrespondingSourceObject: {fileID: 0}
  m_PrefabInstance: {fileID: 0}
  m_PrefabAsset: {fileID: 0}
  m_GameObject: {fileID: 0}
  m_Enabled: 1
  m_EditorHideFlags: 0
  m_Script: {fileID: 11500000, guid: 182eb47472f64de388dd50183c0411d8, type: 3}
  m_Name: SO_Infocard_134220
  m_EditorClassIdentifier: 
  <Key>k__BackingField: 134220
  <Value>k__BackingField: 'We might eventually win this system from the corporates.
    Ore deposits here will soon be exhausted, and our attacks cost them dearly. Intelligence
    suggests they may be moving the bulk of their mining operations to Omega-7. If
    that happens, it will be a great victory for us. <br><nbsp><br>


'
