%YAML 1.1
%TAG !u! tag:unity3d.com,2011:
--- !u!114 &11400000
MonoBehaviour:
  m_ObjectHideFlags: 0
  m_CorrespondingSourceObject: {fileID: 0}
  m_PrefabInstance: {fileID: 0}
  m_PrefabAsset: {fileID: 0}
  m_GameObject: {fileID: 0}
  m_Enabled: 1
  m_EditorHideFlags: 0
  m_Script: {fileID: 11500000, guid: 182eb47472f64de388dd50183c0411d8, type: 3}
  m_Name: SO_Infocard_134225
  m_EditorClassIdentifier: 
  <Key>k__BackingField: 134225
  <Value>k__BackingField: 'The Rheinland Republic was supposed to be about the common
    man getting paid well for hard work, about companies that cared if their employees
    were safe. Those brave souls who died fighting to overthrow the empire -- why?
    Rheinland has the same masters, only now they rule a republic instead of an empire.
    <br><nbsp><br>


'
