%YAML 1.1
%TAG !u! tag:unity3d.com,2011:
--- !u!114 &11400000
MonoBehaviour:
  m_ObjectHideFlags: 0
  m_CorrespondingSourceObject: {fileID: 0}
  m_PrefabInstance: {fileID: 0}
  m_PrefabAsset: {fileID: 0}
  m_GameObject: {fileID: 0}
  m_Enabled: 1
  m_EditorHideFlags: 0
  m_Script: {fileID: 11500000, guid: 77745e53922c405d884b74e75f714afa, type: 3}
  m_Name: SO_Npc_BorderWorldExportsRep.JasonPowell
  m_EditorClassIdentifier: 
  serializationData:
    SerializedFormat: 2
    SerializedBytes: 
    ReferencedUnityObjects:
    - {fileID: 11400000, guid: ebbe5c17c0fe049299754137d1e9921a, type: 2}
    - {fileID: 11400000, guid: 714722fc02f954c30865a8c7f1b37a15, type: 2}
    - {fileID: 11400000, guid: cec6002b426154c94bba7ff771f75e9d, type: 2}
    - {fileID: 11400000, guid: 7d79efbcecbfa4ee489948f04ab61ba1, type: 2}
    - {fileID: 11400000, guid: f5db549bc6f544772bfb28f33cb59ded, type: 2}
    - {fileID: 11400000, guid: 10449b69f19c24d90ad54ed9d60b7256, type: 2}
    - {fileID: 11400000, guid: b5e8f07fa897a479cbbc22f6314a52b9, type: 2}
    - {fileID: 11400000, guid: 6e0bf86f2919a4f118b589f3264328d6, type: 2}
    - {fileID: 11400000, guid: ea65924a0558c4a47b4c4d15e22fbf5c, type: 2}
    SerializedBytesString: 
    Prefab: {fileID: 0}
    PrefabModificationsReferencedUnityObjects: []
    PrefabModifications: []
    SerializationNodes:
    - Name: <Name>k__BackingField
      Entry: 10
      Data: 0
    - Name: <Base>k__BackingField
      Entry: 10
      Data: 1
    - Name: <Affiliation>k__BackingField
      Entry: 10
      Data: 2
    - Name: <Bribes>k__BackingField
      Entry: 7
      Data: 0|System.Collections.Generic.Dictionary`2[[FreelancerDataTool.Interfaces.IFaction,
        Assembly-CSharp],[System.Int32, mscorlib]], mscorlib
    - Name: comparer
      Entry: 7
      Data: 1|System.Collections.Generic.ObjectEqualityComparer`1[[FreelancerDataTool.Interfaces.IFaction,
        Assembly-CSharp]], mscorlib
    - Name: 
      Entry: 8
      Data: 
    - Name: 
      Entry: 12
      Data: 4
    - Name: 
      Entry: 7
      Data: 
    - Name: $k
      Entry: 10
      Data: 3
    - Name: $v
      Entry: 3
      Data: 840
    - Name: 
      Entry: 8
      Data: 
    - Name: 
      Entry: 7
      Data: 
    - Name: $k
      Entry: 10
      Data: 2
    - Name: $v
      Entry: 3
      Data: 840
    - Name: 
      Entry: 8
      Data: 
    - Name: 
      Entry: 7
      Data: 
    - Name: $k
      Entry: 10
      Data: 4
    - Name: $v
      Entry: 3
      Data: 840
    - Name: 
      Entry: 8
      Data: 
    - Name: 
      Entry: 7
      Data: 
    - Name: $k
      Entry: 10
      Data: 5
    - Name: $v
      Entry: 3
      Data: 840
    - Name: 
      Entry: 8
      Data: 
    - Name: 
      Entry: 13
      Data: 
    - Name: 
      Entry: 8
      Data: 
    - Name: <Rumors>k__BackingField
      Entry: 7
      Data: 2|System.Collections.Generic.List`1[[FreelancerDataTool.Interfaces.IInfocard,
        Assembly-CSharp]], mscorlib
    - Name: 
      Entry: 12
      Data: 3
    - Name: 
      Entry: 10
      Data: 6
    - Name: 
      Entry: 10
      Data: 7
    - Name: 
      Entry: 10
      Data: 8
    - Name: 
      Entry: 13
      Data: 
    - Name: 
      Entry: 8
      Data: 
  <Nickname>k__BackingField: li0111_bowex_001_m
  <Room>k__BackingField: bar
