%YAML 1.1
%TAG !u! tag:unity3d.com,2011:
--- !u!114 &11400000
MonoBehaviour:
  m_ObjectHideFlags: 0
  m_CorrespondingSourceObject: {fileID: 0}
  m_PrefabInstance: {fileID: 0}
  m_PrefabAsset: {fileID: 0}
  m_GameObject: {fileID: 0}
  m_Enabled: 1
  m_EditorHideFlags: 0
  m_Script: {fileID: 11500000, guid: 182eb47472f64de388dd50183c0411d8, type: 3}
  m_Name: SO_Infocard_133881
  m_EditorClassIdentifier: 
  <Key>k__BackingField: 133881
  <Value>k__BackingField: 'We make our living smuggling Diamonds and Tobacco from
    here to Pacifica. Unioners carry them all they way to Dawson, where they are
    sold to the Rogues, who smuggle them past the Xenos in Hudson and Texas and across
    the final stretch in New York.<br>


'
