%YAML 1.1
%TAG !u! tag:unity3d.com,2011:
--- !u!114 &11400000
MonoBehaviour:
  m_ObjectHideFlags: 0
  m_CorrespondingSourceObject: {fileID: 0}
  m_PrefabInstance: {fileID: 0}
  m_PrefabAsset: {fileID: 0}
  m_GameObject: {fileID: 0}
  m_Enabled: 1
  m_EditorHideFlags: 0
  m_Script: {fileID: 11500000, guid: 77745e53922c405d884b74e75f714afa, type: 3}
  m_Name: SO_Npc_IndependentMinersGuildDexterHovis
  m_EditorClassIdentifier: 
  serializationData:
    SerializedFormat: 2
    SerializedBytes: 
    ReferencedUnityObjects:
    - {fileID: 11400000, guid: c5522c24577554e59b2923eb51cf6c58, type: 2}
    - {fileID: 11400000, guid: ac7506c9ea67945b8ad865cbe221ac6e, type: 2}
    - {fileID: 11400000, guid: 0b7372911ddca4c41afc4a519e8789cc, type: 2}
    - {fileID: 11400000, guid: f5db549bc6f544772bfb28f33cb59ded, type: 2}
    - {fileID: 11400000, guid: c39a66d1d776e46e0a30ead58e252bdc, type: 2}
    - {fileID: 11400000, guid: 40c3ce01a8b4c4d379e10a23e2c69545, type: 2}
    - {fileID: 11400000, guid: 292d5e2a3c19b48a98e132539fd75d89, type: 2}
    - {fileID: 11400000, guid: c2e1f7ddf83804fe68e5b11993c142cc, type: 2}
    - {fileID: 11400000, guid: ff6f80f84b9884ee6808b38b75031f9f, type: 2}
    SerializedBytesString: 
    Prefab: {fileID: 0}
    PrefabModificationsReferencedUnityObjects: []
    PrefabModifications: []
    SerializationNodes:
    - Name: <Name>k__BackingField
      Entry: 10
      Data: 0
    - Name: <Base>k__BackingField
      Entry: 10
      Data: 1
    - Name: <Affiliation>k__BackingField
      Entry: 10
      Data: 2
    - Name: <Bribes>k__BackingField
      Entry: 7
      Data: 0|System.Collections.Generic.Dictionary`2[[FreelancerDataTool.Interfaces.IFaction,
        Assembly-CSharp],[System.Int32, mscorlib]], mscorlib
    - Name: comparer
      Entry: 7
      Data: 1|System.Collections.Generic.ObjectEqualityComparer`1[[FreelancerDataTool.Interfaces.IFaction,
        Assembly-CSharp]], mscorlib
    - Name: 
      Entry: 8
      Data: 
    - Name: 
      Entry: 12
      Data: 4
    - Name: 
      Entry: 7
      Data: 
    - Name: $k
      Entry: 10
      Data: 3
    - Name: $v
      Entry: 3
      Data: 840
    - Name: 
      Entry: 8
      Data: 
    - Name: 
      Entry: 7
      Data: 
    - Name: $k
      Entry: 10
      Data: 2
    - Name: $v
      Entry: 3
      Data: 840
    - Name: 
      Entry: 8
      Data: 
    - Name: 
      Entry: 7
      Data: 
    - Name: $k
      Entry: 10
      Data: 4
    - Name: $v
      Entry: 3
      Data: 840
    - Name: 
      Entry: 8
      Data: 
    - Name: 
      Entry: 7
      Data: 
    - Name: $k
      Entry: 10
      Data: 5
    - Name: $v
      Entry: 3
      Data: 840
    - Name: 
      Entry: 8
      Data: 
    - Name: 
      Entry: 13
      Data: 
    - Name: 
      Entry: 8
      Data: 
    - Name: <Rumors>k__BackingField
      Entry: 7
      Data: 2|System.Collections.Generic.List`1[[FreelancerDataTool.Interfaces.IInfocard,
        Assembly-CSharp]], mscorlib
    - Name: 
      Entry: 12
      Data: 3
    - Name: 
      Entry: 10
      Data: 6
    - Name: 
      Entry: 10
      Data: 7
    - Name: 
      Entry: 10
      Data: 8
    - Name: 
      Entry: 13
      Data: 
    - Name: 
      Entry: 8
      Data: 
  <Nickname>k__BackingField: bw0903_img_001_m
  <Room>k__BackingField: bar
