%YAML 1.1
%TAG !u! tag:unity3d.com,2011:
--- !u!114 &11400000
MonoBehaviour:
  m_ObjectHideFlags: 0
  m_CorrespondingSourceObject: {fileID: 0}
  m_PrefabInstance: {fileID: 0}
  m_PrefabAsset: {fileID: 0}
  m_GameObject: {fileID: 0}
  m_Enabled: 1
  m_EditorHideFlags: 0
  m_Script: {fileID: 11500000, guid: 182eb47472f64de388dd50183c0411d8, type: 3}
  m_Name: SO_Infocard_131305
  m_EditorClassIdentifier: 
  <Key>k__BackingField: 131305
  <Value>k__BackingField: 'The Outcasts are using the Rogues. The Outcasts smuggle
    their Cardamine into the Rogue base in the Badlands, and then the Rogues and
    Junkers get it planetside. Most of the Rogues I''ve brought in were strung out
    on the Cardamine, so I''m guessing the Outcasts are the ones with their hands
    on the throttle.<br>


'
