%YAML 1.1
%TAG !u! tag:unity3d.com,2011:
--- !u!114 &11400000
MonoBehaviour:
  m_ObjectHideFlags: 0
  m_CorrespondingSourceObject: {fileID: 0}
  m_PrefabInstance: {fileID: 0}
  m_PrefabAsset: {fileID: 0}
  m_GameObject: {fileID: 0}
  m_Enabled: 1
  m_EditorHideFlags: 0
  m_Script: {fileID: 11500000, guid: 182eb47472f64de388dd50183c0411d8, type: 3}
  m_Name: SO_Infocard_131600
  m_EditorClassIdentifier: 
  <Key>k__BackingField: 131600
  <Value>k__BackingField: 'We''re unable to establish the exact location, but we
    think there''s a Jump Hole between the Kuryo and Matsuo Clouds. That''s how the
    Lane Hackers get into the system. We''d love to shut it down, but we have to
    find it first. A lot of Bounty Hunters are out there, which makes poking around
    difficult.<br><nbsp><br>


'
