%YAML 1.1
%TAG !u! tag:unity3d.com,2011:
--- !u!114 &11400000
MonoBehaviour:
  m_ObjectHideFlags: 0
  m_CorrespondingSourceObject: {fileID: 0}
  m_PrefabInstance: {fileID: 0}
  m_PrefabAsset: {fileID: 0}
  m_GameObject: {fileID: 0}
  m_Enabled: 1
  m_EditorHideFlags: 0
  m_Script: {fileID: 11500000, guid: 182eb47472f64de388dd50183c0411d8, type: 3}
  m_Name: SO_Infocard_504296
  m_EditorClassIdentifier: 
  <Key>k__BackingField: 504296
  <Value>k__BackingField: " <br><b><p align=\"center\">Stats<br></b><p align=\"left\">
    <br>Gun/Turret Mounts: 6/0<br>Base Armor: 21100<br>Cargo Space: 95<br>Power Output:
    2130/38360<br>Thruster Energy: 100/1000<br>Batteries/NanoBots: 190/87<br>Equipment
    Mounts: CM 2xTorp CD <br> <br><b><p align=\"center\">Maneuverability<br></b><p
    align=\"left\"> <br>Max Turn Rate: 63.03\xB0<br>Time to Max Turn: 1.88s<br>Time
    to turn 180\xB0: 3.13s<br>Maximum Strafe Speed: 29.17m/s<br>Distance Strafed
    in 0.5s: 6.55m<br>\n\n"
