%YAML 1.1
%TAG !u! tag:unity3d.com,2011:
--- !u!114 &11400000
MonoBehaviour:
  m_ObjectHideFlags: 0
  m_CorrespondingSourceObject: {fileID: 0}
  m_PrefabInstance: {fileID: 0}
  m_PrefabAsset: {fileID: 0}
  m_GameObject: {fileID: 0}
  m_Enabled: 1
  m_EditorHideFlags: 0
  m_Script: {fileID: 11500000, guid: 182eb47472f64de388dd50183c0411d8, type: 3}
  m_Name: SO_Infocard_470176
  m_EditorClassIdentifier: 
  <Key>k__BackingField: 470176
  <Value>k__BackingField: 'Plenty of work out here for a Bounty Hunter. Many of the
    notorious Outcast raiders that head into Kusari and even Liberty come back here
    once the heat in the House systems becomes too much for them. All I have to do
    is keep an eye out and pick them off once they''re here. <br>


'
