%YAML 1.1
%TAG !u! tag:unity3d.com,2011:
--- !u!114 &11400000
MonoBehaviour:
  m_ObjectHideFlags: 0
  m_CorrespondingSourceObject: {fileID: 0}
  m_PrefabInstance: {fileID: 0}
  m_PrefabAsset: {fileID: 0}
  m_GameObject: {fileID: 0}
  m_Enabled: 1
  m_EditorHideFlags: 0
  m_Script: {fileID: 11500000, guid: 182eb47472f64de388dd50183c0411d8, type: 3}
  m_Name: SO_Infocard_133315
  m_EditorClassIdentifier: 
  <Key>k__BackingField: 133315
  <Value>k__BackingField: 'The Yukawa Shipyard has been in operation since the second
    century. We have always produced commercial ships, specifically gas miners. Our
    miners must deal with the extremely high operating temperatures prevalent within
    the gaseous clouds of the Crow Nebula. Extreme radiation levels are a fact of
    daily life for a gas miner within the heart of the Nebula. <br>


'
