%YAML 1.1
%TAG !u! tag:unity3d.com,2011:
--- !u!114 &11400000
MonoBehaviour:
  m_ObjectHideFlags: 0
  m_CorrespondingSourceObject: {fileID: 0}
  m_PrefabInstance: {fileID: 0}
  m_PrefabAsset: {fileID: 0}
  m_GameObject: {fileID: 0}
  m_Enabled: 1
  m_EditorHideFlags: 0
  m_Script: {fileID: 11500000, guid: 182eb47472f64de388dd50183c0411d8, type: 3}
  m_Name: SO_Infocard_524314
  m_EditorClassIdentifier: 
  <Key>k__BackingField: 524314
  <Value>k__BackingField: 'I saw a Molly clip the wings off one of my pack when we
    were out on patrol. Bastard had the audacity to mount one of our turrets. It''s
    good to know they like trophies, I think I''ll start taking a few to teach them
    respect.<br>


'
