%YAML 1.1
%TAG !u! tag:unity3d.com,2011:
--- !u!114 &11400000
MonoBehaviour:
  m_ObjectHideFlags: 0
  m_CorrespondingSourceObject: {fileID: 0}
  m_PrefabInstance: {fileID: 0}
  m_PrefabAsset: {fileID: 0}
  m_GameObject: {fileID: 0}
  m_Enabled: 1
  m_EditorHideFlags: 0
  m_Script: {fileID: 11500000, guid: 182eb47472f64de388dd50183c0411d8, type: 3}
  m_Name: SO_Infocard_461546
  m_EditorClassIdentifier: 
  <Key>k__BackingField: 461546
  <Value>k__BackingField: 'Kishiro transports are starting to see more Farmers interfering
    with our convoys in Kusari, and even out here. The GMG runs them off when they
    come across them, but they can''t be in all place at all times. Kishiro must
    look to its own security ships in times like these, or enlist the help of Freelancers
    and Bounty Hunters. It works in Shikoku, and with a more supportive government
    in Kusari, perhaps it can work in Honshu as well.<br>


'
