%YAML 1.1
%TAG !u! tag:unity3d.com,2011:
--- !u!114 &11400000
MonoBehaviour:
  m_ObjectHideFlags: 0
  m_CorrespondingSourceObject: {fileID: 0}
  m_PrefabInstance: {fileID: 0}
  m_PrefabAsset: {fileID: 0}
  m_GameObject: {fileID: 0}
  m_Enabled: 1
  m_EditorHideFlags: 0
  m_Script: {fileID: 11500000, guid: 182eb47472f64de388dd50183c0411d8, type: 3}
  m_Name: SO_Infocard_134088
  m_EditorClassIdentifier: 
  <Key>k__BackingField: 134088
  <Value>k__BackingField: 'This planet''s oceans and landmasses are lifeless. At
    first we believed this would be a detriment to tourist activities, but it actually
    works out quite well; no bothersome insects or man-eating carnivores. Just human
    beings and the animals they wish to bring here. <br><nbsp><br>


'
