%YAML 1.1
%TAG !u! tag:unity3d.com,2011:
--- !u!114 &11400000
MonoBehaviour:
  m_ObjectHideFlags: 0
  m_CorrespondingSourceObject: {fileID: 0}
  m_PrefabInstance: {fileID: 0}
  m_PrefabAsset: {fileID: 0}
  m_GameObject: {fileID: 0}
  m_Enabled: 1
  m_EditorHideFlags: 0
  m_Script: {fileID: 11500000, guid: 182eb47472f64de388dd50183c0411d8, type: 3}
  m_Name: SO_Infocard_132312
  m_EditorClassIdentifier: 
  <Key>k__BackingField: 132312
  <Value>k__BackingField: 'Those Gaians had the gall to attack this base the other
    day. I guess they were going for storage depots. Too many police and Bounty Hunters
    around. They chased them off pretty quick. A few Corsairs approached as the Hunters
    were mopping up, but decided againt attacking when their sensors picked up the
    two police patrols. Guess even they have their limits. <br>


'
