%YAML 1.1
%TAG !u! tag:unity3d.com,2011:
--- !u!114 &11400000
MonoBehaviour:
  m_ObjectHideFlags: 0
  m_CorrespondingSourceObject: {fileID: 0}
  m_PrefabInstance: {fileID: 0}
  m_PrefabAsset: {fileID: 0}
  m_GameObject: {fileID: 0}
  m_Enabled: 1
  m_EditorHideFlags: 0
  m_Script: {fileID: 11500000, guid: 182eb47472f64de388dd50183c0411d8, type: 3}
  m_Name: SO_Infocard_131906
  m_EditorClassIdentifier: 
  <Key>k__BackingField: 131906
  <Value>k__BackingField: 'We think there''s an illegal access route from Cortez
    into the Tahoe Cloud somewhere, but that''s not our problem. I won''t set foot
    off the Trade Lane in that area. <br>


'
