%YAML 1.1
%TAG !u! tag:unity3d.com,2011:
--- !u!114 &11400000
MonoBehaviour:
  m_ObjectHideFlags: 0
  m_CorrespondingSourceObject: {fileID: 0}
  m_PrefabInstance: {fileID: 0}
  m_PrefabAsset: {fileID: 0}
  m_GameObject: {fileID: 0}
  m_Enabled: 1
  m_EditorHideFlags: 0
  m_Script: {fileID: 11500000, guid: 182eb47472f64de388dd50183c0411d8, type: 3}
  m_Name: SO_Infocard_500791
  m_EditorClassIdentifier: 
  <Key>k__BackingField: 500791
  <Value>k__BackingField: " <br><b><p align=\"center\">Stats<br></b><p align=\"left\">
    <br>Gun/Turret Mounts: 0/10<br>Base Armor: 3992000<br>Explosion Resistance: 50%<br>Cargo
    Space: 1200<br>Power Output: 105000/2775000<br>Thruster Energy: 200000/1500000<br>Batteries/NanoBots:
    3500/0<br>Equipment Mounts: CM CD <br> <br><b><p align=\"center\">Maneuverability<br></b><p
    align=\"left\"> <br>Max Turn Rate: 10.78\xB0<br>Time to Max Turn: 4.66s<br>Time
    to turn 180\xB0: 17.37s<br>Maximum Strafe Speed: 31.25m/s<br>Distance Strafed
    in 2s: 16.35m<br>\n\n"
