%YAML 1.1
%TAG !u! tag:unity3d.com,2011:
--- !u!114 &11400000
MonoBehaviour:
  m_ObjectHideFlags: 0
  m_CorrespondingSourceObject: {fileID: 0}
  m_PrefabInstance: {fileID: 0}
  m_PrefabAsset: {fileID: 0}
  m_GameObject: {fileID: 0}
  m_Enabled: 1
  m_EditorHideFlags: 0
  m_Script: {fileID: 11500000, guid: 182eb47472f64de388dd50183c0411d8, type: 3}
  m_Name: SO_Infocard_131854
  m_EditorClassIdentifier: 
  <Key>k__BackingField: 131854
  <Value>k__BackingField: 'Bowex will tell you that we don''t have the experience
    or expertise to be prominent shippers of Bretonian Commodities. But the truth
    is they realize what a threat we are to their firm. We do the same business they
    do, but for less. <br>


'
