%YAML 1.1
%TAG !u! tag:unity3d.com,2011:
--- !u!114 &11400000
MonoBehaviour:
  m_ObjectHideFlags: 0
  m_CorrespondingSourceObject: {fileID: 0}
  m_PrefabInstance: {fileID: 0}
  m_PrefabAsset: {fileID: 0}
  m_GameObject: {fileID: 0}
  m_Enabled: 1
  m_EditorHideFlags: 0
  m_Script: {fileID: 11500000, guid: 182eb47472f64de388dd50183c0411d8, type: 3}
  m_Name: SO_Infocard_132935
  m_EditorClassIdentifier: 
  <Key>k__BackingField: 132935
  <Value>k__BackingField: 'Even though this is a short run, the Blood Dragons are
    always waiting. You never know when they will hit next. Sometimes I think I should
    change companies to Kishiro, although that would be disgraceful to my employer.
    At least Kishiro captains don''t have to worry so much about pirates.<br>


'
