%YAML 1.1
%TAG !u! tag:unity3d.com,2011:
--- !u!114 &11400000
MonoBehaviour:
  m_ObjectHideFlags: 0
  m_CorrespondingSourceObject: {fileID: 0}
  m_PrefabInstance: {fileID: 0}
  m_PrefabAsset: {fileID: 0}
  m_GameObject: {fileID: 0}
  m_Enabled: 1
  m_EditorHideFlags: 0
  m_Script: {fileID: 11500000, guid: 182eb47472f64de388dd50183c0411d8, type: 3}
  m_Name: SO_Infocard_465701
  m_EditorClassIdentifier: 
  <Key>k__BackingField: 465701
  <Value>k__BackingField: '<b>BRETONIA<br><nbsp><br><b><u>Settled Planets<br><TRA
    data="65280" mask="-27" def="31"/>-- ERROR --<br><TRA data="96" mask="-27" def="-1"/><nbsp><br><TRA
    data="101" mask="-27" def="-6"/>Bases<br><TRA data="65280" mask="-27" def="31"/>--
    ERROR --<br><TRA data="96" mask="-27" def="-1"/><nbsp><br><TRA data="101" mask="-27"
    def="-6"/>Corporations<br><TRA data="65280" mask="-27" def="31"/>-- ERROR --<br><TRA
    data="96" mask="-27" def="-1"/><nbsp><br><TRA data="101" mask="-27" def="-6"/>Criminals<br><TRA
    data="65280" mask="-27" def="31"/>-- ERROR --<br><TRA data="96" mask="-27" def="-1"/><nbsp><br><TRA
    data="101" mask="-27" def="-6"/>Produces<br><TRA data="65280" mask="-27" def="31"/>--
    ERROR --<br>


'
