%YAML 1.1
%TAG !u! tag:unity3d.com,2011:
--- !u!114 &11400000
MonoBehaviour:
  m_ObjectHideFlags: 0
  m_CorrespondingSourceObject: {fileID: 0}
  m_PrefabInstance: {fileID: 0}
  m_PrefabAsset: {fileID: 0}
  m_GameObject: {fileID: 0}
  m_Enabled: 1
  m_EditorHideFlags: 0
  m_Script: {fileID: 11500000, guid: 182eb47472f64de388dd50183c0411d8, type: 3}
  m_Name: SO_Infocard_525361
  m_EditorClassIdentifier: 
  <Key>k__BackingField: 525361
  <Value>k__BackingField: 'We built this base in 784 AS, using materials hijacked
    from BMM and Bowex transports. At the time Belfast was still in operation, and
    the lane between it and Scarborough often had shipments going without escort,
    thinking the short trip wasn''t worth scrambling fighters for. It''s not a big
    station, but it suits our needs. <br>


'
