%YAML 1.1
%TAG !u! tag:unity3d.com,2011:
--- !u!114 &11400000
MonoBehaviour:
  m_ObjectHideFlags: 0
  m_CorrespondingSourceObject: {fileID: 0}
  m_PrefabInstance: {fileID: 0}
  m_PrefabAsset: {fileID: 0}
  m_GameObject: {fileID: 0}
  m_Enabled: 1
  m_EditorHideFlags: 0
  m_Script: {fileID: 11500000, guid: 182eb47472f64de388dd50183c0411d8, type: 3}
  m_Name: SO_Infocard_488240
  m_EditorClassIdentifier: 
  <Key>k__BackingField: 488240
  <Value>k__BackingField: 'We get our H-Fuel shipped up from Dawson Base. The Junkers
    in Texas give us a bit of a problem, but it''s nothing that a little firepower
    and hellraising over the comms can''t handle. Junkers can be depended on for
    one thing: to run away from a screaming Xeno. <br>


'
