%YAML 1.1
%TAG !u! tag:unity3d.com,2011:
--- !u!114 &11400000
MonoBehaviour:
  m_ObjectHideFlags: 0
  m_CorrespondingSourceObject: {fileID: 0}
  m_PrefabInstance: {fileID: 0}
  m_PrefabAsset: {fileID: 0}
  m_GameObject: {fileID: 0}
  m_Enabled: 1
  m_EditorHideFlags: 0
  m_Script: {fileID: 11500000, guid: 182eb47472f64de388dd50183c0411d8, type: 3}
  m_Name: SO_Infocard_486417
  m_EditorClassIdentifier: 
  <Key>k__BackingField: 486417
  <Value>k__BackingField: 'Do you still think to fight them? Know this, you stand
    at very doorstep into their homeworlds, the very heart their of existence. What
    you have seen here is just a beginning. Beyond this place there is much more
    you cannot possibly imagine. If the thoughts to keep up the fight still linger
    your mind I would adivse you to turn away and flee while you still can. We cherish
    hospitality here but ask the same in return. Embrace your destiny, the very one
    that has led you to this place, stay and learn to become a part of ours and their
    union. Make no mistake, a chance can be offered once in a lifetime.


'
