%YAML 1.1
%TAG !u! tag:unity3d.com,2011:
--- !u!114 &11400000
MonoBehaviour:
  m_ObjectHideFlags: 0
  m_CorrespondingSourceObject: {fileID: 0}
  m_PrefabInstance: {fileID: 0}
  m_PrefabAsset: {fileID: 0}
  m_GameObject: {fileID: 0}
  m_Enabled: 1
  m_EditorHideFlags: 0
  m_Script: {fileID: 11500000, guid: 182eb47472f64de388dd50183c0411d8, type: 3}
  m_Name: SO_Infocard_500072
  m_EditorClassIdentifier: 
  <Key>k__BackingField: 500072
  <Value>k__BackingField: " <br><b><p align=\"center\">Stats<br></b><p align=\"left\">
    <br>Gun/Turret Mounts: 0/3<br>Base Armor: 63480<br>Cargo Space: 350<br>Power
    Output: 2000/15000<br>Thruster Energy: 100/1000<br>Batteries/NanoBots: 480/480<br>Equipment
    Mounts: <br> <br><b><p align=\"center\">Maneuverability<br></b><p align=\"left\">
    <br>Max Turn Rate: 20.72\xB0<br>Time to Max Turn: 3.4s<br>Time to turn 180\xB0:
    9.18s<br>Maximum Strafe Speed: 25m/s<br>Distance Strafed in 0.5s: 5.61m<br>\n\n"
