%YAML 1.1
%TAG !u! tag:unity3d.com,2011:
--- !u!114 &11400000
MonoBehaviour:
  m_ObjectHideFlags: 0
  m_CorrespondingSourceObject: {fileID: 0}
  m_PrefabInstance: {fileID: 0}
  m_PrefabAsset: {fileID: 0}
  m_GameObject: {fileID: 0}
  m_Enabled: 1
  m_EditorHideFlags: 0
  m_Script: {fileID: 11500000, guid: 182eb47472f64de388dd50183c0411d8, type: 3}
  m_Name: SO_Infocard_133636
  m_EditorClassIdentifier: 
  <Key>k__BackingField: 133636
  <Value>k__BackingField: 'All the garbage comes pouring out of the Jump Hole in
    the Coombe Field. If you patrol that area, you will encounter both Corsairs and
    Hessians. It''s a rough and tumble area; they kill each other a lot down below.
    The ones that survive make their way to the Lanes and attack shipping convoys.
    <br>


'
