%YAML 1.1
%TAG !u! tag:unity3d.com,2011:
--- !u!114 &11400000
MonoBehaviour:
  m_ObjectHideFlags: 0
  m_CorrespondingSourceObject: {fileID: 0}
  m_PrefabInstance: {fileID: 0}
  m_PrefabAsset: {fileID: 0}
  m_GameObject: {fileID: 0}
  m_Enabled: 1
  m_EditorHideFlags: 0
  m_Script: {fileID: 11500000, guid: 182eb47472f64de388dd50183c0411d8, type: 3}
  m_Name: SO_Infocard_488227
  m_EditorClassIdentifier: 
  <Key>k__BackingField: 488227
  <Value>k__BackingField: 'If you need to hop over to Allentown, the Junkers are
    always eager to buy some H-Fuel off of us. That''s basically the way the relationship
    goes between our factions. We steal it, they buy it, then they sell it back to
    the fool we stole it from. Everybody profits. Well, everybody important, I mean.
    <br>


'
