%YAML 1.1
%TAG !u! tag:unity3d.com,2011:
--- !u!114 &11400000
MonoBehaviour:
  m_ObjectHideFlags: 0
  m_CorrespondingSourceObject: {fileID: 0}
  m_PrefabInstance: {fileID: 0}
  m_PrefabAsset: {fileID: 0}
  m_GameObject: {fileID: 0}
  m_Enabled: 1
  m_EditorHideFlags: 0
  m_Script: {fileID: 11500000, guid: 182eb47472f64de388dd50183c0411d8, type: 3}
  m_Name: SO_Infocard_488222
  m_EditorClassIdentifier: 
  <Key>k__BackingField: 488222
  <Value>k__BackingField: 'I wasn''t always a Rogue, you know. I started out a Boron
    miner on Pittsburgh. But I lucked out one day and punched a LPI Captain in the
    nose in a bar brawl, and ended up on Sugarland with the best crew of real men
    I''ve ever met. Yep, they was Rogues through and through, and I''ve been one
    ever since. Sure, I get called criminal, fiend, murderer and so forth by the
    so-called polite society in Liberty. But the one thing they don''t call a Rogue
    is sissy. Not to his face and live they don''t. Oh, and that cop got what was
    coming once I got out. <br>


'
