%YAML 1.1
%TAG !u! tag:unity3d.com,2011:
--- !u!114 &11400000
MonoBehaviour:
  m_ObjectHideFlags: 0
  m_CorrespondingSourceObject: {fileID: 0}
  m_PrefabInstance: {fileID: 0}
  m_PrefabAsset: {fileID: 0}
  m_GameObject: {fileID: 0}
  m_Enabled: 1
  m_EditorHideFlags: 0
  m_Script: {fileID: 11500000, guid: 182eb47472f64de388dd50183c0411d8, type: 3}
  m_Name: SO_Infocard_468755
  m_EditorClassIdentifier: 
  <Key>k__BackingField: 468755
  <Value>k__BackingField: 'Have you seen Rhodes, the Interspace rep for this area?
    What kind of halfwit wears shades indoors? Doesn''t help that he''s about as
    abrasive as sandpaper in a birthing canal. You''d think Interspace would have
    worked out why his deals keep collapsing by now. Perhaps that''s why they''ve
    marooned him on Nottingham. <br>


'
