%YAML 1.1
%TAG !u! tag:unity3d.com,2011:
--- !u!114 &11400000
MonoBehaviour:
  m_ObjectHideFlags: 0
  m_CorrespondingSourceObject: {fileID: 0}
  m_PrefabInstance: {fileID: 0}
  m_PrefabAsset: {fileID: 0}
  m_GameObject: {fileID: 0}
  m_Enabled: 1
  m_EditorHideFlags: 0
  m_Script: {fileID: 11500000, guid: 182eb47472f64de388dd50183c0411d8, type: 3}
  m_Name: SO_Infocard_133364
  m_EditorClassIdentifier: 
  <Key>k__BackingField: 133364
  <Value>k__BackingField: 'It would have been virtually impossible to build the other
    end of this jump gate in Chugoku. It would have taken months to transport supplies
    and run the battleship cross the gap, and we would have been very close to the
    Chugoku base while attempting to construct the Gate. I am grateful that we found
    a better use for this project.<br>


'
