%YAML 1.1
%TAG !u! tag:unity3d.com,2011:
--- !u!114 &11400000
MonoBehaviour:
  m_ObjectHideFlags: 0
  m_CorrespondingSourceObject: {fileID: 0}
  m_PrefabInstance: {fileID: 0}
  m_PrefabAsset: {fileID: 0}
  m_GameObject: {fileID: 0}
  m_Enabled: 1
  m_EditorHideFlags: 0
  m_Script: {fileID: 11500000, guid: 182eb47472f64de388dd50183c0411d8, type: 3}
  m_Name: SO_Infocard_503720
  m_EditorClassIdentifier: 
  <Key>k__BackingField: 503720
  <Value>k__BackingField: '<b>ALLIES:<nbsp> <br></b>LPI, Liberty Navy, LSF, Liberty
    Corporations <br><b><nbsp><br>ENEMIES: <br></b>Outcasts, Criminals<br><nbsp><br>Cryer
    Pharmaceuticals is headquartered in Liberty and markets a wide array of both
    commercially available and restricted-class drugs.<br>


'
