%YAML 1.1
%TAG !u! tag:unity3d.com,2011:
--- !u!114 &11400000
MonoBehaviour:
  m_ObjectHideFlags: 0
  m_CorrespondingSourceObject: {fileID: 0}
  m_PrefabInstance: {fileID: 0}
  m_PrefabAsset: {fileID: 0}
  m_GameObject: {fileID: 0}
  m_Enabled: 1
  m_EditorHideFlags: 0
  m_Script: {fileID: 11500000, guid: 182eb47472f64de388dd50183c0411d8, type: 3}
  m_Name: SO_Infocard_132114
  m_EditorClassIdentifier: 
  <Key>k__BackingField: 132114
  <Value>k__BackingField: 'One of my ancestors was on guard duty aboard the Dallas
    on that fateful day. He and everyone else onboard was killed instantly. The ironic
    part was that the naval commander had recommended the ship be moved to a safe
    distance from the experimental Jump Gate, so the test didn''t begin until they
    had repositioned the Dallas to twice the normal distance. <br><nbsp><br>


'
