%YAML 1.1
%TAG !u! tag:unity3d.com,2011:
--- !u!114 &11400000
MonoBehaviour:
  m_ObjectHideFlags: 0
  m_CorrespondingSourceObject: {fileID: 0}
  m_PrefabInstance: {fileID: 0}
  m_PrefabAsset: {fileID: 0}
  m_GameObject: {fileID: 0}
  m_Enabled: 1
  m_EditorHideFlags: 0
  m_Script: {fileID: 11500000, guid: 182eb47472f64de388dd50183c0411d8, type: 3}
  m_Name: SO_Infocard_132717
  m_EditorClassIdentifier: 
  <Key>k__BackingField: 132717
  <Value>k__BackingField: 'IDF brings Manifolds from Languedoc down here to exchange
    for Sirian goods like Synth Paste. Gallic Junkers make the Manifolds, but aren''t
    liked too much deeper in Sirius because of our history of spying on the other
    Houses. Zoners don''t seem to care too much here, I guess they always assumed
    that Junkers are untrustworthy spies for someone, somewhere. That or they just
    plain do not care. <br>


'
