%YAML 1.1
%TAG !u! tag:unity3d.com,2011:
--- !u!114 &11400000
MonoBehaviour:
  m_ObjectHideFlags: 0
  m_CorrespondingSourceObject: {fileID: 0}
  m_PrefabInstance: {fileID: 0}
  m_PrefabAsset: {fileID: 0}
  m_GameObject: {fileID: 0}
  m_Enabled: 1
  m_EditorHideFlags: 0
  m_Script: {fileID: 11500000, guid: 182eb47472f64de388dd50183c0411d8, type: 3}
  m_Name: SO_Infocard_132672
  m_EditorClassIdentifier: 
  <Key>k__BackingField: 132672
  <Value>k__BackingField: 'The inmates aboard this ship are considered so dangerous
    that all guards have the right to shoot and kill any prisoner at any time. That
    may seem somewhat brutal, but it is necessary to maintain order among so many
    violent felons. It also helps keep the guards alive. Despite that rule, we don''t
    need to exercise deadly violence that often. Once a week at most, which considering
    the lot that is incarcerated here, isn''t much. <br>


'
