%YAML 1.1
%TAG !u! tag:unity3d.com,2011:
--- !u!114 &11400000
MonoBehaviour:
  m_ObjectHideFlags: 0
  m_CorrespondingSourceObject: {fileID: 0}
  m_PrefabInstance: {fileID: 0}
  m_PrefabAsset: {fileID: 0}
  m_GameObject: {fileID: 0}
  m_Enabled: 1
  m_EditorHideFlags: 0
  m_Script: {fileID: 11500000, guid: 182eb47472f64de388dd50183c0411d8, type: 3}
  m_Name: SO_Infocard_133890
  m_EditorClassIdentifier: 
  <Key>k__BackingField: 133890
  <Value>k__BackingField: 'Vierlande doesn''t produce that many ex-cons who could
    become Bounty Hunters, for the simple reason that most sentences are for life.
    Personally, sounds a little harsh to me. They don''t even put them to work, like
    the LPI. It''s a pretty grim place. <br><nbsp><br>


'
