%YAML 1.1
%TAG !u! tag:unity3d.com,2011:
--- !u!114 &11400000
MonoBehaviour:
  m_ObjectHideFlags: 0
  m_CorrespondingSourceObject: {fileID: 0}
  m_PrefabInstance: {fileID: 0}
  m_PrefabAsset: {fileID: 0}
  m_GameObject: {fileID: 0}
  m_Enabled: 1
  m_EditorHideFlags: 0
  m_Script: {fileID: 11500000, guid: 182eb47472f64de388dd50183c0411d8, type: 3}
  m_Name: SO_Infocard_469363
  m_EditorClassIdentifier: 
  <Key>k__BackingField: 469363
  <Value>k__BackingField: 'I fought during the battle for Leipzig, and let me tell
    you, I''ve barely made it out alive. The heroic story of a massive Military defeat
    that the higher-ups are preaching is full of crap, but you haven''t heard that
    from me, got it?<br>


'
