%YAML 1.1
%TAG !u! tag:unity3d.com,2011:
--- !u!114 &11400000
MonoBehaviour:
  m_ObjectHideFlags: 0
  m_CorrespondingSourceObject: {fileID: 0}
  m_PrefabInstance: {fileID: 0}
  m_PrefabAsset: {fileID: 0}
  m_GameObject: {fileID: 0}
  m_Enabled: 1
  m_EditorHideFlags: 0
  m_Script: {fileID: 11500000, guid: 182eb47472f64de388dd50183c0411d8, type: 3}
  m_Name: SO_Infocard_470215
  m_EditorClassIdentifier: 
  <Key>k__BackingField: 470215
  <Value>k__BackingField: 'While IMG shipyards usually accept commissions by other
    factions, Singapore doesn''t get many of those. The occasional Freelancer or
    Zoner may stop by, but the remote location of this yard doesn''t make it easily
    available to people. The kind of folk that do come here for a commission usually
    don''t want the authorities to know about it. I don''t like it, but that''s how
    it works out in the Borderworlds. <br>


'
