%YAML 1.1
%TAG !u! tag:unity3d.com,2011:
--- !u!114 &11400000
MonoBehaviour:
  m_ObjectHideFlags: 0
  m_CorrespondingSourceObject: {fileID: 0}
  m_PrefabInstance: {fileID: 0}
  m_PrefabAsset: {fileID: 0}
  m_GameObject: {fileID: 0}
  m_Enabled: 1
  m_EditorHideFlags: 0
  m_Script: {fileID: 11500000, guid: 182eb47472f64de388dd50183c0411d8, type: 3}
  m_Name: SO_Infocard_460943
  m_EditorClassIdentifier: 
  <Key>k__BackingField: 460943
  <Value>k__BackingField: 'I almost lost hope for this system, and for the Gaian
    cause itself. Was nearly ready to take my Falcon out and make my way to the Crons
    to live with the Zoners. But with the Enclave extinct and Edinburgh a little
    closer to what it was before the war, there is hope.<br>


'
