%YAML 1.1
%TAG !u! tag:unity3d.com,2011:
--- !u!114 &11400000
MonoBehaviour:
  m_ObjectHideFlags: 0
  m_CorrespondingSourceObject: {fileID: 0}
  m_PrefabInstance: {fileID: 0}
  m_PrefabAsset: {fileID: 0}
  m_GameObject: {fileID: 0}
  m_Enabled: 1
  m_EditorHideFlags: 0
  m_Script: {fileID: 11500000, guid: 182eb47472f64de388dd50183c0411d8, type: 3}
  m_Name: SO_Infocard_133369
  m_EditorClassIdentifier: 
  <Key>k__BackingField: 133369
  <Value>k__BackingField: 'Welcome to the end of the universe. You probably need
    a drink, and an anti-rad pill after crossing the Gap. The Kyofu makes life difficult
    here, because you can''t just hop back to Tokyo to take your leave. They prefer
    to minimize exposure to once every two months for anyone posted here. <br>


'
