%YAML 1.1
%TAG !u! tag:unity3d.com,2011:
--- !u!114 &11400000
MonoBehaviour:
  m_ObjectHideFlags: 0
  m_CorrespondingSourceObject: {fileID: 0}
  m_PrefabInstance: {fileID: 0}
  m_PrefabAsset: {fileID: 0}
  m_GameObject: {fileID: 0}
  m_Enabled: 1
  m_EditorHideFlags: 0
  m_Script: {fileID: 11500000, guid: 77745e53922c405d884b74e75f714afa, type: 3}
  m_Name: "SO_Npc_Rheinl\xE4ndischeGro\xDFspeditionRep.StefanGeist"
  m_EditorClassIdentifier: 
  serializationData:
    SerializedFormat: 2
    SerializedBytes: 
    ReferencedUnityObjects:
    - {fileID: 11400000, guid: fd69c27c8305a4bf5b6d9e17d4ec456b, type: 2}
    - {fileID: 11400000, guid: bbc61056e8d744b6e890700e924685a9, type: 2}
    - {fileID: 11400000, guid: 68290904865fd48c2bb4b37d37aa6993, type: 2}
    - {fileID: 11400000, guid: 884afafad8d054c2591d75c38481c053, type: 2}
    - {fileID: 11400000, guid: bccc9e8e8a87c4d189f0981cb0abe6f5, type: 2}
    - {fileID: 11400000, guid: 6f829989832ac4534b50e48eeb69e9d4, type: 2}
    - {fileID: 11400000, guid: e2d02feb51fd8486e8902c199e24198b, type: 2}
    - {fileID: 11400000, guid: e0759d60917fc4a1c81a5000dc7eb336, type: 2}
    - {fileID: 11400000, guid: 7f2373c489ffc4ecb95c2b132d15805f, type: 2}
    - {fileID: 11400000, guid: b6335a8e4c4f64d13bd891ca4a15da33, type: 2}
    - {fileID: 11400000, guid: 0cd2e3f067cfe43da800efdf797455b0, type: 2}
    - {fileID: 11400000, guid: 139beedbd9cfd40c6a2a366ea2006fff, type: 2}
    - {fileID: 11400000, guid: 877399e284ff545ae9889a2efc043da0, type: 2}
    SerializedBytesString: 
    Prefab: {fileID: 0}
    PrefabModificationsReferencedUnityObjects: []
    PrefabModifications: []
    SerializationNodes:
    - Name: <Name>k__BackingField
      Entry: 10
      Data: 0
    - Name: <Base>k__BackingField
      Entry: 10
      Data: 1
    - Name: <Affiliation>k__BackingField
      Entry: 10
      Data: 2
    - Name: <Bribes>k__BackingField
      Entry: 7
      Data: 0|System.Collections.Generic.Dictionary`2[[FreelancerDataTool.Interfaces.IFaction,
        Assembly-CSharp],[System.Int32, mscorlib]], mscorlib
    - Name: comparer
      Entry: 7
      Data: 1|System.Collections.Generic.ObjectEqualityComparer`1[[FreelancerDataTool.Interfaces.IFaction,
        Assembly-CSharp]], mscorlib
    - Name: 
      Entry: 8
      Data: 
    - Name: 
      Entry: 12
      Data: 0
    - Name: 
      Entry: 13
      Data: 
    - Name: 
      Entry: 8
      Data: 
    - Name: <Rumors>k__BackingField
      Entry: 7
      Data: 2|System.Collections.Generic.List`1[[FreelancerDataTool.Interfaces.IInfocard,
        Assembly-CSharp]], mscorlib
    - Name: 
      Entry: 12
      Data: 10
    - Name: 
      Entry: 10
      Data: 3
    - Name: 
      Entry: 10
      Data: 4
    - Name: 
      Entry: 10
      Data: 5
    - Name: 
      Entry: 10
      Data: 6
    - Name: 
      Entry: 10
      Data: 7
    - Name: 
      Entry: 10
      Data: 8
    - Name: 
      Entry: 10
      Data: 9
    - Name: 
      Entry: 10
      Data: 10
    - Name: 
      Entry: 10
      Data: 11
    - Name: 
      Entry: 10
      Data: 12
    - Name: 
      Entry: 13
      Data: 
    - Name: 
      Entry: 8
      Data: 
  <Nickname>k__BackingField: rh0303_republican_002_m
  <Room>k__BackingField: bar
