%YAML 1.1
%TAG !u! tag:unity3d.com,2011:
--- !u!114 &11400000
MonoBehaviour:
  m_ObjectHideFlags: 0
  m_CorrespondingSourceObject: {fileID: 0}
  m_PrefabInstance: {fileID: 0}
  m_PrefabAsset: {fileID: 0}
  m_GameObject: {fileID: 0}
  m_Enabled: 1
  m_EditorHideFlags: 0
  m_Script: {fileID: 11500000, guid: 77745e53922c405d884b74e75f714afa, type: 3}
  m_Name: SO_Npc_InterspaceCommerceRep.CynthiaWilliams
  m_EditorClassIdentifier: 
  serializationData:
    SerializedFormat: 2
    SerializedBytes: 
    ReferencedUnityObjects:
    - {fileID: 11400000, guid: 3a57837b761bf4f2db235e3b773f7c3b, type: 2}
    - {fileID: 11400000, guid: 8c971538c5d2448a9acec55ab4600529, type: 2}
    - {fileID: 11400000, guid: 2a4aa9edecc634ccca403dbb9cd658c9, type: 2}
    - {fileID: 11400000, guid: fea24e0b5713340219dd4d6271d54d68, type: 2}
    - {fileID: 11400000, guid: a9026df9e955646979c84e957b402b7e, type: 2}
    - {fileID: 11400000, guid: e077697459ac3413fb3fc02200bd0a7a, type: 2}
    - {fileID: 11400000, guid: fcc960ea44dca42279546aeda9341ec1, type: 2}
    - {fileID: 11400000, guid: 5fc4465f85956493896a0443419259ed, type: 2}
    - {fileID: 11400000, guid: 9a132a43f837340e9b25e81d735923a0, type: 2}
    - {fileID: 11400000, guid: e9116fe4ec90f46e18db8b2c373e2f03, type: 2}
    - {fileID: 11400000, guid: 9dfb252e0cbda414f8e5e90d27f6d18f, type: 2}
    - {fileID: 11400000, guid: e9cff200b15c144039553a7638f9dde1, type: 2}
    SerializedBytesString: 
    Prefab: {fileID: 0}
    PrefabModificationsReferencedUnityObjects: []
    PrefabModifications: []
    SerializationNodes:
    - Name: <Name>k__BackingField
      Entry: 10
      Data: 0
    - Name: <Base>k__BackingField
      Entry: 10
      Data: 1
    - Name: <Affiliation>k__BackingField
      Entry: 10
      Data: 2
    - Name: <Bribes>k__BackingField
      Entry: 7
      Data: 0|System.Collections.Generic.Dictionary`2[[FreelancerDataTool.Interfaces.IFaction,
        Assembly-CSharp],[System.Int32, mscorlib]], mscorlib
    - Name: comparer
      Entry: 7
      Data: 1|System.Collections.Generic.ObjectEqualityComparer`1[[FreelancerDataTool.Interfaces.IFaction,
        Assembly-CSharp]], mscorlib
    - Name: 
      Entry: 8
      Data: 
    - Name: 
      Entry: 12
      Data: 0
    - Name: 
      Entry: 13
      Data: 
    - Name: 
      Entry: 8
      Data: 
    - Name: <Rumors>k__BackingField
      Entry: 7
      Data: 2|System.Collections.Generic.List`1[[FreelancerDataTool.Interfaces.IInfocard,
        Assembly-CSharp]], mscorlib
    - Name: 
      Entry: 12
      Data: 9
    - Name: 
      Entry: 10
      Data: 3
    - Name: 
      Entry: 10
      Data: 4
    - Name: 
      Entry: 10
      Data: 5
    - Name: 
      Entry: 10
      Data: 6
    - Name: 
      Entry: 10
      Data: 7
    - Name: 
      Entry: 10
      Data: 8
    - Name: 
      Entry: 10
      Data: 9
    - Name: 
      Entry: 10
      Data: 10
    - Name: 
      Entry: 10
      Data: 11
    - Name: 
      Entry: 13
      Data: 
    - Name: 
      Entry: 8
      Data: 
  <Nickname>k__BackingField: ku0104_interspace_001_f
  <Room>k__BackingField: bar
