%YAML 1.1
%TAG !u! tag:unity3d.com,2011:
--- !u!114 &11400000
MonoBehaviour:
  m_ObjectHideFlags: 0
  m_CorrespondingSourceObject: {fileID: 0}
  m_PrefabInstance: {fileID: 0}
  m_PrefabAsset: {fileID: 0}
  m_GameObject: {fileID: 0}
  m_Enabled: 1
  m_EditorHideFlags: 0
  m_Script: {fileID: 11500000, guid: 182eb47472f64de388dd50183c0411d8, type: 3}
  m_Name: SO_Infocard_468201
  m_EditorClassIdentifier: 
  <Key>k__BackingField: 468201
  <Value>k__BackingField: 'Yes, this sector is more dangerous then many others. A
    potential powderkeg, situated between Bretonia and the southern Omega Borderworlds.
    Many ships cross through here though. Bretonians, Bountyhunters, Freelancers,
    but also Corsairs, Mollies and Hessians. As long as people refrain from shooting
    each other around our bases, we''ll welcome anyone on Gran Canaria though. Our
    taverns and shops are open to all. <br>


'
