%YAML 1.1
%TAG !u! tag:unity3d.com,2011:
--- !u!114 &11400000
MonoBehaviour:
  m_ObjectHideFlags: 0
  m_CorrespondingSourceObject: {fileID: 0}
  m_PrefabInstance: {fileID: 0}
  m_PrefabAsset: {fileID: 0}
  m_GameObject: {fileID: 0}
  m_Enabled: 1
  m_EditorHideFlags: 0
  m_Script: {fileID: 11500000, guid: 182eb47472f64de388dd50183c0411d8, type: 3}
  m_Name: SO_Infocard_131151
  m_EditorClassIdentifier: 
  <Key>k__BackingField: 131151
  <Value>k__BackingField: 'Alcatraz ships Cardamine to Buffalo and Beaumont. I''d
    like to make that run myself one day, but I''m not good enough yet. The Outcasts
    tend to get angry when you blow one of their Cardamine loads.<br>


'
