%YAML 1.1
%TAG !u! tag:unity3d.com,2011:
--- !u!114 &11400000
MonoBehaviour:
  m_ObjectHideFlags: 0
  m_CorrespondingSourceObject: {fileID: 0}
  m_PrefabInstance: {fileID: 0}
  m_PrefabAsset: {fileID: 0}
  m_GameObject: {fileID: 0}
  m_Enabled: 1
  m_EditorHideFlags: 0
  m_Script: {fileID: 11500000, guid: 77745e53922c405d884b74e75f714afa, type: 3}
  m_Name: SO_Npc_KishiroTechnologiesFumioKajiwara
  m_EditorClassIdentifier: 
  serializationData:
    SerializedFormat: 2
    SerializedBytes: 
    ReferencedUnityObjects:
    - {fileID: 11400000, guid: e1ac0b9576385441b964eb4c646f3e5c, type: 2}
    - {fileID: 11400000, guid: bd3e4e60d55d64e7ca2f64dab42b169e, type: 2}
    - {fileID: 11400000, guid: 10449b69f19c24d90ad54ed9d60b7256, type: 2}
    - {fileID: 11400000, guid: 9f1b7e339767142fc910e585d59b49ad, type: 2}
    - {fileID: 11400000, guid: 3452df612d14f40e585b17ad4ba2738f, type: 2}
    - {fileID: 11400000, guid: c3c7ba8de3d394d3f9c38e71db1740b8, type: 2}
    - {fileID: 11400000, guid: c14b3116b9e9f4b9fa74037ff32a343b, type: 2}
    - {fileID: 11400000, guid: 8589dc8da7bce4b088fb2e4a167f37f0, type: 2}
    - {fileID: 11400000, guid: d45cbb7a91f1e4a6a993a3c362fafd41, type: 2}
    - {fileID: 11400000, guid: 5d6e02765b0e74f229310103edce2446, type: 2}
    SerializedBytesString: 
    Prefab: {fileID: 0}
    PrefabModificationsReferencedUnityObjects: []
    PrefabModifications: []
    SerializationNodes:
    - Name: <Name>k__BackingField
      Entry: 10
      Data: 0
    - Name: <Base>k__BackingField
      Entry: 10
      Data: 1
    - Name: <Affiliation>k__BackingField
      Entry: 10
      Data: 2
    - Name: <Bribes>k__BackingField
      Entry: 7
      Data: 0|System.Collections.Generic.Dictionary`2[[FreelancerDataTool.Interfaces.IFaction,
        Assembly-CSharp],[System.Int32, mscorlib]], mscorlib
    - Name: comparer
      Entry: 7
      Data: 1|System.Collections.Generic.ObjectEqualityComparer`1[[FreelancerDataTool.Interfaces.IFaction,
        Assembly-CSharp]], mscorlib
    - Name: 
      Entry: 8
      Data: 
    - Name: 
      Entry: 12
      Data: 0
    - Name: 
      Entry: 13
      Data: 
    - Name: 
      Entry: 8
      Data: 
    - Name: <Rumors>k__BackingField
      Entry: 7
      Data: 2|System.Collections.Generic.List`1[[FreelancerDataTool.Interfaces.IInfocard,
        Assembly-CSharp]], mscorlib
    - Name: 
      Entry: 12
      Data: 7
    - Name: 
      Entry: 10
      Data: 3
    - Name: 
      Entry: 10
      Data: 4
    - Name: 
      Entry: 10
      Data: 5
    - Name: 
      Entry: 10
      Data: 6
    - Name: 
      Entry: 10
      Data: 7
    - Name: 
      Entry: 10
      Data: 8
    - Name: 
      Entry: 10
      Data: 9
    - Name: 
      Entry: 13
      Data: 
    - Name: 
      Entry: 8
      Data: 
  <Nickname>k__BackingField: KU1301_kishiro_003_m
  <Room>k__BackingField: bar
