%YAML 1.1
%TAG !u! tag:unity3d.com,2011:
--- !u!114 &11400000
MonoBehaviour:
  m_ObjectHideFlags: 0
  m_CorrespondingSourceObject: {fileID: 0}
  m_PrefabInstance: {fileID: 0}
  m_PrefabAsset: {fileID: 0}
  m_GameObject: {fileID: 0}
  m_Enabled: 1
  m_EditorHideFlags: 0
  m_Script: {fileID: 11500000, guid: 182eb47472f64de388dd50183c0411d8, type: 3}
  m_Name: SO_Infocard_132404
  m_EditorClassIdentifier: 
  <Key>k__BackingField: 132404
  <Value>k__BackingField: 'So far, I''m not all that impressed with Gallia. They
    talk a lot about honor and justice, but when they attack they head straight for
    the weakest target, just like any bully. But what do I know, maybe they thought
    the Shetland was a state of the art battleship dressed up like a luxury liner,
    protecting a major military installation posing as an unspoiled planet. Or...maybe
    they''re just bullies. I heared the ship had to flee across the interstellar
    space without her cruise engines. Quite an extraordinary feat of flying in this
    day and age.  <br>


'
