%YAML 1.1
%TAG !u! tag:unity3d.com,2011:
--- !u!114 &11400000
MonoBehaviour:
  m_ObjectHideFlags: 0
  m_CorrespondingSourceObject: {fileID: 0}
  m_PrefabInstance: {fileID: 0}
  m_PrefabAsset: {fileID: 0}
  m_GameObject: {fileID: 0}
  m_Enabled: 1
  m_EditorHideFlags: 0
  m_Script: {fileID: 11500000, guid: 182eb47472f64de388dd50183c0411d8, type: 3}
  m_Name: SO_Infocard_133139
  m_EditorClassIdentifier: 
  <Key>k__BackingField: 133139
  <Value>k__BackingField: 'The toughest and bravest miners in all of Sirius work
    at the Falkland. Death looms over all of our heads every day, but we have a good
    hiding spot and the Niobium profits are incredible, so long as we can keep the
    Outcasts off our backs. <br>


'
