%YAML 1.1
%TAG !u! tag:unity3d.com,2011:
--- !u!114 &11400000
MonoBehaviour:
  m_ObjectHideFlags: 0
  m_CorrespondingSourceObject: {fileID: 0}
  m_PrefabInstance: {fileID: 0}
  m_PrefabAsset: {fileID: 0}
  m_GameObject: {fileID: 0}
  m_Enabled: 1
  m_EditorHideFlags: 0
  m_Script: {fileID: 11500000, guid: 182eb47472f64de388dd50183c0411d8, type: 3}
  m_Name: SO_Infocard_460941
  m_EditorClassIdentifier: 
  <Key>k__BackingField: 460941
  <Value>k__BackingField: 'Gallia did a number on the Bretonian people. Sure, they
    kept saying it''s the government they were after, and that line fooled some people.
    BMM, Bowex, Planetform and the Queen''s government are all corrupt to the core
    and that led some people to the Gauls. The Gauls were an unknown. But better
    the enemy you know.<br>


'
