%YAML 1.1
%TAG !u! tag:unity3d.com,2011:
--- !u!114 &11400000
MonoBehaviour:
  m_ObjectHideFlags: 0
  m_CorrespondingSourceObject: {fileID: 0}
  m_PrefabInstance: {fileID: 0}
  m_PrefabAsset: {fileID: 0}
  m_GameObject: {fileID: 0}
  m_Enabled: 1
  m_EditorHideFlags: 0
  m_Script: {fileID: 11500000, guid: 182eb47472f64de388dd50183c0411d8, type: 3}
  m_Name: SO_Infocard_471671
  m_EditorClassIdentifier: 
  <Key>k__BackingField: 471671
  <Value>k__BackingField: 'This ship is the most heavily armored and armed brick
    we have. It is not as agile as her sister ship, the Ayakashi, but makes up for
    it in firepower and endurance. It made sense to assign this ship to the defense
    of this region, and the nearby jump hole. Any Outcasts, Corsairs or Hogosha that
    try to sneak past quickly learn the meaning of "excessive firepower". <br>


'
