%YAML 1.1
%TAG !u! tag:unity3d.com,2011:
--- !u!114 &11400000
MonoBehaviour:
  m_ObjectHideFlags: 0
  m_CorrespondingSourceObject: {fileID: 0}
  m_PrefabInstance: {fileID: 0}
  m_PrefabAsset: {fileID: 0}
  m_GameObject: {fileID: 0}
  m_Enabled: 1
  m_EditorHideFlags: 0
  m_Script: {fileID: 11500000, guid: 182eb47472f64de388dd50183c0411d8, type: 3}
  m_Name: SO_Infocard_486422
  m_EditorClassIdentifier: 
  <Key>k__BackingField: 486422
  <Value>k__BackingField: 'Recognise the uniform then? Yeah that''s right, look around
    here, we all come from somewhere. I''m a Corsair, well; I guess I was a Corsair
    as much as anyone can change the nature of who and what they are. I found this
    place some time ago, but I guess just like you I didn''t know what I was looking
    for exactly. I just followed my senses and eventually found it, and to my suprise
    the people here you see.<br> <br>I flew missions out of Gamma and Cadiz, was
    posted to Yaren for a while, I even fought against the Nomads once or twice;
    my whole life was like that of any other Corsair: do your duty, and seek honour
    and glory for yourself and your people. Same thing everyone heard thousand times.
    But it never sat right with me, I always felt like there had to be something
    else, it just all seemed... a waste. Repeating in an endless cycle, locked in
    a single slid view point. I''d spent all my life taking things from other people,
    their ships, their money, husbands, and wives. Daughters, sons...<br> <br>And
    then what?<br> <br>...and then one day I started asking questions, instead of
    shooting first I asked who they were; and they told me, more than that, they
    showed me. To my surprise I saw not only that but most importantly the reflection
    of myself and where do I stand in this life. My whole life on the palm, my past,
    my present and the possible future had I not stopped for a moment to think. I
    shuddered. Never the truth was so... real. No lies, no fancy, just pure truth
    to realize what I was and what I might have been. Spent my whole life taking
    things and I discovered that is all the whole human race is doing: it''s taking
    from each other, killing, stealing, lying and stealing more. And then we stole
    this place too, this part of space - my friend, this is someone else''s home.
    But none of that happens here, none of that happens with them, they don''t kill
    each other, and they don''t steal from their own kind. Everything they do is
    for the benefit of their kind, for each one individually and everyone as a whole.
    I work for something else now too, something bigger than myself and something
    most Corsairs could never understand. If you have come this far you were looking
    for that something too - and they can show you, if you are willing to listen
    and ready to accept.


'
