%YAML 1.1
%TAG !u! tag:unity3d.com,2011:
--- !u!114 &11400000
MonoBehaviour:
  m_ObjectHideFlags: 0
  m_CorrespondingSourceObject: {fileID: 0}
  m_PrefabInstance: {fileID: 0}
  m_PrefabAsset: {fileID: 0}
  m_GameObject: {fileID: 0}
  m_Enabled: 1
  m_EditorHideFlags: 0
  m_Script: {fileID: 11500000, guid: 182eb47472f64de388dd50183c0411d8, type: 3}
  m_Name: SO_Infocard_488324
  m_EditorClassIdentifier: 
  <Key>k__BackingField: 488324
  <Value>k__BackingField: 'Pennsylvania has a few rare resources which foreigners
    come to pillage - mainly Neon and Basic Alloy. Those bastards would rather fill
    their own pockets then to build their factories here. That''s why we treat them
    to a healthy dose of Particle Cannon fire every now and then. Kill em all, until
    they stop coming. Xenos take no prisoners. <br>


'
