%YAML 1.1
%TAG !u! tag:unity3d.com,2011:
--- !u!114 &11400000
MonoBehaviour:
  m_ObjectHideFlags: 0
  m_CorrespondingSourceObject: {fileID: 0}
  m_PrefabInstance: {fileID: 0}
  m_PrefabAsset: {fileID: 0}
  m_GameObject: {fileID: 0}
  m_Enabled: 1
  m_EditorHideFlags: 0
  m_Script: {fileID: 11500000, guid: 182eb47472f64de388dd50183c0411d8, type: 3}
  m_Name: SO_Infocard_509234
  m_EditorClassIdentifier: 
  <Key>k__BackingField: 509234
  <Value>k__BackingField: 'Lock and load! I always get excited every time we bring
    in a new shipment of Light Arms from Calais. My men and I are reduced to school
    children visiting the local candy store. As long as weapons discipline is maintained,
    I let the men enjoy themselves with their new toys. I feel it is also important
    that the men give their frank opinions on any new weapons being trialed. Our
    lives may depend on it one day.<br>


'
