%YAML 1.1
%TAG !u! tag:unity3d.com,2011:
--- !u!114 &11400000
MonoBehaviour:
  m_ObjectHideFlags: 0
  m_CorrespondingSourceObject: {fileID: 0}
  m_PrefabInstance: {fileID: 0}
  m_PrefabAsset: {fileID: 0}
  m_GameObject: {fileID: 0}
  m_Enabled: 1
  m_EditorHideFlags: 0
  m_Script: {fileID: 11500000, guid: 182eb47472f64de388dd50183c0411d8, type: 3}
  m_Name: SO_Infocard_132790
  m_EditorClassIdentifier: 
  <Key>k__BackingField: 132790
  <Value>k__BackingField: 'This ship is lavishly furnished with works of art and
    the finest quality appointments. Orbital Spa and Cruise is dedicated to supplying
    our guests the finest that life has to offer. Luxury Goods are brought here all
    the way from Manhattan. More recently, the opening of the Gallic market has allowed
    us access to some fine Holo Sculptures as well. <br>


'
