%YAML 1.1
%TAG !u! tag:unity3d.com,2011:
--- !u!114 &11400000
MonoBehaviour:
  m_ObjectHideFlags: 0
  m_CorrespondingSourceObject: {fileID: 0}
  m_PrefabInstance: {fileID: 0}
  m_PrefabAsset: {fileID: 0}
  m_GameObject: {fileID: 0}
  m_Enabled: 1
  m_EditorHideFlags: 0
  m_Script: {fileID: 11500000, guid: 182eb47472f64de388dd50183c0411d8, type: 3}
  m_Name: SO_Infocard_514462
  m_EditorClassIdentifier: 
  <Key>k__BackingField: 514462
  <Value>k__BackingField: 'Torshavn is the closest thing the Gaian movement has to
    a functional shipyard. It''s not easy to work with the limited power and limited
    facilities we have on this base, but we make due. Construction materials are
    an even bigger problem, because the focus is on bringing in basic supplies first.
    <br>


'
