%YAML 1.1
%TAG !u! tag:unity3d.com,2011:
--- !u!114 &11400000
MonoBehaviour:
  m_ObjectHideFlags: 0
  m_CorrespondingSourceObject: {fileID: 0}
  m_PrefabInstance: {fileID: 0}
  m_PrefabAsset: {fileID: 0}
  m_GameObject: {fileID: 0}
  m_Enabled: 1
  m_EditorHideFlags: 0
  m_Script: {fileID: 11500000, guid: 182eb47472f64de388dd50183c0411d8, type: 3}
  m_Name: SO_Infocard_515103
  m_EditorClassIdentifier: 
  <Key>k__BackingField: 515103
  <Value>k__BackingField: 'You''ll meet a few Rogues and Outcasts around here. It''s
    not a good idea to be seen flying with them. However, if you stay close enough
    to track them and still stay off the scanners, you might be able to share in
    the profit when they hit big convoys.<br>


'
