%YAML 1.1
%TAG !u! tag:unity3d.com,2011:
--- !u!114 &11400000
MonoBehaviour:
  m_ObjectHideFlags: 0
  m_CorrespondingSourceObject: {fileID: 0}
  m_PrefabInstance: {fileID: 0}
  m_PrefabAsset: {fileID: 0}
  m_GameObject: {fileID: 0}
  m_Enabled: 1
  m_EditorHideFlags: 0
  m_Script: {fileID: 11500000, guid: 182eb47472f64de388dd50183c0411d8, type: 3}
  m_Name: SO_Infocard_488224
  m_EditorClassIdentifier: 
  <Key>k__BackingField: 488224
  <Value>k__BackingField: 'All these polite society types are always talkin'' down
    about us, but you know they''re the biggest crooks of all. We may rob with guns,
    but they rob with words on paper and backroom deals to benefit their brother-in-laws.
    They''re ain''t no more honest than we are. In fact, we''re more honest. That''s
    right. When a Rogue comes at ya, ya know just what ya gonna get. Ya gonna get
    voluntarily poorer or a close encounter with the wrong side of a view port. Now
    that''s honest, it is.<br>


'
