%YAML 1.1
%TAG !u! tag:unity3d.com,2011:
--- !u!114 &11400000
MonoBehaviour:
  m_ObjectHideFlags: 0
  m_CorrespondingSourceObject: {fileID: 0}
  m_PrefabInstance: {fileID: 0}
  m_PrefabAsset: {fileID: 0}
  m_GameObject: {fileID: 0}
  m_Enabled: 1
  m_EditorHideFlags: 0
  m_Script: {fileID: 11500000, guid: 182eb47472f64de388dd50183c0411d8, type: 3}
  m_Name: SO_Infocard_133368
  m_EditorClassIdentifier: 
  <Key>k__BackingField: 133368
  <Value>k__BackingField: 'Why do the Blood Dragons hate the government and Samura
    so much? They seem to tolerate Kishiro and the GMG. I''m just a soldier following
    orders. I want this war to end so that I can go home to Kyushu. Unfortunately,
    it seems like there will be no simple resolution to this conflict. I hope the
    new government can find a way forward, we are going nowhere sitting here in Hokkaido.<br>


'
