%YAML 1.1
%TAG !u! tag:unity3d.com,2011:
--- !u!114 &11400000
MonoBehaviour:
  m_ObjectHideFlags: 0
  m_CorrespondingSourceObject: {fileID: 0}
  m_PrefabInstance: {fileID: 0}
  m_PrefabAsset: {fileID: 0}
  m_GameObject: {fileID: 0}
  m_Enabled: 1
  m_EditorHideFlags: 0
  m_Script: {fileID: 11500000, guid: 182eb47472f64de388dd50183c0411d8, type: 3}
  m_Name: SO_Infocard_132246
  m_EditorClassIdentifier: 
  <Key>k__BackingField: 132246
  <Value>k__BackingField: 'Interspace doesn''t care much about what happens off of
    Trade Lanes or Jump Gates. That''s why Junkers and Hogosha never really register
    on their radar. They doesn''t see the obvious role the Junkers play in supplying
    and harboring criminals. <br>


'
