%YAML 1.1
%TAG !u! tag:unity3d.com,2011:
--- !u!114 &11400000
MonoBehaviour:
  m_ObjectHideFlags: 0
  m_CorrespondingSourceObject: {fileID: 0}
  m_PrefabInstance: {fileID: 0}
  m_PrefabAsset: {fileID: 0}
  m_GameObject: {fileID: 0}
  m_Enabled: 1
  m_EditorHideFlags: 0
  m_Script: {fileID: 11500000, guid: 182eb47472f64de388dd50183c0411d8, type: 3}
  m_Name: SO_Infocard_134102
  m_EditorClassIdentifier: 
  <Key>k__BackingField: 134102
  <Value>k__BackingField: 'Don''t be fooled; just because I work for a bankrupt government,
    that doesn''t mean I don''t have credits to spend. Several corporations always
    pay well for the authorities to turn a blind eye to certain actions. I don''t
    open my mouth when Synth Foods burns down one of the few remaining Rheinland
    plantation houses, and that''s how I make sure I''ll retire in style. <br><nbsp><br>


'
