%YAML 1.1
%TAG !u! tag:unity3d.com,2011:
--- !u!114 &11400000
MonoBehaviour:
  m_ObjectHideFlags: 0
  m_CorrespondingSourceObject: {fileID: 0}
  m_PrefabInstance: {fileID: 0}
  m_PrefabAsset: {fileID: 0}
  m_GameObject: {fileID: 0}
  m_Enabled: 1
  m_EditorHideFlags: 0
  m_Script: {fileID: 11500000, guid: 182eb47472f64de388dd50183c0411d8, type: 3}
  m_Name: SO_Infocard_133203
  m_EditorClassIdentifier: 
  <Key>k__BackingField: 133203
  <Value>k__BackingField: 'Head for the cloud south of here and you will find Artifacts,
    but that''s not why I go there. The cloud to the south hides the Jump Hole to
    Omicron Gamma. If you do go in there, get ready to fight or you''d better be
    good at hiding. No matter what you do, don''t stay in there too long, because
    it''s just a matter of time before your number gets punched. <br><nbsp><br>


'
