%YAML 1.1
%TAG !u! tag:unity3d.com,2011:
--- !u!114 &11400000
MonoBehaviour:
  m_ObjectHideFlags: 0
  m_CorrespondingSourceObject: {fileID: 0}
  m_PrefabInstance: {fileID: 0}
  m_PrefabAsset: {fileID: 0}
  m_GameObject: {fileID: 0}
  m_Enabled: 1
  m_EditorHideFlags: 0
  m_Script: {fileID: 11500000, guid: 182eb47472f64de388dd50183c0411d8, type: 3}
  m_Name: SO_Infocard_488314
  m_EditorClassIdentifier: 
  <Key>k__BackingField: 488314
  <Value>k__BackingField: 'Disgusting and decadent. That''s Liberty summed up in
    two words. It is also excessively wealthy. Cardamine allows us to siphon a lot
    of that wealth into our pockets, from both the Rogues and the addicts on Manhattan
    and Los Angeles. <br>


'
