%YAML 1.1
%TAG !u! tag:unity3d.com,2011:
--- !u!114 &11400000
MonoBehaviour:
  m_ObjectHideFlags: 0
  m_CorrespondingSourceObject: {fileID: 0}
  m_PrefabInstance: {fileID: 0}
  m_PrefabAsset: {fileID: 0}
  m_GameObject: {fileID: 0}
  m_Enabled: 1
  m_EditorHideFlags: 0
  m_Script: {fileID: 11500000, guid: 182eb47472f64de388dd50183c0411d8, type: 3}
  m_Name: SO_Infocard_462660
  m_EditorClassIdentifier: 
  <Key>k__BackingField: 462660
  <Value>k__BackingField: 'I heard from someone the other day that The Professor
    was spotted walking down one of the corridors here. Can you believe that? Probably
    just some drunken rumor. Everybody knows that The Professor is just some Hacker
    myth made up to make Ageira execs wet their pants in the middle of the night.<br>


'
