%YAML 1.1
%TAG !u! tag:unity3d.com,2011:
--- !u!114 &11400000
MonoBehaviour:
  m_ObjectHideFlags: 0
  m_CorrespondingSourceObject: {fileID: 0}
  m_PrefabInstance: {fileID: 0}
  m_PrefabAsset: {fileID: 0}
  m_GameObject: {fileID: 0}
  m_Enabled: 1
  m_EditorHideFlags: 0
  m_Script: {fileID: 11500000, guid: 182eb47472f64de388dd50183c0411d8, type: 3}
  m_Name: SO_Infocard_465399
  m_EditorClassIdentifier: 
  <Key>k__BackingField: 465399
  <Value>k__BackingField: 'DSE never did manage to find a jump hole here. It''s funny
    when you think about it. One of the largest corporations in the universe can''t
    manage to find a jump hole in one small system, even with others using it all
    the time!<br>


'
