%YAML 1.1
%TAG !u! tag:unity3d.com,2011:
--- !u!114 &11400000
MonoBehaviour:
  m_ObjectHideFlags: 0
  m_CorrespondingSourceObject: {fileID: 0}
  m_PrefabInstance: {fileID: 0}
  m_PrefabAsset: {fileID: 0}
  m_GameObject: {fileID: 0}
  m_Enabled: 1
  m_EditorHideFlags: 0
  m_Script: {fileID: 11500000, guid: 182eb47472f64de388dd50183c0411d8, type: 3}
  m_Name: SO_Infocard_133375
  m_EditorClassIdentifier: 
  <Key>k__BackingField: 133375
  <Value>k__BackingField: 'Samura has accomplished our primary goal of establishing
    a viable gas field in Hokkaido. The government''s assistance was invaluable achieving
    this goal. We no longer need to justify our presence in Hokkaido, we can stay
    well below the Gap around Sapporo, or move on into Tau-53.<br>


'
