%YAML 1.1
%TAG !u! tag:unity3d.com,2011:
--- !u!114 &11400000
MonoBehaviour:
  m_ObjectHideFlags: 0
  m_CorrespondingSourceObject: {fileID: 0}
  m_PrefabInstance: {fileID: 0}
  m_PrefabAsset: {fileID: 0}
  m_GameObject: {fileID: 0}
  m_Enabled: 1
  m_EditorHideFlags: 0
  m_Script: {fileID: 11500000, guid: 182eb47472f64de388dd50183c0411d8, type: 3}
  m_Name: SO_Infocard_132754
  m_EditorClassIdentifier: 
  <Key>k__BackingField: 132754
  <Value>k__BackingField: 'The only way that Samura could compete with Synth Foods
    was to find a way to boost the amount of fish that our fish farms could produce.
    Alien Organisms were the answer. They are in demand at our facility in Junyo.
    The Cryer facility to the west studies the organisms for their own purposes.
    More recently, Planetform has become interested in them as well. Aside from feeding
    fish, they seem well-suited to jump start an ecology, or so I''m told. We have
    no shortage of them on this planet, so we don''t restrict the export. <br>


'
