%YAML 1.1
%TAG !u! tag:unity3d.com,2011:
--- !u!114 &11400000
MonoBehaviour:
  m_ObjectHideFlags: 0
  m_CorrespondingSourceObject: {fileID: 0}
  m_PrefabInstance: {fileID: 0}
  m_PrefabAsset: {fileID: 0}
  m_GameObject: {fileID: 0}
  m_Enabled: 1
  m_EditorHideFlags: 0
  m_Script: {fileID: 11500000, guid: 182eb47472f64de388dd50183c0411d8, type: 3}
  m_Name: SO_Infocard_460360
  m_EditorClassIdentifier: 
  <Key>k__BackingField: 460360
  <Value>k__BackingField: 'The Bretonians, yes. They''ve put up more of a fight then
    we were led to believe they still could. Perhaps Kusari did not mangle them enough
    yet. Trust those Council fools to break up a plan that was several centuries
    in the making. Once we''re through with Bretonia, I hope His Excellency shall
    turn his attention towards Marne. <br>


'
