%YAML 1.1
%TAG !u! tag:unity3d.com,2011:
--- !u!114 &11400000
MonoBehaviour:
  m_ObjectHideFlags: 0
  m_CorrespondingSourceObject: {fileID: 0}
  m_PrefabInstance: {fileID: 0}
  m_PrefabAsset: {fileID: 0}
  m_GameObject: {fileID: 0}
  m_Enabled: 1
  m_EditorHideFlags: 0
  m_Script: {fileID: 11500000, guid: 182eb47472f64de388dd50183c0411d8, type: 3}
  m_Name: SO_Infocard_470116
  m_EditorClassIdentifier: 
  <Key>k__BackingField: 470116
  <Value>k__BackingField: 'Occasionally we see the odd Corsair near the station,
    seemingly lost. I guess we shouldn''t be too surprised though, the Corsairs have
    a reputation of hunting down the Red Hessians wherever they can, us being in
    the crossfire is just a bonus to them. Fortunately, it''s a pretty rare occurrence.<br>


'
