%YAML 1.1
%TAG !u! tag:unity3d.com,2011:
--- !u!114 &11400000
MonoBehaviour:
  m_ObjectHideFlags: 0
  m_CorrespondingSourceObject: {fileID: 0}
  m_PrefabInstance: {fileID: 0}
  m_PrefabAsset: {fileID: 0}
  m_GameObject: {fileID: 0}
  m_Enabled: 1
  m_EditorHideFlags: 0
  m_Script: {fileID: 11500000, guid: 182eb47472f64de388dd50183c0411d8, type: 3}
  m_Name: SO_Infocard_501709
  m_EditorClassIdentifier: 
  <Key>k__BackingField: 501709
  <Value>k__BackingField: " <br><b><p align=\"center\">Stats<br></b><p align=\"left\">
    <br>Gun/Turret Mounts: 0/7<br>Base Armor: 1598000<br>Cargo Space: 700<br>Power
    Output: 65650/2095000<br>Thruster Energy: 130000/1750000<br>Batteries/NanoBots:
    1700/0<br>Equipment Mounts: CM CD <br> <br><b><p align=\"center\">Maneuverability<br></b><p
    align=\"left\"> <br>Max Turn Rate: 22\xB0<br>Time to Max Turn: 3.39s<br>Time
    to turn 180\xB0: 8.67s<br>Maximum Strafe Speed: 35.71m/s<br>Distance Strafed
    in 2s: 35.82m<br>\n\n"
