%YAML 1.1
%TAG !u! tag:unity3d.com,2011:
--- !u!114 &11400000
MonoBehaviour:
  m_ObjectHideFlags: 0
  m_CorrespondingSourceObject: {fileID: 0}
  m_PrefabInstance: {fileID: 0}
  m_PrefabAsset: {fileID: 0}
  m_GameObject: {fileID: 0}
  m_Enabled: 1
  m_EditorHideFlags: 0
  m_Script: {fileID: 11500000, guid: 182eb47472f64de388dd50183c0411d8, type: 3}
  m_Name: SO_Infocard_462620
  m_EditorClassIdentifier: 
  <Key>k__BackingField: 462620
  <Value>k__BackingField: 'I don''t get it. Why did the Rogues risk bringing down
    the unholy wrath of the Liberty Navy on their filthy hides by blowing up Red
    Deer Station, but haven''t made a move since? I feel like everybody in this system
    is just waiting for doom to strike, but nobody knows where it''s going to come
    from next.<br>


'
