%YAML 1.1
%TAG !u! tag:unity3d.com,2011:
--- !u!114 &11400000
MonoBehaviour:
  m_ObjectHideFlags: 0
  m_CorrespondingSourceObject: {fileID: 0}
  m_PrefabInstance: {fileID: 0}
  m_PrefabAsset: {fileID: 0}
  m_GameObject: {fileID: 0}
  m_Enabled: 1
  m_EditorHideFlags: 0
  m_Script: {fileID: 11500000, guid: 182eb47472f64de388dd50183c0411d8, type: 3}
  m_Name: SO_Infocard_488219
  m_EditorClassIdentifier: 
  <Key>k__BackingField: 488219
  <Value>k__BackingField: 'Back for more, are you? Looking for trouble? This ain''t
    a Zoner bar. We don''t like brawls here, especially from outsiders. And we don''t
    ban firearms. Keep that in mind, bub. Now shove off.<br>


'
