%YAML 1.1
%TAG !u! tag:unity3d.com,2011:
--- !u!114 &11400000
MonoBehaviour:
  m_ObjectHideFlags: 0
  m_CorrespondingSourceObject: {fileID: 0}
  m_PrefabInstance: {fileID: 0}
  m_PrefabAsset: {fileID: 0}
  m_GameObject: {fileID: 0}
  m_Enabled: 1
  m_EditorHideFlags: 0
  m_Script: {fileID: 11500000, guid: 182eb47472f64de388dd50183c0411d8, type: 3}
  m_Name: SO_Infocard_463037
  m_EditorClassIdentifier: 
  <Key>k__BackingField: 463037
  <Value>k__BackingField: 'Becoming a Lane Hacker was the best choice I made in life.
    I was fed up with all the lies and oppression Ageira was doing to their workers.
    Here my work is recognized and awarded, I have all the things I need in life.<br>


'
