%YAML 1.1
%TAG !u! tag:unity3d.com,2011:
--- !u!114 &11400000
MonoBehaviour:
  m_ObjectHideFlags: 0
  m_CorrespondingSourceObject: {fileID: 0}
  m_PrefabInstance: {fileID: 0}
  m_PrefabAsset: {fileID: 0}
  m_GameObject: {fileID: 0}
  m_Enabled: 1
  m_EditorHideFlags: 0
  m_Script: {fileID: 11500000, guid: b271f90cda31432883e1182aa0b8027c, type: 3}
  m_Name: SO_Faction_Mollys
  m_EditorClassIdentifier: 
  serializationData:
    SerializedFormat: 2
    SerializedBytes: 
    ReferencedUnityObjects:
    - {fileID: 11400000, guid: ef3ff49a132d5432e91c83cbf049b783, type: 2}
    - {fileID: 11400000, guid: 4625706d07d65464392374edf9a8477d, type: 2}
    - {fileID: 11400000, guid: e0952c7b7246347b1bda62cdbb1bb3db, type: 2}
    - {fileID: 11400000, guid: bf6609ff962bf43ba9f1edb605bc91af, type: 2}
    - {fileID: 11400000, guid: d324f66a3e2414fccbdd15ffe1902df5, type: 2}
    - {fileID: 11400000, guid: 1afd41308bbb6433390e74af2066c1ca, type: 2}
    - {fileID: 11400000, guid: 6b4a63a649535455091c84df3485059e, type: 2}
    - {fileID: 11400000, guid: 7d79efbcecbfa4ee489948f04ab61ba1, type: 2}
    - {fileID: 11400000, guid: cec6002b426154c94bba7ff771f75e9d, type: 2}
    - {fileID: 11400000, guid: 9876c6066afbe4c278e6df7867203c51, type: 2}
    - {fileID: 11400000, guid: 2a4aa9edecc634ccca403dbb9cd658c9, type: 2}
    - {fileID: 11400000, guid: b107a784d30094a869f63dee472bac63, type: 2}
    - {fileID: 11400000, guid: 10449b69f19c24d90ad54ed9d60b7256, type: 2}
    - {fileID: 11400000, guid: 03783c18edc5f40eead1c7d09289700f, type: 2}
    - {fileID: 11400000, guid: 4402e096209084785ab194afa25da1b1, type: 2}
    - {fileID: 11400000, guid: f5db549bc6f544772bfb28f33cb59ded, type: 2}
    - {fileID: 11400000, guid: 9d5bbb291524b4141b849f086d39319b, type: 2}
    - {fileID: 11400000, guid: 68290904865fd48c2bb4b37d37aa6993, type: 2}
    - {fileID: 11400000, guid: 5e23e20842aa4496882b507b57edb054, type: 2}
    - {fileID: 11400000, guid: 4fcafd485d33849e285f88ecc469d40f, type: 2}
    - {fileID: 11400000, guid: d4a232a65085147f1b3a4dcc0abc94d4, type: 2}
    - {fileID: 11400000, guid: 45069beacc2f04a15a79da10c79e74a0, type: 2}
    - {fileID: 11400000, guid: 17ca187d2c0e0435799c00a483fe495f, type: 2}
    - {fileID: 11400000, guid: 6a56ebfd596f2409ba6c1378638411a2, type: 2}
    - {fileID: 11400000, guid: 447a49d7c8e51492793ced160f8d42cb, type: 2}
    - {fileID: 11400000, guid: 268a155ae7caf4ba2affe4f1fe49578d, type: 2}
    - {fileID: 11400000, guid: 095c5c4e3c074457c942014f226e6293, type: 2}
    - {fileID: 11400000, guid: 5ddc301b56cfb4344a71e27badc22f8a, type: 2}
    - {fileID: 11400000, guid: 42ace5e27ed2e4d45b6ba3eec1febb3b, type: 2}
    - {fileID: 11400000, guid: a70b59cc9080e4dde8635e2b48d833ae, type: 2}
    - {fileID: 11400000, guid: f794371ec12354f8c9020ccde5db8c20, type: 2}
    - {fileID: 11400000, guid: 3c97090660d274d72a13819e37ff5c3e, type: 2}
    - {fileID: 11400000, guid: 811beb3ff1e3244508d2f3b576da2d4e, type: 2}
    - {fileID: 11400000, guid: fe884a8e632ac4c2898e736ff39675b5, type: 2}
    - {fileID: 11400000, guid: 6a10e86d8e56c47a39b40efb23352164, type: 2}
    - {fileID: 11400000, guid: 40c3ce01a8b4c4d379e10a23e2c69545, type: 2}
    - {fileID: 11400000, guid: 2d47234e1ac254c7c9e9e107a5263bfc, type: 2}
    - {fileID: 11400000, guid: 20a265fbdf95149f497432f16d37dfa7, type: 2}
    - {fileID: 11400000, guid: a0a9e1fca1e0848c4978f1141be4fe14, type: 2}
    - {fileID: 11400000, guid: 4a88d66dcecb34024b890710a6406b16, type: 2}
    - {fileID: 11400000, guid: c93e4331be9f64a31a15f0a044b6f220, type: 2}
    - {fileID: 11400000, guid: 65cb16ea8ce8a4ad9ab06dc5f0ce29c3, type: 2}
    - {fileID: 11400000, guid: b1a8e52b1e65b4a6b9268c5332375666, type: 2}
    - {fileID: 11400000, guid: 0508c29c7342545818479a1c76e6131b, type: 2}
    - {fileID: 11400000, guid: 4d73ec3a6d088418fad3112db70e7447, type: 2}
    - {fileID: 11400000, guid: 92ea5a3f8686640ec99793b705cda8c1, type: 2}
    - {fileID: 11400000, guid: c8061fc561e714aca9e492105eab1b66, type: 2}
    - {fileID: 11400000, guid: 49355e79c95cd4eb3b8045facaa333dd, type: 2}
    - {fileID: 11400000, guid: 640e4703f46254de4b3d03cb86f8e38a, type: 2}
    - {fileID: 11400000, guid: d12290a2f163343adb9885399f2ff3a7, type: 2}
    - {fileID: 11400000, guid: a53bc43b3e05f4e34b56af51134478ce, type: 2}
    - {fileID: 11400000, guid: feb985b5dcaff413f9bf2b8d56b77006, type: 2}
    - {fileID: 11400000, guid: 51a098401767448a293ab7c2de1db7d0, type: 2}
    - {fileID: 11400000, guid: ad4d58060aa8c4b47814b8a7114ce222, type: 2}
    - {fileID: 11400000, guid: 9f76544856a1046bd86cba5663b90d4b, type: 2}
    - {fileID: 11400000, guid: 67ffa408a1a9447749bb5ff7ee243b9b, type: 2}
    - {fileID: 11400000, guid: cdf28eab446214afc9cdde5c5b1fdc56, type: 2}
    - {fileID: 11400000, guid: 39861eec566044a80bf7d19edb385517, type: 2}
    - {fileID: 11400000, guid: 4d255a13a9aa74a5bbc933f6612cfbd8, type: 2}
    - {fileID: 11400000, guid: fa4eae277dff14ddeaf77f2e6d8733e9, type: 2}
    - {fileID: 11400000, guid: a8ccb27f7c05c4eec8bce2cec0734151, type: 2}
    - {fileID: 11400000, guid: 2f24a9f24b6624e068c90fb1a916c98c, type: 2}
    - {fileID: 11400000, guid: d918497363467490cab836f56ef0cb16, type: 2}
    - {fileID: 11400000, guid: 1e818b6c928d3471181ae8653030b5c9, type: 2}
    - {fileID: 11400000, guid: a89ad52931a9041ad9fc09f1fe249dd9, type: 2}
    - {fileID: 11400000, guid: 4d0e7f79f380e4b909c8e22e9fc08e02, type: 2}
    - {fileID: 11400000, guid: aee3bef15310448f1b83152881db8033, type: 2}
    - {fileID: 11400000, guid: 3c22d81014189445c8d59b7e35e708ad, type: 2}
    - {fileID: 11400000, guid: 5c88a1184195548678e799b9c9031793, type: 2}
    - {fileID: 11400000, guid: bf6bfb858718546fcb14e0e12fad6cd9, type: 2}
    - {fileID: 11400000, guid: cc119a6be7df24541899a231c1a6569e, type: 2}
    - {fileID: 11400000, guid: 17dd4c6c5259f423685c4b04821d21e0, type: 2}
    - {fileID: 11400000, guid: beb2719a2b00f46f58012e9ecce7f4da, type: 2}
    - {fileID: 11400000, guid: 8e8c4f3549a064fa9b8d983e922b72be, type: 2}
    - {fileID: 11400000, guid: 68936edbd837e45b8a51404bdb3d664d, type: 2}
    - {fileID: 11400000, guid: 48778617421c34717a44f697b66cc717, type: 2}
    - {fileID: 11400000, guid: 9eee28bd651c74fc1968c96fda24c8e7, type: 2}
    - {fileID: 11400000, guid: ec3b6a59be23d478bb625be43663b6e4, type: 2}
    - {fileID: 11400000, guid: f0a2bf7c9dbee436a8a51b7fe9fa3329, type: 2}
    - {fileID: 11400000, guid: 97c2c058787604b108ffa09ffa75d0ed, type: 2}
    - {fileID: 11400000, guid: 19662fc692db54d0fbbf2cbeed1c1b1a, type: 2}
    - {fileID: 11400000, guid: bd0d58e5441e745608c5c4291c43e65c, type: 2}
    - {fileID: 11400000, guid: 01519a901d66d44c4962ae9896855e98, type: 2}
    - {fileID: 11400000, guid: 1365930d5cc0c40f1ba1def236595937, type: 2}
    - {fileID: 11400000, guid: 1b9a322442c8443d0b708b2089e75d00, type: 2}
    - {fileID: 11400000, guid: f5078b401733d45f2bf18f22a7a29fc8, type: 2}
    - {fileID: 11400000, guid: da84d90e6c68a4b2ead20856212d9ac6, type: 2}
    - {fileID: 11400000, guid: 1ccfff16f82f5467bafd5e1de8011d34, type: 2}
    - {fileID: 11400000, guid: ef2d3c0e94bd24c3cba92fe7ccc4ba4a, type: 2}
    - {fileID: 11400000, guid: f0f9a519c01cc42938ccb5079d2c3eed, type: 2}
    - {fileID: 11400000, guid: 44d10f160430e480382205dc2252046a, type: 2}
    - {fileID: 11400000, guid: a70e6eec938104bfea6c56e3e8ff1d83, type: 2}
    - {fileID: 11400000, guid: 769d0cf407a474a7f80de783914deb9b, type: 2}
    - {fileID: 11400000, guid: 2b47009f186b745df813cdf5cf6ed204, type: 2}
    - {fileID: 11400000, guid: fab7c717d5a194f75be17d526a609cdd, type: 2}
    - {fileID: 11400000, guid: 49315c07ca82b4cda8f83f043c4cfad2, type: 2}
    - {fileID: 11400000, guid: ea5c99772f98d423cb7f6bef1cb1c07f, type: 2}
    - {fileID: 11400000, guid: ee8b0c0b2d8cb4efeab6eda702a0f227, type: 2}
    - {fileID: 11400000, guid: 0058a5796ec2b403cb08f2ab7f254745, type: 2}
    - {fileID: 11400000, guid: 3ed587e793b874d1e9411b98a746127c, type: 2}
    - {fileID: 11400000, guid: 7e9138baeb7714a9ea38829dc74d79c5, type: 2}
    - {fileID: 11400000, guid: ed693618b3c0f426aa7e0f48943dc21a, type: 2}
    - {fileID: 11400000, guid: a46aed9edfc5a4c58bd7890039ac01b9, type: 2}
    - {fileID: 11400000, guid: c43808fe4e5e847ff8ce7e3f9dbcd14e, type: 2}
    - {fileID: 11400000, guid: ac3d91a4e024c4e6a90fe0145950e50c, type: 2}
    - {fileID: 11400000, guid: af9c025b0a12d4d6290e765de530d0fa, type: 2}
    - {fileID: 11400000, guid: c550bfb5ec926406784051e80e0b124b, type: 2}
    - {fileID: 11400000, guid: 968f42a56a5124a319a66183850f3fee, type: 2}
    - {fileID: 11400000, guid: ef2c3af7175cb4e60afb59a36d1784b2, type: 2}
    - {fileID: 11400000, guid: 86f9ac97d7937495cbd04c058449a64c, type: 2}
    - {fileID: 11400000, guid: db1235cebe51c471aadd2e7ab6aaacd6, type: 2}
    - {fileID: 11400000, guid: 4edc2c8f3465045439c882763336f7d4, type: 2}
    - {fileID: 11400000, guid: c99c0b0e4e81a4456a1e8e73899756e7, type: 2}
    - {fileID: 11400000, guid: 87a221a9ef29e4700b9709e86196071c, type: 2}
    - {fileID: 11400000, guid: 91067a650dea844b081c46c6674ba31a, type: 2}
    - {fileID: 11400000, guid: 9a4c58e28b2024dec9b6d4ddd514d9fe, type: 2}
    - {fileID: 11400000, guid: 8899ec85d890f4e51bbc6ac080895687, type: 2}
    - {fileID: 11400000, guid: 3af719521f135423c906c8d5f06e9958, type: 2}
    - {fileID: 11400000, guid: 5d41ec473e1aa4bab8d58b8ed97c715e, type: 2}
    - {fileID: 11400000, guid: 75aae084ba8dc4f56a1593f295193726, type: 2}
    - {fileID: 11400000, guid: 990926f2460894deab0e0e97c4e29315, type: 2}
    - {fileID: 11400000, guid: d1734ea8048dd4158827390c98453e24, type: 2}
    - {fileID: 11400000, guid: 201ca47aeb9e04dccb08fcfa2457600d, type: 2}
    - {fileID: 11400000, guid: cd9ec85e6439f4aa5b8f0ec5fd1d22c5, type: 2}
    SerializedBytesString: 
    Prefab: {fileID: 0}
    PrefabModificationsReferencedUnityObjects: []
    PrefabModifications: []
    SerializationNodes:
    - Name: <Name>k__BackingField
      Entry: 10
      Data: 0
    - Name: <ShortName>k__BackingField
      Entry: 10
      Data: 1
    - Name: <Infocard>k__BackingField
      Entry: 10
      Data: 2
    - Name: <Reputations>k__BackingField
      Entry: 7
      Data: 0|System.Collections.Generic.Dictionary`2[[FreelancerDataTool.Interfaces.IFaction,
        Assembly-CSharp],[System.Single, mscorlib]], mscorlib
    - Name: comparer
      Entry: 7
      Data: 1|System.Collections.Generic.ObjectEqualityComparer`1[[FreelancerDataTool.Interfaces.IFaction,
        Assembly-CSharp]], mscorlib
    - Name: 
      Entry: 8
      Data: 
    - Name: 
      Entry: 12
      Data: 60
    - Name: 
      Entry: 7
      Data: 
    - Name: $k
      Entry: 10
      Data: 3
    - Name: $v
      Entry: 4
      Data: -0.65
    - Name: 
      Entry: 8
      Data: 
    - Name: 
      Entry: 7
      Data: 
    - Name: $k
      Entry: 10
      Data: 4
    - Name: $v
      Entry: 4
      Data: -0.65
    - Name: 
      Entry: 8
      Data: 
    - Name: 
      Entry: 7
      Data: 
    - Name: $k
      Entry: 10
      Data: 5
    - Name: $v
      Entry: 4
      Data: -0.65
    - Name: 
      Entry: 8
      Data: 
    - Name: 
      Entry: 7
      Data: 
    - Name: $k
      Entry: 10
      Data: 6
    - Name: $v
      Entry: 4
      Data: -0.65
    - Name: 
      Entry: 8
      Data: 
    - Name: 
      Entry: 7
      Data: 
    - Name: $k
      Entry: 10
      Data: 7
    - Name: $v
      Entry: 4
      Data: -0.65
    - Name: 
      Entry: 8
      Data: 
    - Name: 
      Entry: 7
      Data: 
    - Name: $k
      Entry: 10
      Data: 8
    - Name: $v
      Entry: 4
      Data: -0.65
    - Name: 
      Entry: 8
      Data: 
    - Name: 
      Entry: 7
      Data: 
    - Name: $k
      Entry: 10
      Data: 9
    - Name: $v
      Entry: 4
      Data: -0.65
    - Name: 
      Entry: 8
      Data: 
    - Name: 
      Entry: 7
      Data: 
    - Name: $k
      Entry: 10
      Data: 10
    - Name: $v
      Entry: 4
      Data: -0.65
    - Name: 
      Entry: 8
      Data: 
    - Name: 
      Entry: 7
      Data: 
    - Name: $k
      Entry: 10
      Data: 11
    - Name: $v
      Entry: 4
      Data: -0.65
    - Name: 
      Entry: 8
      Data: 
    - Name: 
      Entry: 7
      Data: 
    - Name: $k
      Entry: 10
      Data: 12
    - Name: $v
      Entry: 4
      Data: -0.65
    - Name: 
      Entry: 8
      Data: 
    - Name: 
      Entry: 7
      Data: 
    - Name: $k
      Entry: 10
      Data: 13
    - Name: $v
      Entry: 4
      Data: -0.65
    - Name: 
      Entry: 8
      Data: 
    - Name: 
      Entry: 7
      Data: 
    - Name: $k
      Entry: 10
      Data: 14
    - Name: $v
      Entry: 4
      Data: -0.65
    - Name: 
      Entry: 8
      Data: 
    - Name: 
      Entry: 7
      Data: 
    - Name: $k
      Entry: 10
      Data: 15
    - Name: $v
      Entry: 4
      Data: -0.65
    - Name: 
      Entry: 8
      Data: 
    - Name: 
      Entry: 7
      Data: 
    - Name: $k
      Entry: 10
      Data: 16
    - Name: $v
      Entry: 4
      Data: -0.65
    - Name: 
      Entry: 8
      Data: 
    - Name: 
      Entry: 7
      Data: 
    - Name: $k
      Entry: 10
      Data: 17
    - Name: $v
      Entry: 4
      Data: -0.65
    - Name: 
      Entry: 8
      Data: 
    - Name: 
      Entry: 7
      Data: 
    - Name: $k
      Entry: 10
      Data: 18
    - Name: $v
      Entry: 4
      Data: -0.65
    - Name: 
      Entry: 8
      Data: 
    - Name: 
      Entry: 7
      Data: 
    - Name: $k
      Entry: 10
      Data: 19
    - Name: $v
      Entry: 4
      Data: -0.65
    - Name: 
      Entry: 8
      Data: 
    - Name: 
      Entry: 7
      Data: 
    - Name: $k
      Entry: 10
      Data: 20
    - Name: $v
      Entry: 4
      Data: -0.65
    - Name: 
      Entry: 8
      Data: 
    - Name: 
      Entry: 7
      Data: 
    - Name: $k
      Entry: 10
      Data: 21
    - Name: $v
      Entry: 4
      Data: -0.65
    - Name: 
      Entry: 8
      Data: 
    - Name: 
      Entry: 7
      Data: 
    - Name: $k
      Entry: 10
      Data: 22
    - Name: $v
      Entry: 4
      Data: -0.65
    - Name: 
      Entry: 8
      Data: 
    - Name: 
      Entry: 7
      Data: 
    - Name: $k
      Entry: 10
      Data: 23
    - Name: $v
      Entry: 4
      Data: -0.65
    - Name: 
      Entry: 8
      Data: 
    - Name: 
      Entry: 7
      Data: 
    - Name: $k
      Entry: 10
      Data: 24
    - Name: $v
      Entry: 4
      Data: -0.65
    - Name: 
      Entry: 8
      Data: 
    - Name: 
      Entry: 7
      Data: 
    - Name: $k
      Entry: 10
      Data: 25
    - Name: $v
      Entry: 4
      Data: -0.65
    - Name: 
      Entry: 8
      Data: 
    - Name: 
      Entry: 7
      Data: 
    - Name: $k
      Entry: 10
      Data: 26
    - Name: $v
      Entry: 4
      Data: -0.65
    - Name: 
      Entry: 8
      Data: 
    - Name: 
      Entry: 7
      Data: 
    - Name: $k
      Entry: 10
      Data: 27
    - Name: $v
      Entry: 4
      Data: -0.65
    - Name: 
      Entry: 8
      Data: 
    - Name: 
      Entry: 7
      Data: 
    - Name: $k
      Entry: 10
      Data: 28
    - Name: $v
      Entry: 4
      Data: -0.65
    - Name: 
      Entry: 8
      Data: 
    - Name: 
      Entry: 7
      Data: 
    - Name: $k
      Entry: 10
      Data: 29
    - Name: $v
      Entry: 4
      Data: -0.65
    - Name: 
      Entry: 8
      Data: 
    - Name: 
      Entry: 7
      Data: 
    - Name: $k
      Entry: 10
      Data: 30
    - Name: $v
      Entry: 4
      Data: -0.65
    - Name: 
      Entry: 8
      Data: 
    - Name: 
      Entry: 7
      Data: 
    - Name: $k
      Entry: 10
      Data: 31
    - Name: $v
      Entry: 4
      Data: -0.65
    - Name: 
      Entry: 8
      Data: 
    - Name: 
      Entry: 7
      Data: 
    - Name: $k
      Entry: 10
      Data: 32
    - Name: $v
      Entry: 4
      Data: -0.65
    - Name: 
      Entry: 8
      Data: 
    - Name: 
      Entry: 7
      Data: 
    - Name: $k
      Entry: 10
      Data: 33
    - Name: $v
      Entry: 4
      Data: -0.65
    - Name: 
      Entry: 8
      Data: 
    - Name: 
      Entry: 7
      Data: 
    - Name: $k
      Entry: 10
      Data: 34
    - Name: $v
      Entry: 4
      Data: -0.65
    - Name: 
      Entry: 8
      Data: 
    - Name: 
      Entry: 7
      Data: 
    - Name: $k
      Entry: 10
      Data: 35
    - Name: $v
      Entry: 4
      Data: -0.65
    - Name: 
      Entry: 8
      Data: 
    - Name: 
      Entry: 7
      Data: 
    - Name: $k
      Entry: 10
      Data: 36
    - Name: $v
      Entry: 4
      Data: -0.65
    - Name: 
      Entry: 8
      Data: 
    - Name: 
      Entry: 7
      Data: 
    - Name: $k
      Entry: 10
      Data: 37
    - Name: $v
      Entry: 4
      Data: -0.65
    - Name: 
      Entry: 8
      Data: 
    - Name: 
      Entry: 7
      Data: 
    - Name: $k
      Entry: 10
      Data: 38
    - Name: $v
      Entry: 4
      Data: -0.65
    - Name: 
      Entry: 8
      Data: 
    - Name: 
      Entry: 7
      Data: 
    - Name: $k
      Entry: 10
      Data: 39
    - Name: $v
      Entry: 4
      Data: -0.65
    - Name: 
      Entry: 8
      Data: 
    - Name: 
      Entry: 7
      Data: 
    - Name: $k
      Entry: 10
      Data: 40
    - Name: $v
      Entry: 4
      Data: -0.65
    - Name: 
      Entry: 8
      Data: 
    - Name: 
      Entry: 7
      Data: 
    - Name: $k
      Entry: 10
      Data: 41
    - Name: $v
      Entry: 4
      Data: -0.65
    - Name: 
      Entry: 8
      Data: 
    - Name: 
      Entry: 7
      Data: 
    - Name: $k
      Entry: 10
      Data: 42
    - Name: $v
      Entry: 4
      Data: -0.65
    - Name: 
      Entry: 8
      Data: 
    - Name: 
      Entry: 7
      Data: 
    - Name: $k
      Entry: 10
      Data: 43
    - Name: $v
      Entry: 4
      Data: -0.65
    - Name: 
      Entry: 8
      Data: 
    - Name: 
      Entry: 7
      Data: 
    - Name: $k
      Entry: 10
      Data: 44
    - Name: $v
      Entry: 4
      Data: -0.65
    - Name: 
      Entry: 8
      Data: 
    - Name: 
      Entry: 7
      Data: 
    - Name: $k
      Entry: 10
      Data: 45
    - Name: $v
      Entry: 4
      Data: -0.65
    - Name: 
      Entry: 8
      Data: 
    - Name: 
      Entry: 7
      Data: 
    - Name: $k
      Entry: 10
      Data: 46
    - Name: $v
      Entry: 4
      Data: -0.65
    - Name: 
      Entry: 8
      Data: 
    - Name: 
      Entry: 7
      Data: 
    - Name: $k
      Entry: 10
      Data: 47
    - Name: $v
      Entry: 4
      Data: -0.65
    - Name: 
      Entry: 8
      Data: 
    - Name: 
      Entry: 7
      Data: 
    - Name: $k
      Entry: 10
      Data: 48
    - Name: $v
      Entry: 4
      Data: -0.65
    - Name: 
      Entry: 8
      Data: 
    - Name: 
      Entry: 7
      Data: 
    - Name: $k
      Entry: 10
      Data: 49
    - Name: $v
      Entry: 4
      Data: -0.65
    - Name: 
      Entry: 8
      Data: 
    - Name: 
      Entry: 7
      Data: 
    - Name: $k
      Entry: 10
      Data: 50
    - Name: $v
      Entry: 4
      Data: -0.65
    - Name: 
      Entry: 8
      Data: 
    - Name: 
      Entry: 7
      Data: 
    - Name: $k
      Entry: 10
      Data: 51
    - Name: $v
      Entry: 4
      Data: -0.55
    - Name: 
      Entry: 8
      Data: 
    - Name: 
      Entry: 7
      Data: 
    - Name: $k
      Entry: 10
      Data: 52
    - Name: $v
      Entry: 4
      Data: -0.3
    - Name: 
      Entry: 8
      Data: 
    - Name: 
      Entry: 7
      Data: 
    - Name: $k
      Entry: 10
      Data: 53
    - Name: $v
      Entry: 4
      Data: -0.3
    - Name: 
      Entry: 8
      Data: 
    - Name: 
      Entry: 7
      Data: 
    - Name: $k
      Entry: 10
      Data: 54
    - Name: $v
      Entry: 4
      Data: -0.3
    - Name: 
      Entry: 8
      Data: 
    - Name: 
      Entry: 7
      Data: 
    - Name: $k
      Entry: 10
      Data: 55
    - Name: $v
      Entry: 4
      Data: 0.3
    - Name: 
      Entry: 8
      Data: 
    - Name: 
      Entry: 7
      Data: 
    - Name: $k
      Entry: 10
      Data: 56
    - Name: $v
      Entry: 4
      Data: 0.3
    - Name: 
      Entry: 8
      Data: 
    - Name: 
      Entry: 7
      Data: 
    - Name: $k
      Entry: 10
      Data: 57
    - Name: $v
      Entry: 4
      Data: 0.3
    - Name: 
      Entry: 8
      Data: 
    - Name: 
      Entry: 7
      Data: 
    - Name: $k
      Entry: 10
      Data: 58
    - Name: $v
      Entry: 4
      Data: 0.65
    - Name: 
      Entry: 8
      Data: 
    - Name: 
      Entry: 7
      Data: 
    - Name: $k
      Entry: 10
      Data: 59
    - Name: $v
      Entry: 4
      Data: 0.65
    - Name: 
      Entry: 8
      Data: 
    - Name: 
      Entry: 7
      Data: 
    - Name: $k
      Entry: 10
      Data: 60
    - Name: $v
      Entry: 4
      Data: 0.65
    - Name: 
      Entry: 8
      Data: 
    - Name: 
      Entry: 7
      Data: 
    - Name: $k
      Entry: 10
      Data: 61
    - Name: $v
      Entry: 4
      Data: 0.65
    - Name: 
      Entry: 8
      Data: 
    - Name: 
      Entry: 7
      Data: 
    - Name: $k
      Entry: 10
      Data: 62
    - Name: $v
      Entry: 4
      Data: 0.91
    - Name: 
      Entry: 8
      Data: 
    - Name: 
      Entry: 13
      Data: 
    - Name: 
      Entry: 8
      Data: 
    - Name: <NpcBribers>k__BackingField
      Entry: 7
      Data: 2|System.Collections.Generic.Dictionary`2[[FreelancerDataTool.Interfaces.INpc,
        Assembly-CSharp],[System.Single, mscorlib]], mscorlib
    - Name: comparer
      Entry: 7
      Data: 3|System.Collections.Generic.ObjectEqualityComparer`1[[FreelancerDataTool.Interfaces.INpc,
        Assembly-CSharp]], mscorlib
    - Name: 
      Entry: 8
      Data: 
    - Name: 
      Entry: 12
      Data: 13
    - Name: 
      Entry: 7
      Data: 
    - Name: $k
      Entry: 10
      Data: 63
    - Name: $v
      Entry: 4
      Data: 840
    - Name: 
      Entry: 8
      Data: 
    - Name: 
      Entry: 7
      Data: 
    - Name: $k
      Entry: 10
      Data: 64
    - Name: $v
      Entry: 4
      Data: 840
    - Name: 
      Entry: 8
      Data: 
    - Name: 
      Entry: 7
      Data: 
    - Name: $k
      Entry: 10
      Data: 65
    - Name: $v
      Entry: 4
      Data: 840
    - Name: 
      Entry: 8
      Data: 
    - Name: 
      Entry: 7
      Data: 
    - Name: $k
      Entry: 10
      Data: 66
    - Name: $v
      Entry: 4
      Data: 840
    - Name: 
      Entry: 8
      Data: 
    - Name: 
      Entry: 7
      Data: 
    - Name: $k
      Entry: 10
      Data: 67
    - Name: $v
      Entry: 4
      Data: 840
    - Name: 
      Entry: 8
      Data: 
    - Name: 
      Entry: 7
      Data: 
    - Name: $k
      Entry: 10
      Data: 68
    - Name: $v
      Entry: 4
      Data: 840
    - Name: 
      Entry: 8
      Data: 
    - Name: 
      Entry: 7
      Data: 
    - Name: $k
      Entry: 10
      Data: 69
    - Name: $v
      Entry: 4
      Data: 840
    - Name: 
      Entry: 8
      Data: 
    - Name: 
      Entry: 7
      Data: 
    - Name: $k
      Entry: 10
      Data: 70
    - Name: $v
      Entry: 4
      Data: 840
    - Name: 
      Entry: 8
      Data: 
    - Name: 
      Entry: 7
      Data: 
    - Name: $k
      Entry: 10
      Data: 71
    - Name: $v
      Entry: 4
      Data: 840
    - Name: 
      Entry: 8
      Data: 
    - Name: 
      Entry: 7
      Data: 
    - Name: $k
      Entry: 10
      Data: 72
    - Name: $v
      Entry: 4
      Data: 10000
    - Name: 
      Entry: 8
      Data: 
    - Name: 
      Entry: 7
      Data: 
    - Name: $k
      Entry: 10
      Data: 73
    - Name: $v
      Entry: 4
      Data: 840
    - Name: 
      Entry: 8
      Data: 
    - Name: 
      Entry: 7
      Data: 
    - Name: $k
      Entry: 10
      Data: 74
    - Name: $v
      Entry: 4
      Data: 840
    - Name: 
      Entry: 8
      Data: 
    - Name: 
      Entry: 7
      Data: 
    - Name: $k
      Entry: 10
      Data: 75
    - Name: $v
      Entry: 4
      Data: 840
    - Name: 
      Entry: 8
      Data: 
    - Name: 
      Entry: 13
      Data: 
    - Name: 
      Entry: 8
      Data: 
    - Name: <ShipsUsed>k__BackingField
      Entry: 7
      Data: 4|System.Collections.Generic.List`1[[FreelancerDataTool.Interfaces.IShip,
        Assembly-CSharp]], mscorlib
    - Name: 
      Entry: 12
      Data: 12
    - Name: 
      Entry: 10
      Data: 76
    - Name: 
      Entry: 10
      Data: 77
    - Name: 
      Entry: 10
      Data: 78
    - Name: 
      Entry: 10
      Data: 79
    - Name: 
      Entry: 10
      Data: 80
    - Name: 
      Entry: 10
      Data: 81
    - Name: 
      Entry: 10
      Data: 82
    - Name: 
      Entry: 10
      Data: 83
    - Name: 
      Entry: 10
      Data: 84
    - Name: 
      Entry: 10
      Data: 85
    - Name: 
      Entry: 10
      Data: 86
    - Name: 
      Entry: 10
      Data: 87
    - Name: 
      Entry: 13
      Data: 
    - Name: 
      Entry: 8
      Data: 
    - Name: <OwnedBases>k__BackingField
      Entry: 7
      Data: 5|System.Collections.Generic.List`1[[FreelancerDataTool.Interfaces.IBase,
        Assembly-CSharp]], mscorlib
    - Name: 
      Entry: 12
      Data: 5
    - Name: 
      Entry: 10
      Data: 88
    - Name: 
      Entry: 10
      Data: 89
    - Name: 
      Entry: 10
      Data: 90
    - Name: 
      Entry: 10
      Data: 91
    - Name: 
      Entry: 10
      Data: 92
    - Name: 
      Entry: 13
      Data: 
    - Name: 
      Entry: 8
      Data: 
    - Name: <Npcs>k__BackingField
      Entry: 7
      Data: 6|System.Collections.Generic.List`1[[FreelancerDataTool.Interfaces.INpc,
        Assembly-CSharp]], mscorlib
    - Name: 
      Entry: 12
      Data: 38
    - Name: 
      Entry: 10
      Data: 64
    - Name: 
      Entry: 10
      Data: 93
    - Name: 
      Entry: 10
      Data: 94
    - Name: 
      Entry: 10
      Data: 65
    - Name: 
      Entry: 10
      Data: 95
    - Name: 
      Entry: 10
      Data: 96
    - Name: 
      Entry: 10
      Data: 97
    - Name: 
      Entry: 10
      Data: 98
    - Name: 
      Entry: 10
      Data: 99
    - Name: 
      Entry: 10
      Data: 100
    - Name: 
      Entry: 10
      Data: 101
    - Name: 
      Entry: 10
      Data: 66
    - Name: 
      Entry: 10
      Data: 102
    - Name: 
      Entry: 10
      Data: 103
    - Name: 
      Entry: 10
      Data: 104
    - Name: 
      Entry: 10
      Data: 105
    - Name: 
      Entry: 10
      Data: 106
    - Name: 
      Entry: 10
      Data: 107
    - Name: 
      Entry: 10
      Data: 70
    - Name: 
      Entry: 10
      Data: 108
    - Name: 
      Entry: 10
      Data: 109
    - Name: 
      Entry: 10
      Data: 110
    - Name: 
      Entry: 10
      Data: 111
    - Name: 
      Entry: 10
      Data: 112
    - Name: 
      Entry: 10
      Data: 113
    - Name: 
      Entry: 10
      Data: 114
    - Name: 
      Entry: 10
      Data: 115
    - Name: 
      Entry: 10
      Data: 116
    - Name: 
      Entry: 10
      Data: 117
    - Name: 
      Entry: 10
      Data: 71
    - Name: 
      Entry: 10
      Data: 118
    - Name: 
      Entry: 10
      Data: 119
    - Name: 
      Entry: 10
      Data: 120
    - Name: 
      Entry: 10
      Data: 121
    - Name: 
      Entry: 10
      Data: 122
    - Name: 
      Entry: 10
      Data: 123
    - Name: 
      Entry: 10
      Data: 73
    - Name: 
      Entry: 10
      Data: 74
    - Name: 
      Entry: 13
      Data: 
    - Name: 
      Entry: 8
      Data: 
  <Nickname>k__BackingField: fc_m_grp
  <Logo>k__BackingField: {fileID: 21300000, guid: 2ae2c95ef9b764c0ca69fb4cdb79d581, type: 3}
  <Legality>k__BackingField: unlawful
  <JumpPreference>k__BackingField: jumphole
  <ScanAnnounce>k__BackingField: 0
  <ScanChance>k__BackingField: 0.3
