%YAML 1.1
%TAG !u! tag:unity3d.com,2011:
--- !u!114 &11400000
MonoBehaviour:
  m_ObjectHideFlags: 0
  m_CorrespondingSourceObject: {fileID: 0}
  m_PrefabInstance: {fileID: 0}
  m_PrefabAsset: {fileID: 0}
  m_GameObject: {fileID: 0}
  m_Enabled: 1
  m_EditorHideFlags: 0
  m_Script: {fileID: 11500000, guid: 182eb47472f64de388dd50183c0411d8, type: 3}
  m_Name: SO_Infocard_132763
  m_EditorClassIdentifier: 
  <Key>k__BackingField: 132763
  <Value>k__BackingField: 'I was able to capture an Outcast in Omicron Beta a few
    months ago. First, I disabled his ship and hit it with an electro-pulse to knock
    out the people inside. It''s an old Bounty Hunter weapon that''s available to
    Guild members only - kind of an EMP on steroids. I''m told it zaps both computers
    and nerves. Once he was unconscious I suited up and went space walking. Nastiest
    bit was figuring out how that breathing gear of theirs could be pried from the
    cockpit. Those sniffers don''t survive long without their portable cloud. <br>


'
