%YAML 1.1
%TAG !u! tag:unity3d.com,2011:
--- !u!114 &11400000
MonoBehaviour:
  m_ObjectHideFlags: 0
  m_CorrespondingSourceObject: {fileID: 0}
  m_PrefabInstance: {fileID: 0}
  m_PrefabAsset: {fileID: 0}
  m_GameObject: {fileID: 0}
  m_Enabled: 1
  m_EditorHideFlags: 0
  m_Script: {fileID: 11500000, guid: 182eb47472f64de388dd50183c0411d8, type: 3}
  m_Name: SO_Infocard_132127
  m_EditorClassIdentifier: 
  <Key>k__BackingField: 132127
  <Value>k__BackingField: 'Several weeks ago I dragged a Bounty Hunter through the
    edge of the Negra Pequena and watched his ship disappear into the darkness --
    quite enjoyable. His last distress call was sent wideband, so I was able to hear
    the fear in his voice. <br><nbsp><br>


'
