%YAML 1.1
%TAG !u! tag:unity3d.com,2011:
--- !u!114 &11400000
MonoBehaviour:
  m_ObjectHideFlags: 0
  m_CorrespondingSourceObject: {fileID: 0}
  m_PrefabInstance: {fileID: 0}
  m_PrefabAsset: {fileID: 0}
  m_GameObject: {fileID: 0}
  m_Enabled: 1
  m_EditorHideFlags: 0
  m_Script: {fileID: 11500000, guid: 182eb47472f64de388dd50183c0411d8, type: 3}
  m_Name: SO_Infocard_133953
  m_EditorClassIdentifier: 
  <Key>k__BackingField: 133953
  <Value>k__BackingField: 'The Alster unions made a fatal error when they supported
    the Popular Revolution. The new government worsened the already serious economic
    situation by inflating the currency to pay off external war debts. This backfired
    and resulted in the common worker in Rheinland suffering terribly. <br>


'
