%YAML 1.1
%TAG !u! tag:unity3d.com,2011:
--- !u!114 &11400000
MonoBehaviour:
  m_ObjectHideFlags: 0
  m_CorrespondingSourceObject: {fileID: 0}
  m_PrefabInstance: {fileID: 0}
  m_PrefabAsset: {fileID: 0}
  m_GameObject: {fileID: 0}
  m_Enabled: 1
  m_EditorHideFlags: 0
  m_Script: {fileID: 11500000, guid: 182eb47472f64de388dd50183c0411d8, type: 3}
  m_Name: SO_Infocard_131293
  m_EditorClassIdentifier: 
  <Key>k__BackingField: 131293
  <Value>k__BackingField: 'Most of the Junkers in this area aren''t really doing
    anything illegal, just looking for scrap. Occasionally we''ll catch one of them
    trying to steal some equipment, which means we are gonna bust some Rogues that
    the Junker will rat out to save his own hide. <br>


'
