%YAML 1.1
%TAG !u! tag:unity3d.com,2011:
--- !u!114 &11400000
MonoBehaviour:
  m_ObjectHideFlags: 0
  m_CorrespondingSourceObject: {fileID: 0}
  m_PrefabInstance: {fileID: 0}
  m_PrefabAsset: {fileID: 0}
  m_GameObject: {fileID: 0}
  m_Enabled: 1
  m_EditorHideFlags: 0
  m_Script: {fileID: 11500000, guid: 182eb47472f64de388dd50183c0411d8, type: 3}
  m_Name: SO_Infocard_504989
  m_EditorClassIdentifier: 
  <Key>k__BackingField: 504989
  <Value>k__BackingField: 'Recently, many of our researchers have become even more
    fascinated with the alien artifacts found in the depths of Sirius space. Rumour
    has it there are some that may lead to a breakthrough, and help get rid of terraforming
    once and for all. The Corsairs sometimes bring some artifacts with them when
    they are headed to Dublin, some end up in our posession. <br>


'
