%YAML 1.1
%TAG !u! tag:unity3d.com,2011:
--- !u!114 &11400000
MonoBehaviour:
  m_ObjectHideFlags: 0
  m_CorrespondingSourceObject: {fileID: 0}
  m_PrefabInstance: {fileID: 0}
  m_PrefabAsset: {fileID: 0}
  m_GameObject: {fileID: 0}
  m_Enabled: 1
  m_EditorHideFlags: 0
  m_Script: {fileID: 11500000, guid: 182eb47472f64de388dd50183c0411d8, type: 3}
  m_Name: SO_Infocard_132653
  m_EditorClassIdentifier: 
  <Key>k__BackingField: 132653
  <Value>k__BackingField: 'The Mollys were established right after the Founders Day
    Revolt. All we were trying to do was let the government know how bad we were
    being treated by BMM. The government didn''t care. We weren''t worth anything
    in their eyes, just like the BMM executives. We knew that Bretonia wasn''t our
    home, and if we ever wanted to have a home we would have to carve it from Bretonian
    space. <br>


'
