%YAML 1.1
%TAG !u! tag:unity3d.com,2011:
--- !u!114 &11400000
MonoBehaviour:
  m_ObjectHideFlags: 0
  m_CorrespondingSourceObject: {fileID: 0}
  m_PrefabInstance: {fileID: 0}
  m_PrefabAsset: {fileID: 0}
  m_GameObject: {fileID: 0}
  m_Enabled: 1
  m_EditorHideFlags: 0
  m_Script: {fileID: 11500000, guid: 182eb47472f64de388dd50183c0411d8, type: 3}
  m_Name: SO_Infocard_515037
  m_EditorClassIdentifier: 
  <Key>k__BackingField: 515037
  <Value>k__BackingField: 'Dabadoru is one of three strategic points over here. Second
    is Nauru, orbiting the gas giant Tuvalu. It is a desert world settled originally
    by a small group of Corsairs. Yaren is a refuel depot and responsible for handling
    the traffic between the planet and its orbit. Back when our alliance was still
    the thing, it was often frequented by Zoners and The Order. Now that it dissolved,
    Corsairs apparently lost most of their interest in this corner of space. The
    Core relentlessly murdered everyone out there and reinforced their new colony.
    We tried to warn Corsairs about it and I bet that they regret not listening to
    us.<br>


'
