%YAML 1.1
%TAG !u! tag:unity3d.com,2011:
--- !u!114 &11400000
MonoBehaviour:
  m_ObjectHideFlags: 0
  m_CorrespondingSourceObject: {fileID: 0}
  m_PrefabInstance: {fileID: 0}
  m_PrefabAsset: {fileID: 0}
  m_GameObject: {fileID: 0}
  m_Enabled: 1
  m_EditorHideFlags: 0
  m_Script: {fileID: 11500000, guid: 182eb47472f64de388dd50183c0411d8, type: 3}
  m_Name: SO_Infocard_133970
  m_EditorClassIdentifier: 
  <Key>k__BackingField: 133970
  <Value>k__BackingField: 'Lubeck can get lonely. We don''t get up to Hamburg too
    often. Wouldn''t matter anyway, because we never get paid. We''re here to keep
    an eye on the Sudheide. Lot of criminal activity in there. Berlin''s nervous
    about the prison convoys mostly. <br>


'
