%YAML 1.1
%TAG !u! tag:unity3d.com,2011:
--- !u!114 &11400000
MonoBehaviour:
  m_ObjectHideFlags: 0
  m_CorrespondingSourceObject: {fileID: 0}
  m_PrefabInstance: {fileID: 0}
  m_PrefabAsset: {fileID: 0}
  m_GameObject: {fileID: 0}
  m_Enabled: 1
  m_EditorHideFlags: 0
  m_Script: {fileID: 11500000, guid: 182eb47472f64de388dd50183c0411d8, type: 3}
  m_Name: SO_Infocard_66117
  m_EditorClassIdentifier: 
  <Key>k__BackingField: 66117
  <Value>k__BackingField: '<b>KUSARI<br></b> <br><b><u>Settled Planets<br></b></u>Junyo<br>
    <br><b><u>Bases<br></b></u>Fuchu Prison<br>Battleship Myoko<br>Deshima Station<br>Ohashi
    Border Station<br>Tsukishima Liner Yards<br> <br><b><u>Corporations<br></b></u>Samura
    Industries<br>Bounty Hunters Guild<br> <br><b><u>Criminals<br></b></u>Blood Dragons<br>Golden
    Chrysanthemums<br>Hogosha<br> <br><b><u>Produces<br></b></u>Pearls<br>Sake<br>


'
