%YAML 1.1
%TAG !u! tag:unity3d.com,2011:
--- !u!114 &11400000
MonoBehaviour:
  m_ObjectHideFlags: 0
  m_CorrespondingSourceObject: {fileID: 0}
  m_PrefabInstance: {fileID: 0}
  m_PrefabAsset: {fileID: 0}
  m_GameObject: {fileID: 0}
  m_Enabled: 1
  m_EditorHideFlags: 0
  m_Script: {fileID: 11500000, guid: 182eb47472f64de388dd50183c0411d8, type: 3}
  m_Name: SO_Infocard_488236
  m_EditorClassIdentifier: 
  <Key>k__BackingField: 488236
  <Value>k__BackingField: 'Have you been to Freeport 9? I hear it''s beautiful! The
    nebulae are supposed to be the most romantic sight you''ll ever see. And I hear
    there''s all sorts of people at that Freeport. Folks from all over Sirius! Isn''t
    that exciting?!<br>


'
