%YAML 1.1
%TAG !u! tag:unity3d.com,2011:
--- !u!114 &11400000
MonoBehaviour:
  m_ObjectHideFlags: 0
  m_CorrespondingSourceObject: {fileID: 0}
  m_PrefabInstance: {fileID: 0}
  m_PrefabAsset: {fileID: 0}
  m_GameObject: {fileID: 0}
  m_Enabled: 1
  m_EditorHideFlags: 0
  m_Script: {fileID: 11500000, guid: 182eb47472f64de388dd50183c0411d8, type: 3}
  m_Name: SO_Infocard_525354
  m_EditorClassIdentifier: 
  <Key>k__BackingField: 525354
  <Value>k__BackingField: 'The problem on Carlisle is a toxin of sorts, secreted
    by a bacterial lifeform that is present throughout the biosphere. It''s lethal
    to humans - apparantly it dissolves human cell membranes, thereby liquifying
    the poor sod who''s exposed to it. Even those illegal BMM surveying teams didn''t
    deserve that fate - took them a few tries before they started to respect the
    quarantine. <br>


'
