%YAML 1.1
%TAG !u! tag:unity3d.com,2011:
--- !u!114 &11400000
MonoBehaviour:
  m_ObjectHideFlags: 0
  m_CorrespondingSourceObject: {fileID: 0}
  m_PrefabInstance: {fileID: 0}
  m_PrefabAsset: {fileID: 0}
  m_GameObject: {fileID: 0}
  m_Enabled: 1
  m_EditorHideFlags: 0
  m_Script: {fileID: 11500000, guid: 182eb47472f64de388dd50183c0411d8, type: 3}
  m_Name: SO_Infocard_513054
  m_EditorClassIdentifier: 
  <Key>k__BackingField: 513054
  <Value>k__BackingField: 'It is good to see those who were abandoned are still in
    good spirits. That the Emperor passed away before his time is saddening, but
    the time to mourn is not now. The forces here are in need of supplies, but those
    in power on New Tokyo still deny them. We will remedy this situation as best
    as we can. <br>


'
