%YAML 1.1
%TAG !u! tag:unity3d.com,2011:
--- !u!114 &11400000
MonoBehaviour:
  m_ObjectHideFlags: 0
  m_CorrespondingSourceObject: {fileID: 0}
  m_PrefabInstance: {fileID: 0}
  m_PrefabAsset: {fileID: 0}
  m_GameObject: {fileID: 0}
  m_Enabled: 1
  m_EditorHideFlags: 0
  m_Script: {fileID: 11500000, guid: 182eb47472f64de388dd50183c0411d8, type: 3}
  m_Name: SO_Infocard_133795
  m_EditorClassIdentifier: 
  <Key>k__BackingField: 133795
  <Value>k__BackingField: 'There''s a simple reason that the main areas of criminal
    activity in Berlin are in the Ruhrfeld and Saarfeld: That''s where the Jump Holes
    are. The Hamburg Hole is in the northern part of the Ruhr; the Saar Hole leads
    to Dresden. <br><nbsp><br>


'
