%YAML 1.1
%TAG !u! tag:unity3d.com,2011:
--- !u!114 &11400000
MonoBehaviour:
  m_ObjectHideFlags: 0
  m_CorrespondingSourceObject: {fileID: 0}
  m_PrefabInstance: {fileID: 0}
  m_PrefabAsset: {fileID: 0}
  m_GameObject: {fileID: 0}
  m_Enabled: 1
  m_EditorHideFlags: 0
  m_Script: {fileID: 11500000, guid: 182eb47472f64de388dd50183c0411d8, type: 3}
  m_Name: SO_Infocard_513458
  m_EditorClassIdentifier: 
  <Key>k__BackingField: 513458
  <Value>k__BackingField: 'The Gaians won''t survive in their current form, I think.
    Not much longer. Their numbers have gone down ever since they got pounded hard
    by the Gallic Navy in Edinburgh. Those that survived that attack are veterans
    now, but their numbers are few. They''re also struggling with their cause. Gaia
    isn''t being threatened by Planetform anymore. <br>


'
