%YAML 1.1
%TAG !u! tag:unity3d.com,2011:
--- !u!114 &11400000
MonoBehaviour:
  m_ObjectHideFlags: 0
  m_CorrespondingSourceObject: {fileID: 0}
  m_PrefabInstance: {fileID: 0}
  m_PrefabAsset: {fileID: 0}
  m_GameObject: {fileID: 0}
  m_Enabled: 1
  m_EditorHideFlags: 0
  m_Script: {fileID: 11500000, guid: b271f90cda31432883e1182aa0b8027c, type: 3}
  m_Name: SO_Faction_InterspaceCommerce
  m_EditorClassIdentifier: 
  serializationData:
    SerializedFormat: 2
    SerializedBytes: 
    ReferencedUnityObjects:
    - {fileID: 11400000, guid: da6f9dca6576448c9af6918d0be048ec, type: 2}
    - {fileID: 11400000, guid: 00a7aa20c48e948c1ab9d4d495e1e54d, type: 2}
    - {fileID: 11400000, guid: 9c88697e0ca324c5f996db13ee845cb7, type: 2}
    - {fileID: 11400000, guid: 0d46b2c39269747c59579a4408c34643, type: 2}
    - {fileID: 11400000, guid: 5aca43d48730e48bfac9635f7b72a6fe, type: 2}
    - {fileID: 11400000, guid: d178e38d1201b4e69b08f68dc51ada8d, type: 2}
    - {fileID: 11400000, guid: 17ca187d2c0e0435799c00a483fe495f, type: 2}
    - {fileID: 11400000, guid: 6a56ebfd596f2409ba6c1378638411a2, type: 2}
    - {fileID: 11400000, guid: 447a49d7c8e51492793ced160f8d42cb, type: 2}
    - {fileID: 11400000, guid: 9ab189d5539924ced9e4d91e5185813e, type: 2}
    - {fileID: 11400000, guid: 095c5c4e3c074457c942014f226e6293, type: 2}
    - {fileID: 11400000, guid: 7e5c119a3e5954c9d95a0fd5febc5ec5, type: 2}
    - {fileID: 11400000, guid: 63614196d1eaa49a1a325edd0ad54479, type: 2}
    - {fileID: 11400000, guid: 5ddc301b56cfb4344a71e27badc22f8a, type: 2}
    - {fileID: 11400000, guid: 233819f10e81045ecb2cd26402c94a86, type: 2}
    - {fileID: 11400000, guid: 67ffa408a1a9447749bb5ff7ee243b9b, type: 2}
    - {fileID: 11400000, guid: cdf28eab446214afc9cdde5c5b1fdc56, type: 2}
    - {fileID: 11400000, guid: 39861eec566044a80bf7d19edb385517, type: 2}
    - {fileID: 11400000, guid: 4d255a13a9aa74a5bbc933f6612cfbd8, type: 2}
    - {fileID: 11400000, guid: fa4eae277dff14ddeaf77f2e6d8733e9, type: 2}
    - {fileID: 11400000, guid: 64fa43a959e1a42a684bea5367d4ead1, type: 2}
    - {fileID: 11400000, guid: d918497363467490cab836f56ef0cb16, type: 2}
    - {fileID: 11400000, guid: 42ace5e27ed2e4d45b6ba3eec1febb3b, type: 2}
    - {fileID: 11400000, guid: a70b59cc9080e4dde8635e2b48d833ae, type: 2}
    - {fileID: 11400000, guid: ba2aebfd30f7549c583823c825b13fb2, type: 2}
    - {fileID: 11400000, guid: feb985b5dcaff413f9bf2b8d56b77006, type: 2}
    - {fileID: 11400000, guid: 047290a2a69cb4ec7815417d5119f332, type: 2}
    - {fileID: 11400000, guid: 811beb3ff1e3244508d2f3b576da2d4e, type: 2}
    - {fileID: 11400000, guid: ab1eba8cbbb9a4d83b2736018fec8afd, type: 2}
    - {fileID: 11400000, guid: 0c148135663eb4d27a1d495c34dfdfb7, type: 2}
    - {fileID: 11400000, guid: 478dd9a7b9f5d43c79896e4180bbcc88, type: 2}
    - {fileID: 11400000, guid: cdc2a0f492bb8492ba7e596718895362, type: 2}
    - {fileID: 11400000, guid: 9838cd2a642214500bb05f4d2651a4f7, type: 2}
    - {fileID: 11400000, guid: fd92c5374f2b944deb6a06a2efebd0a5, type: 2}
    - {fileID: 11400000, guid: a8ccb27f7c05c4eec8bce2cec0734151, type: 2}
    - {fileID: 11400000, guid: 2f24a9f24b6624e068c90fb1a916c98c, type: 2}
    - {fileID: 11400000, guid: ad4d58060aa8c4b47814b8a7114ce222, type: 2}
    - {fileID: 11400000, guid: bf6609ff962bf43ba9f1edb605bc91af, type: 2}
    - {fileID: 11400000, guid: d324f66a3e2414fccbdd15ffe1902df5, type: 2}
    - {fileID: 11400000, guid: 1afd41308bbb6433390e74af2066c1ca, type: 2}
    - {fileID: 11400000, guid: 6b4a63a649535455091c84df3485059e, type: 2}
    - {fileID: 11400000, guid: cec6002b426154c94bba7ff771f75e9d, type: 2}
    - {fileID: 11400000, guid: 10449b69f19c24d90ad54ed9d60b7256, type: 2}
    - {fileID: 11400000, guid: f5db549bc6f544772bfb28f33cb59ded, type: 2}
    - {fileID: 11400000, guid: 5e23e20842aa4496882b507b57edb054, type: 2}
    - {fileID: 11400000, guid: d4a232a65085147f1b3a4dcc0abc94d4, type: 2}
    - {fileID: 11400000, guid: f794371ec12354f8c9020ccde5db8c20, type: 2}
    - {fileID: 11400000, guid: 40c3ce01a8b4c4d379e10a23e2c69545, type: 2}
    - {fileID: 11400000, guid: 9876c6066afbe4c278e6df7867203c51, type: 2}
    - {fileID: 11400000, guid: 03783c18edc5f40eead1c7d09289700f, type: 2}
    - {fileID: 11400000, guid: 4402e096209084785ab194afa25da1b1, type: 2}
    - {fileID: 11400000, guid: 9d5bbb291524b4141b849f086d39319b, type: 2}
    - {fileID: 11400000, guid: 4fcafd485d33849e285f88ecc469d40f, type: 2}
    - {fileID: 11400000, guid: 45069beacc2f04a15a79da10c79e74a0, type: 2}
    - {fileID: 11400000, guid: 2d47234e1ac254c7c9e9e107a5263bfc, type: 2}
    - {fileID: 11400000, guid: 0508c29c7342545818479a1c76e6131b, type: 2}
    - {fileID: 11400000, guid: 4d73ec3a6d088418fad3112db70e7447, type: 2}
    - {fileID: 11400000, guid: 92ea5a3f8686640ec99793b705cda8c1, type: 2}
    - {fileID: 11400000, guid: c8061fc561e714aca9e492105eab1b66, type: 2}
    - {fileID: 11400000, guid: 49355e79c95cd4eb3b8045facaa333dd, type: 2}
    - {fileID: 11400000, guid: e0bf417601c134fe1abceb2c70f52de5, type: 2}
    - {fileID: 11400000, guid: 8232dd183e85a4f8b9b6274a7ba0ed54, type: 2}
    - {fileID: 11400000, guid: 232fc4c0e320849c798be2ff70adc705, type: 2}
    - {fileID: 11400000, guid: 224034bc117bd4981a651849c5d5411f, type: 2}
    - {fileID: 11400000, guid: 26fd66f09b0454c269af5b8e4272275e, type: 2}
    - {fileID: 11400000, guid: c3d7174963a40413aa12eaf5f9fb2d84, type: 2}
    - {fileID: 11400000, guid: 7cd8805c7d9cf4f77ad4542f6a43cb37, type: 2}
    - {fileID: 11400000, guid: f1425f2682fcf40d9a5e162d42f4911d, type: 2}
    - {fileID: 11400000, guid: 54e7cf7266c6b4cf59586026a6cb92cd, type: 2}
    - {fileID: 11400000, guid: 03d2738a53c164a7d9b1065ccc8142d4, type: 2}
    - {fileID: 11400000, guid: 1031cc966df7b48beb6f3c2d14e5323d, type: 2}
    - {fileID: 11400000, guid: af80151afabeb4f7cab31b1ed9607f92, type: 2}
    - {fileID: 11400000, guid: 71751afc4a5a84163980ade9d083f5de, type: 2}
    - {fileID: 11400000, guid: 5596a7217ac7b43b1b07a0b61b9994dd, type: 2}
    - {fileID: 11400000, guid: a637f463bcabb4b7e95ce688046f2221, type: 2}
    - {fileID: 11400000, guid: 8b453b309427a4cbeb0e5977b73e207a, type: 2}
    - {fileID: 11400000, guid: 3266b4602c0c94619ac735ea8419e4b0, type: 2}
    - {fileID: 11400000, guid: 910e69157ed314a559976e453f00d7eb, type: 2}
    - {fileID: 11400000, guid: 48107b896e15748e59e1620132ea7c77, type: 2}
    - {fileID: 11400000, guid: 8929dacb837584927b971816690a6d84, type: 2}
    - {fileID: 11400000, guid: 5a64ae770d0b248d499f577e4a8b40ea, type: 2}
    - {fileID: 11400000, guid: 4d98b6455ee2040ed9edbf8d0e3040f4, type: 2}
    - {fileID: 11400000, guid: d497157d2c4ea4483a4ab971712a2337, type: 2}
    - {fileID: 11400000, guid: 0d25fbec241054f1f95e1948a79dcb73, type: 2}
    - {fileID: 11400000, guid: 982b997ef395849cba3b987b525c1a34, type: 2}
    - {fileID: 11400000, guid: 4acee8d2090a94ceda7f681738ac2b0e, type: 2}
    - {fileID: 11400000, guid: 0e4c76435b9f5498e88944e2690aa757, type: 2}
    - {fileID: 11400000, guid: 8c971538c5d2448a9acec55ab4600529, type: 2}
    - {fileID: 11400000, guid: 4e42b403776344d20969db089ff049af, type: 2}
    - {fileID: 11400000, guid: 39373bceedac745c19b25319b744e012, type: 2}
    - {fileID: 11400000, guid: dea64c692d83c43b684f4ecb535cf266, type: 2}
    - {fileID: 11400000, guid: 809142177ffa54bbfbdf8bb9b087e822, type: 2}
    - {fileID: 11400000, guid: 08d7ee4fa04de4c2184de84c0db3d1eb, type: 2}
    - {fileID: 11400000, guid: 8134475461e4441509aa991e4e6830ae, type: 2}
    - {fileID: 11400000, guid: 111819896eed84840b958c3c96158a47, type: 2}
    - {fileID: 11400000, guid: 8c3511642392d4188a0332b571257691, type: 2}
    - {fileID: 11400000, guid: 89cff6b18b70c479caaec2cf10ae690b, type: 2}
    - {fileID: 11400000, guid: 89b2b26e9b01c4d00a428ddd35d7b6f7, type: 2}
    - {fileID: 11400000, guid: 0074f75a8bba44a0192f7ace091c5d70, type: 2}
    - {fileID: 11400000, guid: e61e87ef0727c486bbe736f9dd7b60ef, type: 2}
    - {fileID: 11400000, guid: 9458b8744078247c8bceab2f4b43978b, type: 2}
    - {fileID: 11400000, guid: d447b982c6f304c66bcf6f3ebb1735f1, type: 2}
    - {fileID: 11400000, guid: 0d04fcb5ea0dd4089a3f393336d1d6fd, type: 2}
    - {fileID: 11400000, guid: 74bfb4f72f4ba467dbba6c377992c427, type: 2}
    - {fileID: 11400000, guid: e6935490ffda241649e62077c49e8981, type: 2}
    - {fileID: 11400000, guid: 87bbde3f68a1f4200b727abfd4568824, type: 2}
    - {fileID: 11400000, guid: 1380a5f59aa9d4bc28c47cc1e4f8cccc, type: 2}
    - {fileID: 11400000, guid: c7c86cf849b5f42e3af45ee4801e4763, type: 2}
    - {fileID: 11400000, guid: 00fc966bbd383438ca43aa36e0c894f1, type: 2}
    - {fileID: 11400000, guid: 049aabed34622436fbbfa19582c4c387, type: 2}
    - {fileID: 11400000, guid: 271e23f43076b49b1b1a9faec6f1e8ff, type: 2}
    - {fileID: 11400000, guid: d55d0c73d875b48da9b65d77c2d55359, type: 2}
    - {fileID: 11400000, guid: 714941253c28140ab81a8b30fd6d6ac7, type: 2}
    - {fileID: 11400000, guid: 54f3f438b633f4804a5edd5657a5c1eb, type: 2}
    - {fileID: 11400000, guid: 6cfa78a84a81b4289b06f0fbe7cd048f, type: 2}
    - {fileID: 11400000, guid: 69aab0e35f1d84b99836e7c767199904, type: 2}
    - {fileID: 11400000, guid: f697b3a90ee43440c8018208ab5db97c, type: 2}
    - {fileID: 11400000, guid: 61d09f5300da84780b2cf555435937d4, type: 2}
    - {fileID: 11400000, guid: f1c38c5e4564941fa8daf1da9e57290e, type: 2}
    - {fileID: 11400000, guid: a612d9a09a3f74dd4acdb868fbe5637d, type: 2}
    - {fileID: 11400000, guid: b1174dbc0ea4b4605ac73aec1794615f, type: 2}
    - {fileID: 11400000, guid: 711b1f22ae8b14d13941aa71b1e13089, type: 2}
    - {fileID: 11400000, guid: 238f188752fe84917a4b94dfc1e36454, type: 2}
    - {fileID: 11400000, guid: 6cf279af939f04931989dca8e489f1a3, type: 2}
    - {fileID: 11400000, guid: 4318d5202b12c475b8944a14b006935f, type: 2}
    - {fileID: 11400000, guid: 440c5ed1321e34a72b54a97e45d15efa, type: 2}
    - {fileID: 11400000, guid: 30502110961f54324af16598b104c600, type: 2}
    - {fileID: 11400000, guid: 99a419a824ecb491592faf28a85299dd, type: 2}
    - {fileID: 11400000, guid: 0e7988087ca3f4765b3d8acbb6b27a94, type: 2}
    - {fileID: 11400000, guid: 6828640e78638474c82c275fb834d5a9, type: 2}
    - {fileID: 11400000, guid: bf84c15eb6bd14f62946e2de6f7b5d4b, type: 2}
    - {fileID: 11400000, guid: e7ae2437699fc433e902316129596366, type: 2}
    - {fileID: 11400000, guid: 10266b1d6b1fb42bfb1ea139de40be38, type: 2}
    - {fileID: 11400000, guid: 20040716bd884418cbcb2a44cfdce8f6, type: 2}
    - {fileID: 11400000, guid: a150569784e1a44f4b02d0f5ef0319a0, type: 2}
    - {fileID: 11400000, guid: 8da393855f4c84cbab5f90ffa5c28fb1, type: 2}
    - {fileID: 11400000, guid: ca8dd17e83fde494eab2ed2f26ed04b6, type: 2}
    - {fileID: 11400000, guid: 4d389a19ede21477bad23c8e3c7931c5, type: 2}
    - {fileID: 11400000, guid: 284b2542aede748b4934bfcebb896a9d, type: 2}
    - {fileID: 11400000, guid: ab9ef4ad202bb483eb2394246324c932, type: 2}
    - {fileID: 11400000, guid: 6bab5e18dae0642a58acc6dbe3906f26, type: 2}
    - {fileID: 11400000, guid: cc846138152064689844eeaa44ff919a, type: 2}
    SerializedBytesString: 
    Prefab: {fileID: 0}
    PrefabModificationsReferencedUnityObjects: []
    PrefabModifications: []
    SerializationNodes:
    - Name: <Name>k__BackingField
      Entry: 10
      Data: 0
    - Name: <ShortName>k__BackingField
      Entry: 10
      Data: 1
    - Name: <Infocard>k__BackingField
      Entry: 10
      Data: 2
    - Name: <Reputations>k__BackingField
      Entry: 7
      Data: 0|System.Collections.Generic.Dictionary`2[[FreelancerDataTool.Interfaces.IFaction,
        Assembly-CSharp],[System.Single, mscorlib]], mscorlib
    - Name: comparer
      Entry: 7
      Data: 1|System.Collections.Generic.ObjectEqualityComparer`1[[FreelancerDataTool.Interfaces.IFaction,
        Assembly-CSharp]], mscorlib
    - Name: 
      Entry: 8
      Data: 
    - Name: 
      Entry: 12
      Data: 57
    - Name: 
      Entry: 7
      Data: 
    - Name: $k
      Entry: 10
      Data: 3
    - Name: $v
      Entry: 4
      Data: -0.65
    - Name: 
      Entry: 8
      Data: 
    - Name: 
      Entry: 7
      Data: 
    - Name: $k
      Entry: 10
      Data: 4
    - Name: $v
      Entry: 4
      Data: -0.65
    - Name: 
      Entry: 8
      Data: 
    - Name: 
      Entry: 7
      Data: 
    - Name: $k
      Entry: 10
      Data: 5
    - Name: $v
      Entry: 4
      Data: -0.65
    - Name: 
      Entry: 8
      Data: 
    - Name: 
      Entry: 7
      Data: 
    - Name: $k
      Entry: 10
      Data: 6
    - Name: $v
      Entry: 4
      Data: -0.65
    - Name: 
      Entry: 8
      Data: 
    - Name: 
      Entry: 7
      Data: 
    - Name: $k
      Entry: 10
      Data: 7
    - Name: $v
      Entry: 4
      Data: -0.65
    - Name: 
      Entry: 8
      Data: 
    - Name: 
      Entry: 7
      Data: 
    - Name: $k
      Entry: 10
      Data: 8
    - Name: $v
      Entry: 4
      Data: -0.65
    - Name: 
      Entry: 8
      Data: 
    - Name: 
      Entry: 7
      Data: 
    - Name: $k
      Entry: 10
      Data: 9
    - Name: $v
      Entry: 4
      Data: -0.65
    - Name: 
      Entry: 8
      Data: 
    - Name: 
      Entry: 7
      Data: 
    - Name: $k
      Entry: 10
      Data: 10
    - Name: $v
      Entry: 4
      Data: -0.65
    - Name: 
      Entry: 8
      Data: 
    - Name: 
      Entry: 7
      Data: 
    - Name: $k
      Entry: 10
      Data: 11
    - Name: $v
      Entry: 4
      Data: -0.65
    - Name: 
      Entry: 8
      Data: 
    - Name: 
      Entry: 7
      Data: 
    - Name: $k
      Entry: 10
      Data: 12
    - Name: $v
      Entry: 4
      Data: -0.65
    - Name: 
      Entry: 8
      Data: 
    - Name: 
      Entry: 7
      Data: 
    - Name: $k
      Entry: 10
      Data: 13
    - Name: $v
      Entry: 4
      Data: -0.65
    - Name: 
      Entry: 8
      Data: 
    - Name: 
      Entry: 7
      Data: 
    - Name: $k
      Entry: 10
      Data: 14
    - Name: $v
      Entry: 4
      Data: -0.65
    - Name: 
      Entry: 8
      Data: 
    - Name: 
      Entry: 7
      Data: 
    - Name: $k
      Entry: 10
      Data: 15
    - Name: $v
      Entry: 4
      Data: -0.65
    - Name: 
      Entry: 8
      Data: 
    - Name: 
      Entry: 7
      Data: 
    - Name: $k
      Entry: 10
      Data: 16
    - Name: $v
      Entry: 4
      Data: -0.65
    - Name: 
      Entry: 8
      Data: 
    - Name: 
      Entry: 7
      Data: 
    - Name: $k
      Entry: 10
      Data: 17
    - Name: $v
      Entry: 4
      Data: -0.65
    - Name: 
      Entry: 8
      Data: 
    - Name: 
      Entry: 7
      Data: 
    - Name: $k
      Entry: 10
      Data: 18
    - Name: $v
      Entry: 4
      Data: -0.65
    - Name: 
      Entry: 8
      Data: 
    - Name: 
      Entry: 7
      Data: 
    - Name: $k
      Entry: 10
      Data: 19
    - Name: $v
      Entry: 4
      Data: -0.65
    - Name: 
      Entry: 8
      Data: 
    - Name: 
      Entry: 7
      Data: 
    - Name: $k
      Entry: 10
      Data: 20
    - Name: $v
      Entry: 4
      Data: -0.65
    - Name: 
      Entry: 8
      Data: 
    - Name: 
      Entry: 7
      Data: 
    - Name: $k
      Entry: 10
      Data: 21
    - Name: $v
      Entry: 4
      Data: -0.65
    - Name: 
      Entry: 8
      Data: 
    - Name: 
      Entry: 7
      Data: 
    - Name: $k
      Entry: 10
      Data: 22
    - Name: $v
      Entry: 4
      Data: -0.65
    - Name: 
      Entry: 8
      Data: 
    - Name: 
      Entry: 7
      Data: 
    - Name: $k
      Entry: 10
      Data: 23
    - Name: $v
      Entry: 4
      Data: -0.65
    - Name: 
      Entry: 8
      Data: 
    - Name: 
      Entry: 7
      Data: 
    - Name: $k
      Entry: 10
      Data: 24
    - Name: $v
      Entry: 4
      Data: -0.65
    - Name: 
      Entry: 8
      Data: 
    - Name: 
      Entry: 7
      Data: 
    - Name: $k
      Entry: 10
      Data: 25
    - Name: $v
      Entry: 4
      Data: -0.65
    - Name: 
      Entry: 8
      Data: 
    - Name: 
      Entry: 7
      Data: 
    - Name: $k
      Entry: 10
      Data: 26
    - Name: $v
      Entry: 4
      Data: -0.65
    - Name: 
      Entry: 8
      Data: 
    - Name: 
      Entry: 7
      Data: 
    - Name: $k
      Entry: 10
      Data: 27
    - Name: $v
      Entry: 4
      Data: -0.65
    - Name: 
      Entry: 8
      Data: 
    - Name: 
      Entry: 7
      Data: 
    - Name: $k
      Entry: 10
      Data: 28
    - Name: $v
      Entry: 4
      Data: -0.3
    - Name: 
      Entry: 8
      Data: 
    - Name: 
      Entry: 7
      Data: 
    - Name: $k
      Entry: 10
      Data: 29
    - Name: $v
      Entry: 4
      Data: -0.3
    - Name: 
      Entry: 8
      Data: 
    - Name: 
      Entry: 7
      Data: 
    - Name: $k
      Entry: 10
      Data: 30
    - Name: $v
      Entry: 4
      Data: -0.3
    - Name: 
      Entry: 8
      Data: 
    - Name: 
      Entry: 7
      Data: 
    - Name: $k
      Entry: 10
      Data: 31
    - Name: $v
      Entry: 4
      Data: -0.3
    - Name: 
      Entry: 8
      Data: 
    - Name: 
      Entry: 7
      Data: 
    - Name: $k
      Entry: 10
      Data: 32
    - Name: $v
      Entry: 4
      Data: -0.3
    - Name: 
      Entry: 8
      Data: 
    - Name: 
      Entry: 7
      Data: 
    - Name: $k
      Entry: 10
      Data: 33
    - Name: $v
      Entry: 4
      Data: -0.3
    - Name: 
      Entry: 8
      Data: 
    - Name: 
      Entry: 7
      Data: 
    - Name: $k
      Entry: 10
      Data: 34
    - Name: $v
      Entry: 4
      Data: -0.3
    - Name: 
      Entry: 8
      Data: 
    - Name: 
      Entry: 7
      Data: 
    - Name: $k
      Entry: 10
      Data: 35
    - Name: $v
      Entry: 4
      Data: -0.3
    - Name: 
      Entry: 8
      Data: 
    - Name: 
      Entry: 7
      Data: 
    - Name: $k
      Entry: 10
      Data: 36
    - Name: $v
      Entry: 4
      Data: -0.3
    - Name: 
      Entry: 8
      Data: 
    - Name: 
      Entry: 7
      Data: 
    - Name: $k
      Entry: 10
      Data: 37
    - Name: $v
      Entry: 4
      Data: 0.3
    - Name: 
      Entry: 8
      Data: 
    - Name: 
      Entry: 7
      Data: 
    - Name: $k
      Entry: 10
      Data: 38
    - Name: $v
      Entry: 4
      Data: 0.3
    - Name: 
      Entry: 8
      Data: 
    - Name: 
      Entry: 7
      Data: 
    - Name: $k
      Entry: 10
      Data: 39
    - Name: $v
      Entry: 4
      Data: 0.3
    - Name: 
      Entry: 8
      Data: 
    - Name: 
      Entry: 7
      Data: 
    - Name: $k
      Entry: 10
      Data: 40
    - Name: $v
      Entry: 4
      Data: 0.3
    - Name: 
      Entry: 8
      Data: 
    - Name: 
      Entry: 7
      Data: 
    - Name: $k
      Entry: 10
      Data: 41
    - Name: $v
      Entry: 4
      Data: 0.3
    - Name: 
      Entry: 8
      Data: 
    - Name: 
      Entry: 7
      Data: 
    - Name: $k
      Entry: 10
      Data: 42
    - Name: $v
      Entry: 4
      Data: 0.3
    - Name: 
      Entry: 8
      Data: 
    - Name: 
      Entry: 7
      Data: 
    - Name: $k
      Entry: 10
      Data: 43
    - Name: $v
      Entry: 4
      Data: 0.3
    - Name: 
      Entry: 8
      Data: 
    - Name: 
      Entry: 7
      Data: 
    - Name: $k
      Entry: 10
      Data: 44
    - Name: $v
      Entry: 4
      Data: 0.3
    - Name: 
      Entry: 8
      Data: 
    - Name: 
      Entry: 7
      Data: 
    - Name: $k
      Entry: 10
      Data: 45
    - Name: $v
      Entry: 4
      Data: 0.3
    - Name: 
      Entry: 8
      Data: 
    - Name: 
      Entry: 7
      Data: 
    - Name: $k
      Entry: 10
      Data: 46
    - Name: $v
      Entry: 4
      Data: 0.3
    - Name: 
      Entry: 8
      Data: 
    - Name: 
      Entry: 7
      Data: 
    - Name: $k
      Entry: 10
      Data: 47
    - Name: $v
      Entry: 4
      Data: 0.3
    - Name: 
      Entry: 8
      Data: 
    - Name: 
      Entry: 7
      Data: 
    - Name: $k
      Entry: 10
      Data: 48
    - Name: $v
      Entry: 4
      Data: 0.65
    - Name: 
      Entry: 8
      Data: 
    - Name: 
      Entry: 7
      Data: 
    - Name: $k
      Entry: 10
      Data: 49
    - Name: $v
      Entry: 4
      Data: 0.65
    - Name: 
      Entry: 8
      Data: 
    - Name: 
      Entry: 7
      Data: 
    - Name: $k
      Entry: 10
      Data: 50
    - Name: $v
      Entry: 4
      Data: 0.65
    - Name: 
      Entry: 8
      Data: 
    - Name: 
      Entry: 7
      Data: 
    - Name: $k
      Entry: 10
      Data: 51
    - Name: $v
      Entry: 4
      Data: 0.65
    - Name: 
      Entry: 8
      Data: 
    - Name: 
      Entry: 7
      Data: 
    - Name: $k
      Entry: 10
      Data: 52
    - Name: $v
      Entry: 4
      Data: 0.65
    - Name: 
      Entry: 8
      Data: 
    - Name: 
      Entry: 7
      Data: 
    - Name: $k
      Entry: 10
      Data: 53
    - Name: $v
      Entry: 4
      Data: 0.65
    - Name: 
      Entry: 8
      Data: 
    - Name: 
      Entry: 7
      Data: 
    - Name: $k
      Entry: 10
      Data: 54
    - Name: $v
      Entry: 4
      Data: 0.65
    - Name: 
      Entry: 8
      Data: 
    - Name: 
      Entry: 7
      Data: 
    - Name: $k
      Entry: 10
      Data: 55
    - Name: $v
      Entry: 4
      Data: 0.65
    - Name: 
      Entry: 8
      Data: 
    - Name: 
      Entry: 7
      Data: 
    - Name: $k
      Entry: 10
      Data: 56
    - Name: $v
      Entry: 4
      Data: 0.65
    - Name: 
      Entry: 8
      Data: 
    - Name: 
      Entry: 7
      Data: 
    - Name: $k
      Entry: 10
      Data: 57
    - Name: $v
      Entry: 4
      Data: 0.65
    - Name: 
      Entry: 8
      Data: 
    - Name: 
      Entry: 7
      Data: 
    - Name: $k
      Entry: 10
      Data: 58
    - Name: $v
      Entry: 4
      Data: 0.65
    - Name: 
      Entry: 8
      Data: 
    - Name: 
      Entry: 7
      Data: 
    - Name: $k
      Entry: 10
      Data: 59
    - Name: $v
      Entry: 4
      Data: 0.65
    - Name: 
      Entry: 8
      Data: 
    - Name: 
      Entry: 13
      Data: 
    - Name: 
      Entry: 8
      Data: 
    - Name: <NpcBribers>k__BackingField
      Entry: 7
      Data: 2|System.Collections.Generic.Dictionary`2[[FreelancerDataTool.Interfaces.INpc,
        Assembly-CSharp],[System.Single, mscorlib]], mscorlib
    - Name: comparer
      Entry: 7
      Data: 3|System.Collections.Generic.ObjectEqualityComparer`1[[FreelancerDataTool.Interfaces.INpc,
        Assembly-CSharp]], mscorlib
    - Name: 
      Entry: 8
      Data: 
    - Name: 
      Entry: 12
      Data: 17
    - Name: 
      Entry: 7
      Data: 
    - Name: $k
      Entry: 10
      Data: 60
    - Name: $v
      Entry: 4
      Data: 840
    - Name: 
      Entry: 8
      Data: 
    - Name: 
      Entry: 7
      Data: 
    - Name: $k
      Entry: 10
      Data: 61
    - Name: $v
      Entry: 4
      Data: 840
    - Name: 
      Entry: 8
      Data: 
    - Name: 
      Entry: 7
      Data: 
    - Name: $k
      Entry: 10
      Data: 62
    - Name: $v
      Entry: 4
      Data: 840
    - Name: 
      Entry: 8
      Data: 
    - Name: 
      Entry: 7
      Data: 
    - Name: $k
      Entry: 10
      Data: 63
    - Name: $v
      Entry: 4
      Data: 840
    - Name: 
      Entry: 8
      Data: 
    - Name: 
      Entry: 7
      Data: 
    - Name: $k
      Entry: 10
      Data: 64
    - Name: $v
      Entry: 4
      Data: 840
    - Name: 
      Entry: 8
      Data: 
    - Name: 
      Entry: 7
      Data: 
    - Name: $k
      Entry: 10
      Data: 65
    - Name: $v
      Entry: 4
      Data: 840
    - Name: 
      Entry: 8
      Data: 
    - Name: 
      Entry: 7
      Data: 
    - Name: $k
      Entry: 10
      Data: 66
    - Name: $v
      Entry: 4
      Data: 840
    - Name: 
      Entry: 8
      Data: 
    - Name: 
      Entry: 7
      Data: 
    - Name: $k
      Entry: 10
      Data: 67
    - Name: $v
      Entry: 4
      Data: 840
    - Name: 
      Entry: 8
      Data: 
    - Name: 
      Entry: 7
      Data: 
    - Name: $k
      Entry: 10
      Data: 68
    - Name: $v
      Entry: 4
      Data: 840
    - Name: 
      Entry: 8
      Data: 
    - Name: 
      Entry: 7
      Data: 
    - Name: $k
      Entry: 10
      Data: 69
    - Name: $v
      Entry: 4
      Data: 840
    - Name: 
      Entry: 8
      Data: 
    - Name: 
      Entry: 7
      Data: 
    - Name: $k
      Entry: 10
      Data: 70
    - Name: $v
      Entry: 4
      Data: 840
    - Name: 
      Entry: 8
      Data: 
    - Name: 
      Entry: 7
      Data: 
    - Name: $k
      Entry: 10
      Data: 71
    - Name: $v
      Entry: 4
      Data: 840
    - Name: 
      Entry: 8
      Data: 
    - Name: 
      Entry: 7
      Data: 
    - Name: $k
      Entry: 10
      Data: 72
    - Name: $v
      Entry: 4
      Data: 840
    - Name: 
      Entry: 8
      Data: 
    - Name: 
      Entry: 7
      Data: 
    - Name: $k
      Entry: 10
      Data: 73
    - Name: $v
      Entry: 4
      Data: 840
    - Name: 
      Entry: 8
      Data: 
    - Name: 
      Entry: 7
      Data: 
    - Name: $k
      Entry: 10
      Data: 74
    - Name: $v
      Entry: 4
      Data: 840
    - Name: 
      Entry: 8
      Data: 
    - Name: 
      Entry: 7
      Data: 
    - Name: $k
      Entry: 10
      Data: 75
    - Name: $v
      Entry: 4
      Data: 840
    - Name: 
      Entry: 8
      Data: 
    - Name: 
      Entry: 7
      Data: 
    - Name: $k
      Entry: 10
      Data: 76
    - Name: $v
      Entry: 4
      Data: 840
    - Name: 
      Entry: 8
      Data: 
    - Name: 
      Entry: 13
      Data: 
    - Name: 
      Entry: 8
      Data: 
    - Name: <ShipsUsed>k__BackingField
      Entry: 7
      Data: 4|System.Collections.Generic.List`1[[FreelancerDataTool.Interfaces.IShip,
        Assembly-CSharp]], mscorlib
    - Name: 
      Entry: 12
      Data: 9
    - Name: 
      Entry: 10
      Data: 77
    - Name: 
      Entry: 10
      Data: 78
    - Name: 
      Entry: 10
      Data: 79
    - Name: 
      Entry: 10
      Data: 80
    - Name: 
      Entry: 10
      Data: 81
    - Name: 
      Entry: 10
      Data: 82
    - Name: 
      Entry: 10
      Data: 83
    - Name: 
      Entry: 10
      Data: 84
    - Name: 
      Entry: 10
      Data: 85
    - Name: 
      Entry: 13
      Data: 
    - Name: 
      Entry: 8
      Data: 
    - Name: <OwnedBases>k__BackingField
      Entry: 7
      Data: 5|System.Collections.Generic.List`1[[FreelancerDataTool.Interfaces.IBase,
        Assembly-CSharp]], mscorlib
    - Name: 
      Entry: 12
      Data: 4
    - Name: 
      Entry: 10
      Data: 86
    - Name: 
      Entry: 10
      Data: 87
    - Name: 
      Entry: 10
      Data: 88
    - Name: 
      Entry: 10
      Data: 89
    - Name: 
      Entry: 13
      Data: 
    - Name: 
      Entry: 8
      Data: 
    - Name: <Npcs>k__BackingField
      Entry: 7
      Data: 6|System.Collections.Generic.List`1[[FreelancerDataTool.Interfaces.INpc,
        Assembly-CSharp]], mscorlib
    - Name: 
      Entry: 12
      Data: 64
    - Name: 
      Entry: 10
      Data: 60
    - Name: 
      Entry: 10
      Data: 90
    - Name: 
      Entry: 10
      Data: 91
    - Name: 
      Entry: 10
      Data: 92
    - Name: 
      Entry: 10
      Data: 93
    - Name: 
      Entry: 10
      Data: 94
    - Name: 
      Entry: 10
      Data: 95
    - Name: 
      Entry: 10
      Data: 62
    - Name: 
      Entry: 10
      Data: 63
    - Name: 
      Entry: 10
      Data: 64
    - Name: 
      Entry: 10
      Data: 96
    - Name: 
      Entry: 10
      Data: 97
    - Name: 
      Entry: 10
      Data: 98
    - Name: 
      Entry: 10
      Data: 65
    - Name: 
      Entry: 10
      Data: 66
    - Name: 
      Entry: 10
      Data: 67
    - Name: 
      Entry: 10
      Data: 68
    - Name: 
      Entry: 10
      Data: 99
    - Name: 
      Entry: 10
      Data: 100
    - Name: 
      Entry: 10
      Data: 101
    - Name: 
      Entry: 10
      Data: 70
    - Name: 
      Entry: 10
      Data: 102
    - Name: 
      Entry: 10
      Data: 103
    - Name: 
      Entry: 10
      Data: 104
    - Name: 
      Entry: 10
      Data: 105
    - Name: 
      Entry: 10
      Data: 106
    - Name: 
      Entry: 10
      Data: 107
    - Name: 
      Entry: 10
      Data: 108
    - Name: 
      Entry: 10
      Data: 72
    - Name: 
      Entry: 10
      Data: 109
    - Name: 
      Entry: 10
      Data: 110
    - Name: 
      Entry: 10
      Data: 111
    - Name: 
      Entry: 10
      Data: 112
    - Name: 
      Entry: 10
      Data: 113
    - Name: 
      Entry: 10
      Data: 114
    - Name: 
      Entry: 10
      Data: 115
    - Name: 
      Entry: 10
      Data: 116
    - Name: 
      Entry: 10
      Data: 117
    - Name: 
      Entry: 10
      Data: 118
    - Name: 
      Entry: 10
      Data: 119
    - Name: 
      Entry: 10
      Data: 120
    - Name: 
      Entry: 10
      Data: 121
    - Name: 
      Entry: 10
      Data: 122
    - Name: 
      Entry: 10
      Data: 123
    - Name: 
      Entry: 10
      Data: 124
    - Name: 
      Entry: 10
      Data: 125
    - Name: 
      Entry: 10
      Data: 126
    - Name: 
      Entry: 10
      Data: 127
    - Name: 
      Entry: 10
      Data: 73
    - Name: 
      Entry: 10
      Data: 128
    - Name: 
      Entry: 10
      Data: 129
    - Name: 
      Entry: 10
      Data: 130
    - Name: 
      Entry: 10
      Data: 131
    - Name: 
      Entry: 10
      Data: 132
    - Name: 
      Entry: 10
      Data: 133
    - Name: 
      Entry: 10
      Data: 134
    - Name: 
      Entry: 10
      Data: 135
    - Name: 
      Entry: 10
      Data: 76
    - Name: 
      Entry: 10
      Data: 136
    - Name: 
      Entry: 10
      Data: 137
    - Name: 
      Entry: 10
      Data: 138
    - Name: 
      Entry: 10
      Data: 139
    - Name: 
      Entry: 10
      Data: 140
    - Name: 
      Entry: 10
      Data: 141
    - Name: 
      Entry: 13
      Data: 
    - Name: 
      Entry: 8
      Data: 
  <Nickname>k__BackingField: co_ic_grp
  <Logo>k__BackingField: {fileID: 21300000, guid: 599490456a1134a728d6ca76dd377359, type: 3}
  <Legality>k__BackingField: lawful
  <JumpPreference>k__BackingField: any
  <ScanAnnounce>k__BackingField: 0
  <ScanChance>k__BackingField: 0
