%YAML 1.1
%TAG !u! tag:unity3d.com,2011:
--- !u!114 &11400000
MonoBehaviour:
  m_ObjectHideFlags: 0
  m_CorrespondingSourceObject: {fileID: 0}
  m_PrefabInstance: {fileID: 0}
  m_PrefabAsset: {fileID: 0}
  m_GameObject: {fileID: 0}
  m_Enabled: 1
  m_EditorHideFlags: 0
  m_Script: {fileID: 11500000, guid: b271f90cda31432883e1182aa0b8027c, type: 3}
  m_Name: SO_Faction_BMM
  m_EditorClassIdentifier: 
  serializationData:
    SerializedFormat: 2
    SerializedBytes: 
    ReferencedUnityObjects:
    - {fileID: 11400000, guid: 23e2328fed9f84a78914cae590f1093c, type: 2}
    - {fileID: 11400000, guid: 07637e8c0b39a48a3807e1c6e0b9fcec, type: 2}
    - {fileID: 11400000, guid: 1ceab974f296e4d9cb3d0b2651f247e3, type: 2}
    - {fileID: 11400000, guid: 0d46b2c39269747c59579a4408c34643, type: 2}
    - {fileID: 11400000, guid: 5aca43d48730e48bfac9635f7b72a6fe, type: 2}
    - {fileID: 11400000, guid: 744c518d1bf5c4b8c9902224ba93cbcb, type: 2}
    - {fileID: 11400000, guid: d178e38d1201b4e69b08f68dc51ada8d, type: 2}
    - {fileID: 11400000, guid: 17ca187d2c0e0435799c00a483fe495f, type: 2}
    - {fileID: 11400000, guid: 6a56ebfd596f2409ba6c1378638411a2, type: 2}
    - {fileID: 11400000, guid: 447a49d7c8e51492793ced160f8d42cb, type: 2}
    - {fileID: 11400000, guid: 9ab189d5539924ced9e4d91e5185813e, type: 2}
    - {fileID: 11400000, guid: 095c5c4e3c074457c942014f226e6293, type: 2}
    - {fileID: 11400000, guid: 7e5c119a3e5954c9d95a0fd5febc5ec5, type: 2}
    - {fileID: 11400000, guid: 9f1fe5ebfab8c441eb4e132055568dd4, type: 2}
    - {fileID: 11400000, guid: 5ddc301b56cfb4344a71e27badc22f8a, type: 2}
    - {fileID: 11400000, guid: 233819f10e81045ecb2cd26402c94a86, type: 2}
    - {fileID: 11400000, guid: 67ffa408a1a9447749bb5ff7ee243b9b, type: 2}
    - {fileID: 11400000, guid: cdf28eab446214afc9cdde5c5b1fdc56, type: 2}
    - {fileID: 11400000, guid: 4d255a13a9aa74a5bbc933f6612cfbd8, type: 2}
    - {fileID: 11400000, guid: fa4eae277dff14ddeaf77f2e6d8733e9, type: 2}
    - {fileID: 11400000, guid: cdc2a0f492bb8492ba7e596718895362, type: 2}
    - {fileID: 11400000, guid: 9838cd2a642214500bb05f4d2651a4f7, type: 2}
    - {fileID: 11400000, guid: 64fa43a959e1a42a684bea5367d4ead1, type: 2}
    - {fileID: 11400000, guid: d918497363467490cab836f56ef0cb16, type: 2}
    - {fileID: 11400000, guid: 42ace5e27ed2e4d45b6ba3eec1febb3b, type: 2}
    - {fileID: 11400000, guid: a70b59cc9080e4dde8635e2b48d833ae, type: 2}
    - {fileID: 11400000, guid: ba2aebfd30f7549c583823c825b13fb2, type: 2}
    - {fileID: 11400000, guid: feb985b5dcaff413f9bf2b8d56b77006, type: 2}
    - {fileID: 11400000, guid: a8ccb27f7c05c4eec8bce2cec0734151, type: 2}
    - {fileID: 11400000, guid: 2f24a9f24b6624e068c90fb1a916c98c, type: 2}
    - {fileID: 11400000, guid: 047290a2a69cb4ec7815417d5119f332, type: 2}
    - {fileID: 11400000, guid: 811beb3ff1e3244508d2f3b576da2d4e, type: 2}
    - {fileID: 11400000, guid: ad4d58060aa8c4b47814b8a7114ce222, type: 2}
    - {fileID: 11400000, guid: 321c3cee18aed4f36a71e1637406e8e3, type: 2}
    - {fileID: 11400000, guid: e5cf04969bfc74cfa9d781d655359d78, type: 2}
    - {fileID: 11400000, guid: ab1eba8cbbb9a4d83b2736018fec8afd, type: 2}
    - {fileID: 11400000, guid: 63614196d1eaa49a1a325edd0ad54479, type: 2}
    - {fileID: 11400000, guid: 478dd9a7b9f5d43c79896e4180bbcc88, type: 2}
    - {fileID: 11400000, guid: 39861eec566044a80bf7d19edb385517, type: 2}
    - {fileID: 11400000, guid: fd92c5374f2b944deb6a06a2efebd0a5, type: 2}
    - {fileID: 11400000, guid: 0b7372911ddca4c41afc4a519e8789cc, type: 2}
    - {fileID: 11400000, guid: 03837e36b34bb4cc397529402f904f02, type: 2}
    - {fileID: 11400000, guid: 9876c6066afbe4c278e6df7867203c51, type: 2}
    - {fileID: 11400000, guid: 2a4aa9edecc634ccca403dbb9cd658c9, type: 2}
    - {fileID: 11400000, guid: 03783c18edc5f40eead1c7d09289700f, type: 2}
    - {fileID: 11400000, guid: 4402e096209084785ab194afa25da1b1, type: 2}
    - {fileID: 11400000, guid: f5db549bc6f544772bfb28f33cb59ded, type: 2}
    - {fileID: 11400000, guid: 9d5bbb291524b4141b849f086d39319b, type: 2}
    - {fileID: 11400000, guid: 68290904865fd48c2bb4b37d37aa6993, type: 2}
    - {fileID: 11400000, guid: 4fcafd485d33849e285f88ecc469d40f, type: 2}
    - {fileID: 11400000, guid: 45069beacc2f04a15a79da10c79e74a0, type: 2}
    - {fileID: 11400000, guid: 3c97090660d274d72a13819e37ff5c3e, type: 2}
    - {fileID: 11400000, guid: 0508c29c7342545818479a1c76e6131b, type: 2}
    - {fileID: 11400000, guid: 4d73ec3a6d088418fad3112db70e7447, type: 2}
    - {fileID: 11400000, guid: 92ea5a3f8686640ec99793b705cda8c1, type: 2}
    - {fileID: 11400000, guid: c8061fc561e714aca9e492105eab1b66, type: 2}
    - {fileID: 11400000, guid: 49355e79c95cd4eb3b8045facaa333dd, type: 2}
    - {fileID: 11400000, guid: 640e4703f46254de4b3d03cb86f8e38a, type: 2}
    - {fileID: 11400000, guid: d12290a2f163343adb9885399f2ff3a7, type: 2}
    - {fileID: 11400000, guid: a53bc43b3e05f4e34b56af51134478ce, type: 2}
    - {fileID: 11400000, guid: d324f66a3e2414fccbdd15ffe1902df5, type: 2}
    - {fileID: 11400000, guid: 1afd41308bbb6433390e74af2066c1ca, type: 2}
    - {fileID: 11400000, guid: 6b4a63a649535455091c84df3485059e, type: 2}
    - {fileID: 11400000, guid: cec6002b426154c94bba7ff771f75e9d, type: 2}
    - {fileID: 11400000, guid: d4a232a65085147f1b3a4dcc0abc94d4, type: 2}
    - {fileID: 11400000, guid: f794371ec12354f8c9020ccde5db8c20, type: 2}
    - {fileID: 11400000, guid: e4fdf4448d73b445c9ec3e19eea332fc, type: 2}
    - {fileID: 11400000, guid: 1f45ab1767a4548c6808cc6a92f03a69, type: 2}
    - {fileID: 11400000, guid: 86ec847c845524fb393c8988a4165cda, type: 2}
    - {fileID: 11400000, guid: 961a429092c5c42a095b05f61737c79a, type: 2}
    - {fileID: 11400000, guid: b9b630a02de9c444ab407f3a9f28417e, type: 2}
    - {fileID: 11400000, guid: ba8daca3fe71140a98e65a9d2d821a87, type: 2}
    - {fileID: 11400000, guid: 6af22b2d1895e4033a1f73a3eb530eec, type: 2}
    - {fileID: 11400000, guid: 9b27795dc6a9441deac5dd1e1e6474e8, type: 2}
    - {fileID: 11400000, guid: 1969295f6f40d4a59a7dad930a170a5f, type: 2}
    - {fileID: 11400000, guid: 7157376f5553f4333bd76159e84f3a36, type: 2}
    - {fileID: 11400000, guid: f59b52621198348f2acfbbea887ef6f7, type: 2}
    - {fileID: 11400000, guid: 5c9cfe442b3f34c8aa6909fea38b0944, type: 2}
    - {fileID: 11400000, guid: d4dd4190f3cbc46bfb3a85138c9a1cea, type: 2}
    - {fileID: 11400000, guid: 45f31be5684a84aaaa744ca4747b4175, type: 2}
    - {fileID: 11400000, guid: 1b10e19eb42b04bae97100ad1fe1ad19, type: 2}
    - {fileID: 11400000, guid: 1745198e75f86404fa7752a704c57c9f, type: 2}
    - {fileID: 11400000, guid: 2a158e65d50a045d3b03ef4e729c8831, type: 2}
    - {fileID: 11400000, guid: 8a20f84c10a784cf786f4aef86d6e3a1, type: 2}
    - {fileID: 11400000, guid: 02a8dd9c5df5c4900a5b3b97a6ae004f, type: 2}
    - {fileID: 11400000, guid: 9eb2812aa12c347eea4adfe11c88aa1a, type: 2}
    - {fileID: 11400000, guid: 4b4a53f0eeccc46cc8ba718aa7ba574a, type: 2}
    - {fileID: 11400000, guid: 2e52155975dc44862a2af0ea0e714cb3, type: 2}
    - {fileID: 11400000, guid: f65add12386464fe1a21a845448f8910, type: 2}
    - {fileID: 11400000, guid: 37c7ef9f46f8d455ebd1b6fd3d83a47a, type: 2}
    - {fileID: 11400000, guid: bb0bf44336648470994ef9358a860d4c, type: 2}
    - {fileID: 11400000, guid: ca34e9f3daa3d4724861a4df1bd3cdc2, type: 2}
    - {fileID: 11400000, guid: 68cbe730ed50c477b9a95017bad95ef2, type: 2}
    - {fileID: 11400000, guid: df70d315bd93c40788c8df3ea12afcf6, type: 2}
    - {fileID: 11400000, guid: 8f878de2c52f4406b9bac4bc3810cdd8, type: 2}
    - {fileID: 11400000, guid: f470ffb727c1a4004a25f4d1d3115d21, type: 2}
    - {fileID: 11400000, guid: 96b8f4b2936e144d3a9a2e182fd79d88, type: 2}
    - {fileID: 11400000, guid: 4f270bb44a5934919a91d929d3b541ea, type: 2}
    - {fileID: 11400000, guid: 703780571684d413b8da35cff7ec1198, type: 2}
    - {fileID: 11400000, guid: 5cfb59ef2272e40e8ad93dc8366cfa8b, type: 2}
    - {fileID: 11400000, guid: c859721d027fa40b5b2877522d81bc72, type: 2}
    - {fileID: 11400000, guid: 9cbcd88fd0bee4473985c11f4836b26c, type: 2}
    - {fileID: 11400000, guid: ec3b6a59be23d478bb625be43663b6e4, type: 2}
    - {fileID: 11400000, guid: 2efea616049e74161b36fb7e427c478d, type: 2}
    - {fileID: 11400000, guid: f6661114a2ec749af94838b4558f9245, type: 2}
    - {fileID: 11400000, guid: 42cc08a67a9eb46f186586f41bca0906, type: 2}
    - {fileID: 11400000, guid: 4cc553f1f49264fc5a0ae61edab1682d, type: 2}
    - {fileID: 11400000, guid: 4d98b6455ee2040ed9edbf8d0e3040f4, type: 2}
    - {fileID: 11400000, guid: d497157d2c4ea4483a4ab971712a2337, type: 2}
    - {fileID: 11400000, guid: 65f340ed1cdcb4cfea90652f427106f7, type: 2}
    - {fileID: 11400000, guid: 0d25fbec241054f1f95e1948a79dcb73, type: 2}
    - {fileID: 11400000, guid: 982b997ef395849cba3b987b525c1a34, type: 2}
    - {fileID: 11400000, guid: 78d76bf75fceb4c2b8fd7be404acdace, type: 2}
    - {fileID: 11400000, guid: 1ad9f86182d574f2d9d58aab33987d85, type: 2}
    - {fileID: 11400000, guid: 4acee8d2090a94ceda7f681738ac2b0e, type: 2}
    - {fileID: 11400000, guid: dd7945856c36b4c41ada0a2f534592d1, type: 2}
    - {fileID: 11400000, guid: 419ea980b74ac4c3a9320dc2e7a1ebd0, type: 2}
    - {fileID: 11400000, guid: 099d708a602fe46718bea566d3a6c26f, type: 2}
    - {fileID: 11400000, guid: 6f8b2f36fbad047b080ce5f28d8a3b10, type: 2}
    - {fileID: 11400000, guid: c41faafd6ce4849aba9ff582e59dcfad, type: 2}
    - {fileID: 11400000, guid: a4e8a3df43027456792b7bfe52e86da9, type: 2}
    - {fileID: 11400000, guid: e84d6f47426d7416f84dc13b4c8f7cbe, type: 2}
    - {fileID: 11400000, guid: ddaa5e6cb9cf74e10be05243f8c6f6d2, type: 2}
    - {fileID: 11400000, guid: 40992c9e36054415b881f989d2420f5c, type: 2}
    - {fileID: 11400000, guid: b2f1a7eb222224cbfb61f21edfb21133, type: 2}
    - {fileID: 11400000, guid: 805586733e74d438c8eeafb8ad337ffe, type: 2}
    - {fileID: 11400000, guid: 4266a2f826adf426fbc89552184e73df, type: 2}
    - {fileID: 11400000, guid: 33bff89fcdcdc4557b1a887a7c16f7a3, type: 2}
    - {fileID: 11400000, guid: 1887ed4d124bc44d0a3eace3b523c06f, type: 2}
    - {fileID: 11400000, guid: 9e652747641c54f6aba84929024c9215, type: 2}
    - {fileID: 11400000, guid: 8f1e9336e5ae042ddafd2954e1bd3fc5, type: 2}
    - {fileID: 11400000, guid: c94080240a96945b5bc9791dceabb262, type: 2}
    - {fileID: 11400000, guid: e3f4ddf9ae64448c8862a298d5e851cc, type: 2}
    - {fileID: 11400000, guid: fa635580796ae4bd6bdbe032fd2fac58, type: 2}
    - {fileID: 11400000, guid: 2d7fedae2140c4b6eb83eafb85654253, type: 2}
    - {fileID: 11400000, guid: c8fdf1c2c05214157a0ef2108815e9e1, type: 2}
    - {fileID: 11400000, guid: 55a3a97dc0a20400f9b58753270686cf, type: 2}
    - {fileID: 11400000, guid: 66787377ae53e4a2bb2f4871fc2ff605, type: 2}
    - {fileID: 11400000, guid: 1ee82d2c96e2d46b0813a40d53581107, type: 2}
    - {fileID: 11400000, guid: 726e77e1c5f414ce39bdb079d59b4cf7, type: 2}
    - {fileID: 11400000, guid: ed83c467e01b543a2a087292fcefa873, type: 2}
    - {fileID: 11400000, guid: 64a13e362c1d445ed91b3a268a276628, type: 2}
    - {fileID: 11400000, guid: 2a26d6f36fad143cb991cf8ec9298d18, type: 2}
    - {fileID: 11400000, guid: 93de24de21c0a4162ba7554c4b8dde54, type: 2}
    - {fileID: 11400000, guid: 8f7e187cbc0d5452ea41223d9dd25532, type: 2}
    - {fileID: 11400000, guid: 60200ae23680945258f453170baf2489, type: 2}
    - {fileID: 11400000, guid: 7f29d0db283964c628e786cf1587c02b, type: 2}
    - {fileID: 11400000, guid: 971f61976a5fd469ca58a5e17d6d4297, type: 2}
    - {fileID: 11400000, guid: c43342486466d438d9b59d5b39111bbb, type: 2}
    - {fileID: 11400000, guid: 657f9863eba1e40e8a62121de10c2a4a, type: 2}
    - {fileID: 11400000, guid: 78204cbdda4e344118359db4931dbc7e, type: 2}
    - {fileID: 11400000, guid: 952eff71e28f24628b67860dba4d8200, type: 2}
    - {fileID: 11400000, guid: 38dac21ac33044bd18d3bfb3f9881ab5, type: 2}
    - {fileID: 11400000, guid: 9b368e9759ae641acb4fbc5b9a934f11, type: 2}
    - {fileID: 11400000, guid: 8bcdd1b6e62794f3a850806d8ea878b8, type: 2}
    - {fileID: 11400000, guid: 266ff87d5b564436899b9d2fb353eb30, type: 2}
    - {fileID: 11400000, guid: 6c3bd71745f8a4a2f95943d0d4380653, type: 2}
    - {fileID: 11400000, guid: 359e753c2275b413f8e25a92ac712cdb, type: 2}
    - {fileID: 11400000, guid: 44bc60696561b4a21b2834f4c1af7560, type: 2}
    - {fileID: 11400000, guid: 58585029cf69a420cab4a4d531ebee6b, type: 2}
    SerializedBytesString: 
    Prefab: {fileID: 0}
    PrefabModificationsReferencedUnityObjects: []
    PrefabModifications: []
    SerializationNodes:
    - Name: <Name>k__BackingField
      Entry: 10
      Data: 0
    - Name: <ShortName>k__BackingField
      Entry: 10
      Data: 1
    - Name: <Infocard>k__BackingField
      Entry: 10
      Data: 2
    - Name: <Reputations>k__BackingField
      Entry: 7
      Data: 0|System.Collections.Generic.Dictionary`2[[FreelancerDataTool.Interfaces.IFaction,
        Assembly-CSharp],[System.Single, mscorlib]], mscorlib
    - Name: comparer
      Entry: 7
      Data: 1|System.Collections.Generic.ObjectEqualityComparer`1[[FreelancerDataTool.Interfaces.IFaction,
        Assembly-CSharp]], mscorlib
    - Name: 
      Entry: 8
      Data: 
    - Name: 
      Entry: 12
      Data: 63
    - Name: 
      Entry: 7
      Data: 
    - Name: $k
      Entry: 10
      Data: 3
    - Name: $v
      Entry: 4
      Data: -0.65
    - Name: 
      Entry: 8
      Data: 
    - Name: 
      Entry: 7
      Data: 
    - Name: $k
      Entry: 10
      Data: 4
    - Name: $v
      Entry: 4
      Data: -0.65
    - Name: 
      Entry: 8
      Data: 
    - Name: 
      Entry: 7
      Data: 
    - Name: $k
      Entry: 10
      Data: 5
    - Name: $v
      Entry: 4
      Data: -0.65
    - Name: 
      Entry: 8
      Data: 
    - Name: 
      Entry: 7
      Data: 
    - Name: $k
      Entry: 10
      Data: 6
    - Name: $v
      Entry: 4
      Data: -0.65
    - Name: 
      Entry: 8
      Data: 
    - Name: 
      Entry: 7
      Data: 
    - Name: $k
      Entry: 10
      Data: 7
    - Name: $v
      Entry: 4
      Data: -0.65
    - Name: 
      Entry: 8
      Data: 
    - Name: 
      Entry: 7
      Data: 
    - Name: $k
      Entry: 10
      Data: 8
    - Name: $v
      Entry: 4
      Data: -0.65
    - Name: 
      Entry: 8
      Data: 
    - Name: 
      Entry: 7
      Data: 
    - Name: $k
      Entry: 10
      Data: 9
    - Name: $v
      Entry: 4
      Data: -0.65
    - Name: 
      Entry: 8
      Data: 
    - Name: 
      Entry: 7
      Data: 
    - Name: $k
      Entry: 10
      Data: 10
    - Name: $v
      Entry: 4
      Data: -0.65
    - Name: 
      Entry: 8
      Data: 
    - Name: 
      Entry: 7
      Data: 
    - Name: $k
      Entry: 10
      Data: 11
    - Name: $v
      Entry: 4
      Data: -0.65
    - Name: 
      Entry: 8
      Data: 
    - Name: 
      Entry: 7
      Data: 
    - Name: $k
      Entry: 10
      Data: 12
    - Name: $v
      Entry: 4
      Data: -0.65
    - Name: 
      Entry: 8
      Data: 
    - Name: 
      Entry: 7
      Data: 
    - Name: $k
      Entry: 10
      Data: 13
    - Name: $v
      Entry: 4
      Data: -0.65
    - Name: 
      Entry: 8
      Data: 
    - Name: 
      Entry: 7
      Data: 
    - Name: $k
      Entry: 10
      Data: 14
    - Name: $v
      Entry: 4
      Data: -0.65
    - Name: 
      Entry: 8
      Data: 
    - Name: 
      Entry: 7
      Data: 
    - Name: $k
      Entry: 10
      Data: 15
    - Name: $v
      Entry: 4
      Data: -0.65
    - Name: 
      Entry: 8
      Data: 
    - Name: 
      Entry: 7
      Data: 
    - Name: $k
      Entry: 10
      Data: 16
    - Name: $v
      Entry: 4
      Data: -0.65
    - Name: 
      Entry: 8
      Data: 
    - Name: 
      Entry: 7
      Data: 
    - Name: $k
      Entry: 10
      Data: 17
    - Name: $v
      Entry: 4
      Data: -0.65
    - Name: 
      Entry: 8
      Data: 
    - Name: 
      Entry: 7
      Data: 
    - Name: $k
      Entry: 10
      Data: 18
    - Name: $v
      Entry: 4
      Data: -0.65
    - Name: 
      Entry: 8
      Data: 
    - Name: 
      Entry: 7
      Data: 
    - Name: $k
      Entry: 10
      Data: 19
    - Name: $v
      Entry: 4
      Data: -0.65
    - Name: 
      Entry: 8
      Data: 
    - Name: 
      Entry: 7
      Data: 
    - Name: $k
      Entry: 10
      Data: 20
    - Name: $v
      Entry: 4
      Data: -0.65
    - Name: 
      Entry: 8
      Data: 
    - Name: 
      Entry: 7
      Data: 
    - Name: $k
      Entry: 10
      Data: 21
    - Name: $v
      Entry: 4
      Data: -0.65
    - Name: 
      Entry: 8
      Data: 
    - Name: 
      Entry: 7
      Data: 
    - Name: $k
      Entry: 10
      Data: 22
    - Name: $v
      Entry: 4
      Data: -0.65
    - Name: 
      Entry: 8
      Data: 
    - Name: 
      Entry: 7
      Data: 
    - Name: $k
      Entry: 10
      Data: 23
    - Name: $v
      Entry: 4
      Data: -0.65
    - Name: 
      Entry: 8
      Data: 
    - Name: 
      Entry: 7
      Data: 
    - Name: $k
      Entry: 10
      Data: 24
    - Name: $v
      Entry: 4
      Data: -0.65
    - Name: 
      Entry: 8
      Data: 
    - Name: 
      Entry: 7
      Data: 
    - Name: $k
      Entry: 10
      Data: 25
    - Name: $v
      Entry: 4
      Data: -0.65
    - Name: 
      Entry: 8
      Data: 
    - Name: 
      Entry: 7
      Data: 
    - Name: $k
      Entry: 10
      Data: 26
    - Name: $v
      Entry: 4
      Data: -0.65
    - Name: 
      Entry: 8
      Data: 
    - Name: 
      Entry: 7
      Data: 
    - Name: $k
      Entry: 10
      Data: 27
    - Name: $v
      Entry: 4
      Data: -0.65
    - Name: 
      Entry: 8
      Data: 
    - Name: 
      Entry: 7
      Data: 
    - Name: $k
      Entry: 10
      Data: 28
    - Name: $v
      Entry: 4
      Data: -0.65
    - Name: 
      Entry: 8
      Data: 
    - Name: 
      Entry: 7
      Data: 
    - Name: $k
      Entry: 10
      Data: 29
    - Name: $v
      Entry: 4
      Data: -0.65
    - Name: 
      Entry: 8
      Data: 
    - Name: 
      Entry: 7
      Data: 
    - Name: $k
      Entry: 10
      Data: 30
    - Name: $v
      Entry: 4
      Data: -0.65
    - Name: 
      Entry: 8
      Data: 
    - Name: 
      Entry: 7
      Data: 
    - Name: $k
      Entry: 10
      Data: 31
    - Name: $v
      Entry: 4
      Data: -0.65
    - Name: 
      Entry: 8
      Data: 
    - Name: 
      Entry: 7
      Data: 
    - Name: $k
      Entry: 10
      Data: 32
    - Name: $v
      Entry: 4
      Data: -0.65
    - Name: 
      Entry: 8
      Data: 
    - Name: 
      Entry: 7
      Data: 
    - Name: $k
      Entry: 10
      Data: 33
    - Name: $v
      Entry: 4
      Data: -0.65
    - Name: 
      Entry: 8
      Data: 
    - Name: 
      Entry: 7
      Data: 
    - Name: $k
      Entry: 10
      Data: 34
    - Name: $v
      Entry: 4
      Data: -0.3
    - Name: 
      Entry: 8
      Data: 
    - Name: 
      Entry: 7
      Data: 
    - Name: $k
      Entry: 10
      Data: 35
    - Name: $v
      Entry: 4
      Data: -0.3
    - Name: 
      Entry: 8
      Data: 
    - Name: 
      Entry: 7
      Data: 
    - Name: $k
      Entry: 10
      Data: 36
    - Name: $v
      Entry: 4
      Data: -0.3
    - Name: 
      Entry: 8
      Data: 
    - Name: 
      Entry: 7
      Data: 
    - Name: $k
      Entry: 10
      Data: 37
    - Name: $v
      Entry: 4
      Data: -0.3
    - Name: 
      Entry: 8
      Data: 
    - Name: 
      Entry: 7
      Data: 
    - Name: $k
      Entry: 10
      Data: 38
    - Name: $v
      Entry: 4
      Data: -0.3
    - Name: 
      Entry: 8
      Data: 
    - Name: 
      Entry: 7
      Data: 
    - Name: $k
      Entry: 10
      Data: 39
    - Name: $v
      Entry: 4
      Data: -0.3
    - Name: 
      Entry: 8
      Data: 
    - Name: 
      Entry: 7
      Data: 
    - Name: $k
      Entry: 10
      Data: 40
    - Name: $v
      Entry: 4
      Data: -0.3
    - Name: 
      Entry: 8
      Data: 
    - Name: 
      Entry: 7
      Data: 
    - Name: $k
      Entry: 10
      Data: 41
    - Name: $v
      Entry: 4
      Data: -0.3
    - Name: 
      Entry: 8
      Data: 
    - Name: 
      Entry: 7
      Data: 
    - Name: $k
      Entry: 10
      Data: 42
    - Name: $v
      Entry: 4
      Data: 0.3
    - Name: 
      Entry: 8
      Data: 
    - Name: 
      Entry: 7
      Data: 
    - Name: $k
      Entry: 10
      Data: 43
    - Name: $v
      Entry: 4
      Data: 0.3
    - Name: 
      Entry: 8
      Data: 
    - Name: 
      Entry: 7
      Data: 
    - Name: $k
      Entry: 10
      Data: 44
    - Name: $v
      Entry: 4
      Data: 0.3
    - Name: 
      Entry: 8
      Data: 
    - Name: 
      Entry: 7
      Data: 
    - Name: $k
      Entry: 10
      Data: 45
    - Name: $v
      Entry: 4
      Data: 0.3
    - Name: 
      Entry: 8
      Data: 
    - Name: 
      Entry: 7
      Data: 
    - Name: $k
      Entry: 10
      Data: 46
    - Name: $v
      Entry: 4
      Data: 0.3
    - Name: 
      Entry: 8
      Data: 
    - Name: 
      Entry: 7
      Data: 
    - Name: $k
      Entry: 10
      Data: 47
    - Name: $v
      Entry: 4
      Data: 0.3
    - Name: 
      Entry: 8
      Data: 
    - Name: 
      Entry: 7
      Data: 
    - Name: $k
      Entry: 10
      Data: 48
    - Name: $v
      Entry: 4
      Data: 0.3
    - Name: 
      Entry: 8
      Data: 
    - Name: 
      Entry: 7
      Data: 
    - Name: $k
      Entry: 10
      Data: 49
    - Name: $v
      Entry: 4
      Data: 0.3
    - Name: 
      Entry: 8
      Data: 
    - Name: 
      Entry: 7
      Data: 
    - Name: $k
      Entry: 10
      Data: 50
    - Name: $v
      Entry: 4
      Data: 0.3
    - Name: 
      Entry: 8
      Data: 
    - Name: 
      Entry: 7
      Data: 
    - Name: $k
      Entry: 10
      Data: 51
    - Name: $v
      Entry: 4
      Data: 0.3
    - Name: 
      Entry: 8
      Data: 
    - Name: 
      Entry: 7
      Data: 
    - Name: $k
      Entry: 10
      Data: 52
    - Name: $v
      Entry: 4
      Data: 0.3
    - Name: 
      Entry: 8
      Data: 
    - Name: 
      Entry: 7
      Data: 
    - Name: $k
      Entry: 10
      Data: 53
    - Name: $v
      Entry: 4
      Data: 0.3
    - Name: 
      Entry: 8
      Data: 
    - Name: 
      Entry: 7
      Data: 
    - Name: $k
      Entry: 10
      Data: 54
    - Name: $v
      Entry: 4
      Data: 0.3
    - Name: 
      Entry: 8
      Data: 
    - Name: 
      Entry: 7
      Data: 
    - Name: $k
      Entry: 10
      Data: 55
    - Name: $v
      Entry: 4
      Data: 0.3
    - Name: 
      Entry: 8
      Data: 
    - Name: 
      Entry: 7
      Data: 
    - Name: $k
      Entry: 10
      Data: 56
    - Name: $v
      Entry: 4
      Data: 0.3
    - Name: 
      Entry: 8
      Data: 
    - Name: 
      Entry: 7
      Data: 
    - Name: $k
      Entry: 10
      Data: 57
    - Name: $v
      Entry: 4
      Data: 0.3
    - Name: 
      Entry: 8
      Data: 
    - Name: 
      Entry: 7
      Data: 
    - Name: $k
      Entry: 10
      Data: 58
    - Name: $v
      Entry: 4
      Data: 0.3
    - Name: 
      Entry: 8
      Data: 
    - Name: 
      Entry: 7
      Data: 
    - Name: $k
      Entry: 10
      Data: 59
    - Name: $v
      Entry: 4
      Data: 0.3
    - Name: 
      Entry: 8
      Data: 
    - Name: 
      Entry: 7
      Data: 
    - Name: $k
      Entry: 10
      Data: 60
    - Name: $v
      Entry: 4
      Data: 0.65
    - Name: 
      Entry: 8
      Data: 
    - Name: 
      Entry: 7
      Data: 
    - Name: $k
      Entry: 10
      Data: 61
    - Name: $v
      Entry: 4
      Data: 0.65
    - Name: 
      Entry: 8
      Data: 
    - Name: 
      Entry: 7
      Data: 
    - Name: $k
      Entry: 10
      Data: 62
    - Name: $v
      Entry: 4
      Data: 0.65
    - Name: 
      Entry: 8
      Data: 
    - Name: 
      Entry: 7
      Data: 
    - Name: $k
      Entry: 10
      Data: 63
    - Name: $v
      Entry: 4
      Data: 0.65
    - Name: 
      Entry: 8
      Data: 
    - Name: 
      Entry: 7
      Data: 
    - Name: $k
      Entry: 10
      Data: 64
    - Name: $v
      Entry: 4
      Data: 0.65
    - Name: 
      Entry: 8
      Data: 
    - Name: 
      Entry: 7
      Data: 
    - Name: $k
      Entry: 10
      Data: 65
    - Name: $v
      Entry: 4
      Data: 0.65
    - Name: 
      Entry: 8
      Data: 
    - Name: 
      Entry: 13
      Data: 
    - Name: 
      Entry: 8
      Data: 
    - Name: <NpcBribers>k__BackingField
      Entry: 7
      Data: 2|System.Collections.Generic.Dictionary`2[[FreelancerDataTool.Interfaces.INpc,
        Assembly-CSharp],[System.Single, mscorlib]], mscorlib
    - Name: comparer
      Entry: 7
      Data: 3|System.Collections.Generic.ObjectEqualityComparer`1[[FreelancerDataTool.Interfaces.INpc,
        Assembly-CSharp]], mscorlib
    - Name: 
      Entry: 8
      Data: 
    - Name: 
      Entry: 12
      Data: 35
    - Name: 
      Entry: 7
      Data: 
    - Name: $k
      Entry: 10
      Data: 66
    - Name: $v
      Entry: 4
      Data: 840
    - Name: 
      Entry: 8
      Data: 
    - Name: 
      Entry: 7
      Data: 
    - Name: $k
      Entry: 10
      Data: 67
    - Name: $v
      Entry: 4
      Data: 840
    - Name: 
      Entry: 8
      Data: 
    - Name: 
      Entry: 7
      Data: 
    - Name: $k
      Entry: 10
      Data: 68
    - Name: $v
      Entry: 4
      Data: 840
    - Name: 
      Entry: 8
      Data: 
    - Name: 
      Entry: 7
      Data: 
    - Name: $k
      Entry: 10
      Data: 69
    - Name: $v
      Entry: 4
      Data: 840
    - Name: 
      Entry: 8
      Data: 
    - Name: 
      Entry: 7
      Data: 
    - Name: $k
      Entry: 10
      Data: 70
    - Name: $v
      Entry: 4
      Data: 840
    - Name: 
      Entry: 8
      Data: 
    - Name: 
      Entry: 7
      Data: 
    - Name: $k
      Entry: 10
      Data: 71
    - Name: $v
      Entry: 4
      Data: 840
    - Name: 
      Entry: 8
      Data: 
    - Name: 
      Entry: 7
      Data: 
    - Name: $k
      Entry: 10
      Data: 72
    - Name: $v
      Entry: 4
      Data: 840
    - Name: 
      Entry: 8
      Data: 
    - Name: 
      Entry: 7
      Data: 
    - Name: $k
      Entry: 10
      Data: 73
    - Name: $v
      Entry: 4
      Data: 840
    - Name: 
      Entry: 8
      Data: 
    - Name: 
      Entry: 7
      Data: 
    - Name: $k
      Entry: 10
      Data: 74
    - Name: $v
      Entry: 4
      Data: 840
    - Name: 
      Entry: 8
      Data: 
    - Name: 
      Entry: 7
      Data: 
    - Name: $k
      Entry: 10
      Data: 75
    - Name: $v
      Entry: 4
      Data: 840
    - Name: 
      Entry: 8
      Data: 
    - Name: 
      Entry: 7
      Data: 
    - Name: $k
      Entry: 10
      Data: 76
    - Name: $v
      Entry: 4
      Data: 840
    - Name: 
      Entry: 8
      Data: 
    - Name: 
      Entry: 7
      Data: 
    - Name: $k
      Entry: 10
      Data: 77
    - Name: $v
      Entry: 4
      Data: 840
    - Name: 
      Entry: 8
      Data: 
    - Name: 
      Entry: 7
      Data: 
    - Name: $k
      Entry: 10
      Data: 78
    - Name: $v
      Entry: 4
      Data: 840
    - Name: 
      Entry: 8
      Data: 
    - Name: 
      Entry: 7
      Data: 
    - Name: $k
      Entry: 10
      Data: 79
    - Name: $v
      Entry: 4
      Data: 840
    - Name: 
      Entry: 8
      Data: 
    - Name: 
      Entry: 7
      Data: 
    - Name: $k
      Entry: 10
      Data: 80
    - Name: $v
      Entry: 4
      Data: 840
    - Name: 
      Entry: 8
      Data: 
    - Name: 
      Entry: 7
      Data: 
    - Name: $k
      Entry: 10
      Data: 81
    - Name: $v
      Entry: 4
      Data: 840
    - Name: 
      Entry: 8
      Data: 
    - Name: 
      Entry: 7
      Data: 
    - Name: $k
      Entry: 10
      Data: 82
    - Name: $v
      Entry: 4
      Data: 840
    - Name: 
      Entry: 8
      Data: 
    - Name: 
      Entry: 7
      Data: 
    - Name: $k
      Entry: 10
      Data: 83
    - Name: $v
      Entry: 4
      Data: 840
    - Name: 
      Entry: 8
      Data: 
    - Name: 
      Entry: 7
      Data: 
    - Name: $k
      Entry: 10
      Data: 84
    - Name: $v
      Entry: 4
      Data: 840
    - Name: 
      Entry: 8
      Data: 
    - Name: 
      Entry: 7
      Data: 
    - Name: $k
      Entry: 10
      Data: 85
    - Name: $v
      Entry: 4
      Data: 840
    - Name: 
      Entry: 8
      Data: 
    - Name: 
      Entry: 7
      Data: 
    - Name: $k
      Entry: 10
      Data: 86
    - Name: $v
      Entry: 4
      Data: 840
    - Name: 
      Entry: 8
      Data: 
    - Name: 
      Entry: 7
      Data: 
    - Name: $k
      Entry: 10
      Data: 87
    - Name: $v
      Entry: 4
      Data: 840
    - Name: 
      Entry: 8
      Data: 
    - Name: 
      Entry: 7
      Data: 
    - Name: $k
      Entry: 10
      Data: 88
    - Name: $v
      Entry: 4
      Data: 840
    - Name: 
      Entry: 8
      Data: 
    - Name: 
      Entry: 7
      Data: 
    - Name: $k
      Entry: 10
      Data: 89
    - Name: $v
      Entry: 4
      Data: 840
    - Name: 
      Entry: 8
      Data: 
    - Name: 
      Entry: 7
      Data: 
    - Name: $k
      Entry: 10
      Data: 90
    - Name: $v
      Entry: 4
      Data: 840
    - Name: 
      Entry: 8
      Data: 
    - Name: 
      Entry: 7
      Data: 
    - Name: $k
      Entry: 10
      Data: 91
    - Name: $v
      Entry: 4
      Data: 840
    - Name: 
      Entry: 8
      Data: 
    - Name: 
      Entry: 7
      Data: 
    - Name: $k
      Entry: 10
      Data: 92
    - Name: $v
      Entry: 4
      Data: 840
    - Name: 
      Entry: 8
      Data: 
    - Name: 
      Entry: 7
      Data: 
    - Name: $k
      Entry: 10
      Data: 93
    - Name: $v
      Entry: 4
      Data: 840
    - Name: 
      Entry: 8
      Data: 
    - Name: 
      Entry: 7
      Data: 
    - Name: $k
      Entry: 10
      Data: 94
    - Name: $v
      Entry: 4
      Data: 840
    - Name: 
      Entry: 8
      Data: 
    - Name: 
      Entry: 7
      Data: 
    - Name: $k
      Entry: 10
      Data: 95
    - Name: $v
      Entry: 4
      Data: 840
    - Name: 
      Entry: 8
      Data: 
    - Name: 
      Entry: 7
      Data: 
    - Name: $k
      Entry: 10
      Data: 96
    - Name: $v
      Entry: 4
      Data: 840
    - Name: 
      Entry: 8
      Data: 
    - Name: 
      Entry: 7
      Data: 
    - Name: $k
      Entry: 10
      Data: 97
    - Name: $v
      Entry: 4
      Data: 840
    - Name: 
      Entry: 8
      Data: 
    - Name: 
      Entry: 7
      Data: 
    - Name: $k
      Entry: 10
      Data: 98
    - Name: $v
      Entry: 4
      Data: 840
    - Name: 
      Entry: 8
      Data: 
    - Name: 
      Entry: 7
      Data: 
    - Name: $k
      Entry: 10
      Data: 99
    - Name: $v
      Entry: 4
      Data: 840
    - Name: 
      Entry: 8
      Data: 
    - Name: 
      Entry: 7
      Data: 
    - Name: $k
      Entry: 10
      Data: 100
    - Name: $v
      Entry: 4
      Data: 840
    - Name: 
      Entry: 8
      Data: 
    - Name: 
      Entry: 13
      Data: 
    - Name: 
      Entry: 8
      Data: 
    - Name: <ShipsUsed>k__BackingField
      Entry: 7
      Data: 4|System.Collections.Generic.List`1[[FreelancerDataTool.Interfaces.IShip,
        Assembly-CSharp]], mscorlib
    - Name: 
      Entry: 12
      Data: 15
    - Name: 
      Entry: 10
      Data: 101
    - Name: 
      Entry: 10
      Data: 102
    - Name: 
      Entry: 10
      Data: 103
    - Name: 
      Entry: 10
      Data: 104
    - Name: 
      Entry: 10
      Data: 105
    - Name: 
      Entry: 10
      Data: 106
    - Name: 
      Entry: 10
      Data: 107
    - Name: 
      Entry: 10
      Data: 108
    - Name: 
      Entry: 10
      Data: 109
    - Name: 
      Entry: 10
      Data: 110
    - Name: 
      Entry: 10
      Data: 111
    - Name: 
      Entry: 10
      Data: 112
    - Name: 
      Entry: 10
      Data: 113
    - Name: 
      Entry: 10
      Data: 114
    - Name: 
      Entry: 10
      Data: 115
    - Name: 
      Entry: 13
      Data: 
    - Name: 
      Entry: 8
      Data: 
    - Name: <OwnedBases>k__BackingField
      Entry: 7
      Data: 5|System.Collections.Generic.List`1[[FreelancerDataTool.Interfaces.IBase,
        Assembly-CSharp]], mscorlib
    - Name: 
      Entry: 12
      Data: 5
    - Name: 
      Entry: 10
      Data: 116
    - Name: 
      Entry: 10
      Data: 117
    - Name: 
      Entry: 10
      Data: 118
    - Name: 
      Entry: 10
      Data: 119
    - Name: 
      Entry: 10
      Data: 120
    - Name: 
      Entry: 13
      Data: 
    - Name: 
      Entry: 8
      Data: 
    - Name: <Npcs>k__BackingField
      Entry: 7
      Data: 6|System.Collections.Generic.List`1[[FreelancerDataTool.Interfaces.INpc,
        Assembly-CSharp]], mscorlib
    - Name: 
      Entry: 12
      Data: 47
    - Name: 
      Entry: 10
      Data: 66
    - Name: 
      Entry: 10
      Data: 121
    - Name: 
      Entry: 10
      Data: 122
    - Name: 
      Entry: 10
      Data: 123
    - Name: 
      Entry: 10
      Data: 69
    - Name: 
      Entry: 10
      Data: 124
    - Name: 
      Entry: 10
      Data: 125
    - Name: 
      Entry: 10
      Data: 126
    - Name: 
      Entry: 10
      Data: 73
    - Name: 
      Entry: 10
      Data: 127
    - Name: 
      Entry: 10
      Data: 128
    - Name: 
      Entry: 10
      Data: 129
    - Name: 
      Entry: 10
      Data: 130
    - Name: 
      Entry: 10
      Data: 131
    - Name: 
      Entry: 10
      Data: 132
    - Name: 
      Entry: 10
      Data: 81
    - Name: 
      Entry: 10
      Data: 133
    - Name: 
      Entry: 10
      Data: 134
    - Name: 
      Entry: 10
      Data: 135
    - Name: 
      Entry: 10
      Data: 136
    - Name: 
      Entry: 10
      Data: 137
    - Name: 
      Entry: 10
      Data: 82
    - Name: 
      Entry: 10
      Data: 85
    - Name: 
      Entry: 10
      Data: 138
    - Name: 
      Entry: 10
      Data: 139
    - Name: 
      Entry: 10
      Data: 140
    - Name: 
      Entry: 10
      Data: 141
    - Name: 
      Entry: 10
      Data: 142
    - Name: 
      Entry: 10
      Data: 143
    - Name: 
      Entry: 10
      Data: 144
    - Name: 
      Entry: 10
      Data: 145
    - Name: 
      Entry: 10
      Data: 146
    - Name: 
      Entry: 10
      Data: 147
    - Name: 
      Entry: 10
      Data: 148
    - Name: 
      Entry: 10
      Data: 149
    - Name: 
      Entry: 10
      Data: 150
    - Name: 
      Entry: 10
      Data: 151
    - Name: 
      Entry: 10
      Data: 152
    - Name: 
      Entry: 10
      Data: 96
    - Name: 
      Entry: 10
      Data: 99
    - Name: 
      Entry: 10
      Data: 153
    - Name: 
      Entry: 10
      Data: 154
    - Name: 
      Entry: 10
      Data: 155
    - Name: 
      Entry: 10
      Data: 156
    - Name: 
      Entry: 10
      Data: 157
    - Name: 
      Entry: 10
      Data: 158
    - Name: 
      Entry: 10
      Data: 159
    - Name: 
      Entry: 13
      Data: 
    - Name: 
      Entry: 8
      Data: 
  <Nickname>k__BackingField: br_m_grp
  <Logo>k__BackingField: {fileID: 21300000, guid: 9dc3d5105418d4c64a9558ce4f006916, type: 3}
  <Legality>k__BackingField: lawful
  <JumpPreference>k__BackingField: any
  <ScanAnnounce>k__BackingField: 0
  <ScanChance>k__BackingField: 0
