%YAML 1.1
%TAG !u! tag:unity3d.com,2011:
--- !u!114 &11400000
MonoBehaviour:
  m_ObjectHideFlags: 0
  m_CorrespondingSourceObject: {fileID: 0}
  m_PrefabInstance: {fileID: 0}
  m_PrefabAsset: {fileID: 0}
  m_GameObject: {fileID: 0}
  m_Enabled: 1
  m_EditorHideFlags: 0
  m_Script: {fileID: 11500000, guid: 182eb47472f64de388dd50183c0411d8, type: 3}
  m_Name: SO_Infocard_133138
  m_EditorClassIdentifier: 
  <Key>k__BackingField: 133138
  <Value>k__BackingField: 'An identifier from one of our destroyed ships came back
    online a few days ago. That is very strange, since we are certain that the ship
    was destroyed. Whoever cloned the ship I.D. is a cruel deceiver. The dead pilot''s
    wife has been frantic hoping he''s still alive since the signature came back
    up. <br>


'
