%YAML 1.1
%TAG !u! tag:unity3d.com,2011:
--- !u!114 &11400000
MonoBehaviour:
  m_ObjectHideFlags: 0
  m_CorrespondingSourceObject: {fileID: 0}
  m_PrefabInstance: {fileID: 0}
  m_PrefabAsset: {fileID: 0}
  m_GameObject: {fileID: 0}
  m_Enabled: 1
  m_EditorHideFlags: 0
  m_Script: {fileID: 11500000, guid: 182eb47472f64de388dd50183c0411d8, type: 3}
  m_Name: SO_Infocard_461541
  m_EditorClassIdentifier: 
  <Key>k__BackingField: 461541
  <Value>k__BackingField: 'They say that Liberty finally put a stop to corrupt officials
    selling off their prisoners as Slaves. I know better. There is always a demand
    for ''excess labour'', even here. The Guild Paramilitary brings what is left
    of Slave shipments headed to Outcast space. Not all of these people go home.
    Some stay on to find a new life here, others fall through the cracks and end
    up as indentured servants in one of the unregulated mining sites.<br>


'
