%YAML 1.1
%TAG !u! tag:unity3d.com,2011:
--- !u!114 &11400000
MonoBehaviour:
  m_ObjectHideFlags: 0
  m_CorrespondingSourceObject: {fileID: 0}
  m_PrefabInstance: {fileID: 0}
  m_PrefabAsset: {fileID: 0}
  m_GameObject: {fileID: 0}
  m_Enabled: 1
  m_EditorHideFlags: 0
  m_Script: {fileID: 11500000, guid: 182eb47472f64de388dd50183c0411d8, type: 3}
  m_Name: SO_Infocard_131549
  m_EditorClassIdentifier: 
  <Key>k__BackingField: 131549
  <Value>k__BackingField: 'I''m thinking of starting a side business. Take out some
    of those soft rich folks from the inner House worlds that have never seen true
    Indie-world danger. Cruise the clouds, look for some trouble, then hightail it
    out of there before it gets too hot. What do ya think?<br>


'
