%YAML 1.1
%TAG !u! tag:unity3d.com,2011:
--- !u!114 &11400000
MonoBehaviour:
  m_ObjectHideFlags: 0
  m_CorrespondingSourceObject: {fileID: 0}
  m_PrefabInstance: {fileID: 0}
  m_PrefabAsset: {fileID: 0}
  m_GameObject: {fileID: 0}
  m_Enabled: 1
  m_EditorHideFlags: 0
  m_Script: {fileID: 11500000, guid: 182eb47472f64de388dd50183c0411d8, type: 3}
  m_Name: SO_Infocard_488311
  m_EditorClassIdentifier: 
  <Key>k__BackingField: 488311
  <Value>k__BackingField: 'The boys at Niverton make off with some cargo every now
    and then. When there''s enough, I haul it over to Allentown for a quick buck.
    Doesn''t earn much, but it''s a safe way to earn a bit of scratch. You can pick
    up some "Indentured Servants", as they like to call Slaves here, on the way back.
    <br>


'
