%YAML 1.1
%TAG !u! tag:unity3d.com,2011:
--- !u!114 &11400000
MonoBehaviour:
  m_ObjectHideFlags: 0
  m_CorrespondingSourceObject: {fileID: 0}
  m_PrefabInstance: {fileID: 0}
  m_PrefabAsset: {fileID: 0}
  m_GameObject: {fileID: 0}
  m_Enabled: 1
  m_EditorHideFlags: 0
  m_Script: {fileID: 11500000, guid: 182eb47472f64de388dd50183c0411d8, type: 3}
  m_Name: SO_Infocard_488205
  m_EditorClassIdentifier: 
  <Key>k__BackingField: 488205
  <Value>k__BackingField: 'The jump gate to New York will take you to one of the
    most dangerous parts of the New York system. I don''t know what they were thinking
    when they built a gate there. Be prepared to encounter pirates if you are traveling
    that way. <br>


'
