%YAML 1.1
%TAG !u! tag:unity3d.com,2011:
--- !u!114 &11400000
MonoBehaviour:
  m_ObjectHideFlags: 0
  m_CorrespondingSourceObject: {fileID: 0}
  m_PrefabInstance: {fileID: 0}
  m_PrefabAsset: {fileID: 0}
  m_GameObject: {fileID: 0}
  m_Enabled: 1
  m_EditorHideFlags: 0
  m_Script: {fileID: 11500000, guid: 182eb47472f64de388dd50183c0411d8, type: 3}
  m_Name: SO_Infocard_491544
  m_EditorClassIdentifier: 
  <Key>k__BackingField: 491544
  <Value>k__BackingField: " <br><b><p align=\"center\">Stats<br></b><p align=\"left\">
    <br>Gun/Turret Mounts: 4/0<br>Base Armor: 11760<br>Explosion Resistance: 25%<br>Cargo
    Space: 40<br>Power Output: 1190/7090<br>Thruster Energy: 75/350<br>Batteries/NanoBots:
    40/40<br>Equipment Mounts: CM CD <br> <br><b><p align=\"center\">Maneuverability<br></b><p
    align=\"left\"> <br>Max Turn Rate: 85.77\xB0<br>Time to Max Turn: 2.54s<br>Time
    to turn 180\xB0: 2.47s<br>Maximum Strafe Speed: 25m/s<br>Distance Strafed in
    0.5s: 8.56m<br>\n\n"
