%YAML 1.1
%TAG !u! tag:unity3d.com,2011:
--- !u!114 &11400000
MonoBehaviour:
  m_ObjectHideFlags: 0
  m_CorrespondingSourceObject: {fileID: 0}
  m_PrefabInstance: {fileID: 0}
  m_PrefabAsset: {fileID: 0}
  m_GameObject: {fileID: 0}
  m_Enabled: 1
  m_EditorHideFlags: 0
  m_Script: {fileID: 11500000, guid: 182eb47472f64de388dd50183c0411d8, type: 3}
  m_Name: SO_Infocard_469362
  m_EditorClassIdentifier: 
  <Key>k__BackingField: 469362
  <Value>k__BackingField: 'We may have suffered some losses near Bautzen and Leipzig,
    but nothing compared to the Military losses. No doubt the Corsairs would be eager
    to come in and take advantage of the situation but the minefield keeps us safe
    for the time being.<br>


'
