%YAML 1.1
%TAG !u! tag:unity3d.com,2011:
--- !u!114 &11400000
MonoBehaviour:
  m_ObjectHideFlags: 0
  m_CorrespondingSourceObject: {fileID: 0}
  m_PrefabInstance: {fileID: 0}
  m_PrefabAsset: {fileID: 0}
  m_GameObject: {fileID: 0}
  m_Enabled: 1
  m_EditorHideFlags: 0
  m_Script: {fileID: 11500000, guid: 182eb47472f64de388dd50183c0411d8, type: 3}
  m_Name: SO_Infocard_468768
  m_EditorClassIdentifier: 
  <Key>k__BackingField: 468768
  <Value>k__BackingField: 'Guild don''t endorse it, but there''s off the record work
    to be had here. Some shop owners want their property looking after, or a rival
    roughed up. There are even folks who''re willing to sponsor people like me to
    rough up or take out Rheinland illegals that are here to snoop around. Not sure
    if I''m far enough back on my debts to want those jobs yet. <br>


'
