%YAML 1.1
%TAG !u! tag:unity3d.com,2011:
--- !u!114 &11400000
MonoBehaviour:
  m_ObjectHideFlags: 0
  m_CorrespondingSourceObject: {fileID: 0}
  m_PrefabInstance: {fileID: 0}
  m_PrefabAsset: {fileID: 0}
  m_GameObject: {fileID: 0}
  m_Enabled: 1
  m_EditorHideFlags: 0
  m_Script: {fileID: 11500000, guid: 182eb47472f64de388dd50183c0411d8, type: 3}
  m_Name: SO_Infocard_468781
  m_EditorClassIdentifier: 
  <Key>k__BackingField: 468781
  <Value>k__BackingField: 'The gear here is old and falling to bits, but I''d rather
    sleep on Ole Doug'' than Nottingham. It''s mankier than a Loiner''s armpit down
    there. Too hot around the middle, freeze your tits off at the poles. Know what
    happens when you got temperature differences that extreme? Big storms. They dug
    down into the rock to get around that, but I still reckon my bunk is better than
    a damp and badly ventilated ex-mine shaft. <br>


'
