%YAML 1.1
%TAG !u! tag:unity3d.com,2011:
--- !u!114 &11400000
MonoBehaviour:
  m_ObjectHideFlags: 0
  m_CorrespondingSourceObject: {fileID: 0}
  m_PrefabInstance: {fileID: 0}
  m_PrefabAsset: {fileID: 0}
  m_GameObject: {fileID: 0}
  m_Enabled: 1
  m_EditorHideFlags: 0
  m_Script: {fileID: 11500000, guid: 182eb47472f64de388dd50183c0411d8, type: 3}
  m_Name: SO_Infocard_461141
  m_EditorClassIdentifier: 
  <Key>k__BackingField: 461141
  <Value>k__BackingField: 'I can''t wait to get to the front. This is our home we''re
    defending. Our families. Who the hell do these wineguzzlers think they are to
    invade us like this? We''d never even heared of Gallia until that idiot king
    of theirs sent his fleet our way. Barmy madman, that one. <br>


'
