%YAML 1.1
%TAG !u! tag:unity3d.com,2011:
--- !u!114 &11400000
MonoBehaviour:
  m_ObjectHideFlags: 0
  m_CorrespondingSourceObject: {fileID: 0}
  m_PrefabInstance: {fileID: 0}
  m_PrefabAsset: {fileID: 0}
  m_GameObject: {fileID: 0}
  m_Enabled: 1
  m_EditorHideFlags: 0
  m_Script: {fileID: 11500000, guid: 182eb47472f64de388dd50183c0411d8, type: 3}
  m_Name: SO_Infocard_515117
  m_EditorClassIdentifier: 
  <Key>k__BackingField: 515117
  <Value>k__BackingField: 'Synth Foods knows agriculture, Cryer knows genetic engineering,
    and Planetform knows filtration and geoengineering. The combination is a scientific
    and technological powerhouse. The ability to do true terraforming and ecoforming.
    Samura executives must be quaking in their slippers at the thought. Their paltry
    efforts to develop terraforming technology can''t compare to the storm of innovation
    that we''re about to unleash on Sirius. <br>


'
