%YAML 1.1
%TAG !u! tag:unity3d.com,2011:
--- !u!114 &11400000
MonoBehaviour:
  m_ObjectHideFlags: 0
  m_CorrespondingSourceObject: {fileID: 0}
  m_PrefabInstance: {fileID: 0}
  m_PrefabAsset: {fileID: 0}
  m_GameObject: {fileID: 0}
  m_Enabled: 1
  m_EditorHideFlags: 0
  m_Script: {fileID: 11500000, guid: 182eb47472f64de388dd50183c0411d8, type: 3}
  m_Name: SO_Infocard_133975
  m_EditorClassIdentifier: 
  <Key>k__BackingField: 133975
  <Value>k__BackingField: 'Without this border post, southern Hamburg would be chaos.
    As it is, we lose good officers every week, especially when the Hessians show
    up. Soon they''ll have no choice but to staff our base with Bounty Hunters. There
    are plenty of those ruffians to go around. <br>


'
