%YAML 1.1
%TAG !u! tag:unity3d.com,2011:
--- !u!114 &11400000
MonoBehaviour:
  m_ObjectHideFlags: 0
  m_CorrespondingSourceObject: {fileID: 0}
  m_PrefabInstance: {fileID: 0}
  m_PrefabAsset: {fileID: 0}
  m_GameObject: {fileID: 0}
  m_Enabled: 1
  m_EditorHideFlags: 0
  m_Script: {fileID: 11500000, guid: 182eb47472f64de388dd50183c0411d8, type: 3}
  m_Name: SO_Infocard_462601
  m_EditorClassIdentifier: 
  <Key>k__BackingField: 462601
  <Value>k__BackingField: '<b>LIBERTY<br></b> <br><b><u>Settled Planets<br></b></u>None<br>
    <br><b><u>Bases<br></b></u>Freeport 14<br>Camrose Supply Depot<br>Leduc Station<br>Battleship
    Concord<br> <br><b><u>Corporations<br></b></u>Ageira Technologies<br>Deep Space
    Engineering<br> <br><b><u>Criminals<br></b></u>Liberty Rogues<br>Lane Hackers<br>
    <br><b><u>Produces<br></b></u>Bio-Neural Processors<br>


'
