%YAML 1.1
%TAG !u! tag:unity3d.com,2011:
--- !u!114 &11400000
MonoBehaviour:
  m_ObjectHideFlags: 0
  m_CorrespondingSourceObject: {fileID: 0}
  m_PrefabInstance: {fileID: 0}
  m_PrefabAsset: {fileID: 0}
  m_GameObject: {fileID: 0}
  m_Enabled: 1
  m_EditorHideFlags: 0
  m_Script: {fileID: 11500000, guid: 182eb47472f64de388dd50183c0411d8, type: 3}
  m_Name: SO_Infocard_488266
  m_EditorClassIdentifier: 
  <Key>k__BackingField: 488266
  <Value>k__BackingField: 'You know what Bethlehem means, buddy? Yeah, it''s a place
    of birth, so you might want to be reborn as a Zoner. Look around the bar, and
    you''ll see plenty of Zoners here. This base is the best place to get in touch
    with us, and the place where you can achieve a record enabling you to travel
    almost wherever you like. Welcome to your adventures, but don''t dare to cry
    if you''re caught in one of the endless wars in the Border Worlds, or at the
    Edge. Take a drink, and return to your cozy place in Liberty where you''ve started
    to dream of a silly future. <br>


'
