%YAML 1.1
%TAG !u! tag:unity3d.com,2011:
--- !u!114 &11400000
MonoBehaviour:
  m_ObjectHideFlags: 0
  m_CorrespondingSourceObject: {fileID: 0}
  m_PrefabInstance: {fileID: 0}
  m_PrefabAsset: {fileID: 0}
  m_GameObject: {fileID: 0}
  m_Enabled: 1
  m_EditorHideFlags: 0
  m_Script: {fileID: 11500000, guid: 182eb47472f64de388dd50183c0411d8, type: 3}
  m_Name: SO_Infocard_131686
  m_EditorClassIdentifier: 
  <Key>k__BackingField: 131686
  <Value>k__BackingField: 'Those cursed Xenos are a serious problem for us in Colorado.
    We''ve lobbied the Liberty government to step up patrols, but that has proved
    unsatisfactory. The Xenos seem to attack only Kusari ships, not Liberty commerce.
    We don''t understand their hatred for us.<br>


'
