%YAML 1.1
%TAG !u! tag:unity3d.com,2011:
--- !u!114 &11400000
MonoBehaviour:
  m_ObjectHideFlags: 0
  m_CorrespondingSourceObject: {fileID: 0}
  m_PrefabInstance: {fileID: 0}
  m_PrefabAsset: {fileID: 0}
  m_GameObject: {fileID: 0}
  m_Enabled: 1
  m_EditorHideFlags: 0
  m_Script: {fileID: 11500000, guid: 182eb47472f64de388dd50183c0411d8, type: 3}
  m_Name: SO_Infocard_132513
  m_EditorClassIdentifier: 
  <Key>k__BackingField: 132513
  <Value>k__BackingField: 'Tau-31 is an important sector for the Gaians. Though terraforming
    operations on Harris are almost complete, they still need Alien Organisms from
    the Edge Nebula. The Organisms are crucial in speeding up the terraforming process,
    thereby making it more economically viable. Destroying any transport with those
    organisms will slow Planetform down. The longer their operation, the more costly.
    It will cause other governments to think twice about terraforming expenses! <br>


'
