%YAML 1.1
%TAG !u! tag:unity3d.com,2011:
--- !u!114 &11400000
MonoBehaviour:
  m_ObjectHideFlags: 0
  m_CorrespondingSourceObject: {fileID: 0}
  m_PrefabInstance: {fileID: 0}
  m_PrefabAsset: {fileID: 0}
  m_GameObject: {fileID: 0}
  m_Enabled: 1
  m_EditorHideFlags: 0
  m_Script: {fileID: 11500000, guid: 182eb47472f64de388dd50183c0411d8, type: 3}
  m_Name: SO_Infocard_133747
  m_EditorClassIdentifier: 
  <Key>k__BackingField: 133747
  <Value>k__BackingField: 'Rheinland has seen better days. Since the end of the war,
    we''ve had one crisis after another. The Popular Revolution never fulfilled its
    promise. The government just keeps issuing more money in order to pay off its
    debts, so the inflation rate is out of control. It''s running about 5 percent
    a week right now. <br><nbsp><br>


'
