%YAML 1.1
%TAG !u! tag:unity3d.com,2011:
--- !u!114 &11400000
MonoBehaviour:
  m_ObjectHideFlags: 0
  m_CorrespondingSourceObject: {fileID: 0}
  m_PrefabInstance: {fileID: 0}
  m_PrefabAsset: {fileID: 0}
  m_GameObject: {fileID: 0}
  m_Enabled: 1
  m_EditorHideFlags: 0
  m_Script: {fileID: 11500000, guid: 77745e53922c405d884b74e75f714afa, type: 3}
  m_Name: SO_Npc_InterspaceCommerceNewarkBartenderMikeKarlin
  m_EditorClassIdentifier: 
  serializationData:
    SerializedFormat: 2
    SerializedBytes: 
    ReferencedUnityObjects:
    - {fileID: 11400000, guid: c6c7cfae939fe4523925f1d9bcc54a9e, type: 2}
    - {fileID: 11400000, guid: 52bba45cae5a1426f9db1222e03dec21, type: 2}
    - {fileID: 11400000, guid: 2a4aa9edecc634ccca403dbb9cd658c9, type: 2}
    - {fileID: 11400000, guid: f5db549bc6f544772bfb28f33cb59ded, type: 2}
    - {fileID: 11400000, guid: 9876c6066afbe4c278e6df7867203c51, type: 2}
    - {fileID: 11400000, guid: 03783c18edc5f40eead1c7d09289700f, type: 2}
    - {fileID: 11400000, guid: 4fcafd485d33849e285f88ecc469d40f, type: 2}
    - {fileID: 11400000, guid: 7fd8888d8f8594f199ec69dd789a42c1, type: 2}
    - {fileID: 11400000, guid: 64762572994594368b89a353d22d04a5, type: 2}
    - {fileID: 11400000, guid: 4920175ae7d9d47a79101cabbb2c6d06, type: 2}
    - {fileID: 11400000, guid: 61f3762c418244e3d88015803b356364, type: 2}
    - {fileID: 11400000, guid: 09f0e2197c7144204bc82c938e302fba, type: 2}
    - {fileID: 11400000, guid: 3e1ca43ca1185431da026b466f50b2dc, type: 2}
    - {fileID: 11400000, guid: 14bd02680db1945c9ab6a6405ca962e9, type: 2}
    - {fileID: 11400000, guid: c7e20deeea4054ce69f9104ea4faa1eb, type: 2}
    - {fileID: 11400000, guid: 37256b245875d4d7cb42d7f67e082b15, type: 2}
    - {fileID: 11400000, guid: 0b600c7fa452d43c7bc9cc46a665dec0, type: 2}
    - {fileID: 11400000, guid: 3095479a8c03d44c9ae235d70bf9253f, type: 2}
    - {fileID: 11400000, guid: 41e8e8e58a4574da19e69d7453d0f422, type: 2}
    - {fileID: 11400000, guid: a2784eb1352894e4a9516c148118a947, type: 2}
    - {fileID: 11400000, guid: 673434ab0b8b84d1ca6f96db1b228255, type: 2}
    - {fileID: 11400000, guid: b38be4b31fd894bb488303f00f3567f5, type: 2}
    SerializedBytesString: 
    Prefab: {fileID: 0}
    PrefabModificationsReferencedUnityObjects: []
    PrefabModifications: []
    SerializationNodes:
    - Name: <Name>k__BackingField
      Entry: 10
      Data: 0
    - Name: <Base>k__BackingField
      Entry: 10
      Data: 1
    - Name: <Affiliation>k__BackingField
      Entry: 10
      Data: 2
    - Name: <Bribes>k__BackingField
      Entry: 7
      Data: 0|System.Collections.Generic.Dictionary`2[[FreelancerDataTool.Interfaces.IFaction,
        Assembly-CSharp],[System.Int32, mscorlib]], mscorlib
    - Name: comparer
      Entry: 7
      Data: 1|System.Collections.Generic.ObjectEqualityComparer`1[[FreelancerDataTool.Interfaces.IFaction,
        Assembly-CSharp]], mscorlib
    - Name: 
      Entry: 8
      Data: 
    - Name: 
      Entry: 12
      Data: 5
    - Name: 
      Entry: 7
      Data: 
    - Name: $k
      Entry: 10
      Data: 3
    - Name: $v
      Entry: 3
      Data: 840
    - Name: 
      Entry: 8
      Data: 
    - Name: 
      Entry: 7
      Data: 
    - Name: $k
      Entry: 10
      Data: 4
    - Name: $v
      Entry: 3
      Data: 840
    - Name: 
      Entry: 8
      Data: 
    - Name: 
      Entry: 7
      Data: 
    - Name: $k
      Entry: 10
      Data: 2
    - Name: $v
      Entry: 3
      Data: 840
    - Name: 
      Entry: 8
      Data: 
    - Name: 
      Entry: 7
      Data: 
    - Name: $k
      Entry: 10
      Data: 5
    - Name: $v
      Entry: 3
      Data: 840
    - Name: 
      Entry: 8
      Data: 
    - Name: 
      Entry: 7
      Data: 
    - Name: $k
      Entry: 10
      Data: 6
    - Name: $v
      Entry: 3
      Data: 840
    - Name: 
      Entry: 8
      Data: 
    - Name: 
      Entry: 13
      Data: 
    - Name: 
      Entry: 8
      Data: 
    - Name: <Rumors>k__BackingField
      Entry: 7
      Data: 2|System.Collections.Generic.List`1[[FreelancerDataTool.Interfaces.IInfocard,
        Assembly-CSharp]], mscorlib
    - Name: 
      Entry: 12
      Data: 15
    - Name: 
      Entry: 10
      Data: 7
    - Name: 
      Entry: 10
      Data: 8
    - Name: 
      Entry: 10
      Data: 9
    - Name: 
      Entry: 10
      Data: 10
    - Name: 
      Entry: 10
      Data: 11
    - Name: 
      Entry: 10
      Data: 12
    - Name: 
      Entry: 10
      Data: 13
    - Name: 
      Entry: 10
      Data: 14
    - Name: 
      Entry: 10
      Data: 15
    - Name: 
      Entry: 10
      Data: 16
    - Name: 
      Entry: 10
      Data: 17
    - Name: 
      Entry: 10
      Data: 18
    - Name: 
      Entry: 10
      Data: 19
    - Name: 
      Entry: 10
      Data: 20
    - Name: 
      Entry: 10
      Data: 21
    - Name: 
      Entry: 13
      Data: 
    - Name: 
      Entry: 8
      Data: 
  <Nickname>k__BackingField: li0108_fix_bartender
  <Room>k__BackingField: 
