%YAML 1.1
%TAG !u! tag:unity3d.com,2011:
--- !u!114 &11400000
MonoBehaviour:
  m_ObjectHideFlags: 0
  m_CorrespondingSourceObject: {fileID: 0}
  m_PrefabInstance: {fileID: 0}
  m_PrefabAsset: {fileID: 0}
  m_GameObject: {fileID: 0}
  m_Enabled: 1
  m_EditorHideFlags: 0
  m_Script: {fileID: 11500000, guid: 182eb47472f64de388dd50183c0411d8, type: 3}
  m_Name: SO_Infocard_525673
  m_EditorClassIdentifier: 
  <Key>k__BackingField: 525673
  <Value>k__BackingField: 'I''ve lived on Erie all my life, right here in the planetary
    capital city of Allentown. My parents were advocates of the Zoner way of life,
    and helped settle this planet when I was only 5 years old. There used to be quite
    a few virulent microorganisms on Erie, but they can only be transmitted by insect
    bites. Thankfully, all of the insect carriers were eliminated during the initial
    settlement, so you don''t need to worry about getting any shots during your stay.
    <br>


'
