%YAML 1.1
%TAG !u! tag:unity3d.com,2011:
--- !u!114 &11400000
MonoBehaviour:
  m_ObjectHideFlags: 0
  m_CorrespondingSourceObject: {fileID: 0}
  m_PrefabInstance: {fileID: 0}
  m_PrefabAsset: {fileID: 0}
  m_GameObject: {fileID: 0}
  m_Enabled: 1
  m_EditorHideFlags: 0
  m_Script: {fileID: 11500000, guid: 182eb47472f64de388dd50183c0411d8, type: 3}
  m_Name: SO_Infocard_475419
  m_EditorClassIdentifier: 
  <Key>k__BackingField: 475419
  <Value>k__BackingField: 'I am very respectful of the Blood Dragons. It was two
    weeks ago that I was ambushed in Shikoku by four Bounty Hunters when a Blood
    Dragon came to my aid. My ship was still capable of entering combat, but the
    Blood Dragon insisted on me staying out of range. He told me that he would destroy
    the four Bounty Hunters on his own, which he did! I''ve never seen anyone to
    fight like that before. I will never be able to express my gratitude.<br>


'
