%YAML 1.1
%TAG !u! tag:unity3d.com,2011:
--- !u!114 &11400000
MonoBehaviour:
  m_ObjectHideFlags: 0
  m_CorrespondingSourceObject: {fileID: 0}
  m_PrefabInstance: {fileID: 0}
  m_PrefabAsset: {fileID: 0}
  m_GameObject: {fileID: 0}
  m_Enabled: 1
  m_EditorHideFlags: 0
  m_Script: {fileID: 11500000, guid: 182eb47472f64de388dd50183c0411d8, type: 3}
  m_Name: SO_Infocard_132874
  m_EditorClassIdentifier: 
  <Key>k__BackingField: 132874
  <Value>k__BackingField: 'I used to work for BMM until I discovered that they didn''t
    care about me. That''s why I joined the IMG -- to be my own boss. I get paid
    for the amount of Water and Oxygen I mine -- not some set salary that is always
    going to keep me under someone''s thumb.  <br>


'
