%YAML 1.1
%TAG !u! tag:unity3d.com,2011:
--- !u!114 &11400000
MonoBehaviour:
  m_ObjectHideFlags: 0
  m_CorrespondingSourceObject: {fileID: 0}
  m_PrefabInstance: {fileID: 0}
  m_PrefabAsset: {fileID: 0}
  m_GameObject: {fileID: 0}
  m_Enabled: 1
  m_EditorHideFlags: 0
  m_Script: {fileID: 11500000, guid: 182eb47472f64de388dd50183c0411d8, type: 3}
  m_Name: SO_Infocard_133470
  m_EditorClassIdentifier: 
  <Key>k__BackingField: 133470
  <Value>k__BackingField: 'I have been hired to kill any and all Farmers Alliance
    ships that I encounter. IC is paying me on behalf of Synth Foods. The police
    here haven''t really been paying the Alliance any mind, which has been further
    stressing IC''s relationship with Kusari. Finally IC decided to contract some
    professional killing. Those farmers didn''t know what hit them when I came swooping
    in.<br>


'
