%YAML 1.1
%TAG !u! tag:unity3d.com,2011:
--- !u!114 &11400000
MonoBehaviour:
  m_ObjectHideFlags: 0
  m_CorrespondingSourceObject: {fileID: 0}
  m_PrefabInstance: {fileID: 0}
  m_PrefabAsset: {fileID: 0}
  m_GameObject: {fileID: 0}
  m_Enabled: 1
  m_EditorHideFlags: 0
  m_Script: {fileID: 11500000, guid: 182eb47472f64de388dd50183c0411d8, type: 3}
  m_Name: SO_Infocard_131751
  m_EditorClassIdentifier: 
  <Key>k__BackingField: 131751
  <Value>k__BackingField: 'We get attacked on the way down from Shikoku by Lane Hackers
    and Rogues, and both ways by Xenos. Kusari space is certainly much safer than
    this. We don''t have crime problems like this. I wish Liberty would clean up
    the Independent Worlds, since the criminals come from here. <br>


'
