%YAML 1.1
%TAG !u! tag:unity3d.com,2011:
--- !u!114 &11400000
MonoBehaviour:
  m_ObjectHideFlags: 0
  m_CorrespondingSourceObject: {fileID: 0}
  m_PrefabInstance: {fileID: 0}
  m_PrefabAsset: {fileID: 0}
  m_GameObject: {fileID: 0}
  m_Enabled: 1
  m_EditorHideFlags: 0
  m_Script: {fileID: 11500000, guid: 182eb47472f64de388dd50183c0411d8, type: 3}
  m_Name: SO_Infocard_524317
  m_EditorClassIdentifier: 
  <Key>k__BackingField: 524317
  <Value>k__BackingField: 'I''m hearing talk that the price for gold is skyrocketing.
    I''ve also heard that the Essex withdrew from Dublin, so it sounds to me like
    that''s what I''m going to be spending the next few months running into Kusari.
    We might be seen as &quot;scum&quot; there, but that doesn''t mean the right
    people won''t know a good deal when they see it.<br>


'
