%YAML 1.1
%TAG !u! tag:unity3d.com,2011:
--- !u!114 &11400000
MonoBehaviour:
  m_ObjectHideFlags: 0
  m_CorrespondingSourceObject: {fileID: 0}
  m_PrefabInstance: {fileID: 0}
  m_PrefabAsset: {fileID: 0}
  m_GameObject: {fileID: 0}
  m_Enabled: 1
  m_EditorHideFlags: 0
  m_Script: {fileID: 11500000, guid: 182eb47472f64de388dd50183c0411d8, type: 3}
  m_Name: SO_Infocard_131968
  m_EditorClassIdentifier: 
  <Key>k__BackingField: 131968
  <Value>k__BackingField: 'I''m just taking a breather. Been floating around this
    cursed cloud for weeks. There''s lots of bad guys out there; it''s just tough
    to nail them. Half the time you''re just trying to avoid ice crystals appearing
    out of the mists. <br>


'
