%YAML 1.1
%TAG !u! tag:unity3d.com,2011:
--- !u!114 &11400000
MonoBehaviour:
  m_ObjectHideFlags: 0
  m_CorrespondingSourceObject: {fileID: 0}
  m_PrefabInstance: {fileID: 0}
  m_PrefabAsset: {fileID: 0}
  m_GameObject: {fileID: 0}
  m_Enabled: 1
  m_EditorHideFlags: 0
  m_Script: {fileID: 11500000, guid: 182eb47472f64de388dd50183c0411d8, type: 3}
  m_Name: SO_Infocard_503730
  m_EditorClassIdentifier: 
  <Key>k__BackingField: 503730
  <Value>k__BackingField: '<b>ALLIES:<nbsp> <br></b>LSF, Liberty Navy, LPI, Liberty
    Corporations<br><b><nbsp><br>ENEMIES: <br></b>Liberty Rogues, Lane Hackers, Outcasts,
    Criminals<br><nbsp><br>Universal Shipping is one of the "Big Three" Liberty companies
    and specializes in the shipping of high-risk, high-value cargo.<br>


'
