%YAML 1.1
%TAG !u! tag:unity3d.com,2011:
--- !u!114 &11400000
MonoBehaviour:
  m_ObjectHideFlags: 0
  m_CorrespondingSourceObject: {fileID: 0}
  m_PrefabInstance: {fileID: 0}
  m_PrefabAsset: {fileID: 0}
  m_GameObject: {fileID: 0}
  m_Enabled: 1
  m_EditorHideFlags: 0
  m_Script: {fileID: 11500000, guid: 77745e53922c405d884b74e75f714afa, type: 3}
  m_Name: SO_Npc_BloodDragonsHanakoTakei
  m_EditorClassIdentifier: 
  serializationData:
    SerializedFormat: 2
    SerializedBytes: 
    ReferencedUnityObjects:
    - {fileID: 11400000, guid: 7349971fed91542d7b4d4f4100679378, type: 2}
    - {fileID: 11400000, guid: bd3e4e60d55d64e7ca2f64dab42b169e, type: 2}
    - {fileID: 11400000, guid: e5cf04969bfc74cfa9d781d655359d78, type: 2}
    - {fileID: 11400000, guid: 883518c7af7944e30bebccee75847699, type: 2}
    - {fileID: 11400000, guid: f0bbc2de34e8a452da9bc08cda309cb7, type: 2}
    - {fileID: 11400000, guid: 6c06fa174610e4bc79e8289b34c10b15, type: 2}
    - {fileID: 11400000, guid: 7081e5993ad9a40348279e41a7966347, type: 2}
    - {fileID: 11400000, guid: 852f59d16782e40b49fb7af626c12f4c, type: 2}
    - {fileID: 11400000, guid: f31a082490e1e490faed502efbc33168, type: 2}
    - {fileID: 11400000, guid: ea92e92013e294d93ac3f84116ab45a6, type: 2}
    - {fileID: 11400000, guid: 79d2dc27b000545f1abd574f89e940e7, type: 2}
    - {fileID: 11400000, guid: a0c406d0b3f914da1b58d027aa7ed7ec, type: 2}
    SerializedBytesString: 
    Prefab: {fileID: 0}
    PrefabModificationsReferencedUnityObjects: []
    PrefabModifications: []
    SerializationNodes:
    - Name: <Name>k__BackingField
      Entry: 10
      Data: 0
    - Name: <Base>k__BackingField
      Entry: 10
      Data: 1
    - Name: <Affiliation>k__BackingField
      Entry: 10
      Data: 2
    - Name: <Bribes>k__BackingField
      Entry: 7
      Data: 0|System.Collections.Generic.Dictionary`2[[FreelancerDataTool.Interfaces.IFaction,
        Assembly-CSharp],[System.Int32, mscorlib]], mscorlib
    - Name: comparer
      Entry: 7
      Data: 1|System.Collections.Generic.ObjectEqualityComparer`1[[FreelancerDataTool.Interfaces.IFaction,
        Assembly-CSharp]], mscorlib
    - Name: 
      Entry: 8
      Data: 
    - Name: 
      Entry: 12
      Data: 0
    - Name: 
      Entry: 13
      Data: 
    - Name: 
      Entry: 8
      Data: 
    - Name: <Rumors>k__BackingField
      Entry: 7
      Data: 2|System.Collections.Generic.List`1[[FreelancerDataTool.Interfaces.IInfocard,
        Assembly-CSharp]], mscorlib
    - Name: 
      Entry: 12
      Data: 9
    - Name: 
      Entry: 10
      Data: 3
    - Name: 
      Entry: 10
      Data: 4
    - Name: 
      Entry: 10
      Data: 5
    - Name: 
      Entry: 10
      Data: 6
    - Name: 
      Entry: 10
      Data: 7
    - Name: 
      Entry: 10
      Data: 8
    - Name: 
      Entry: 10
      Data: 9
    - Name: 
      Entry: 10
      Data: 10
    - Name: 
      Entry: 10
      Data: 11
    - Name: 
      Entry: 13
      Data: 
    - Name: 
      Entry: 8
      Data: 
  <Nickname>k__BackingField: kU1305_blood_003_f
  <Room>k__BackingField: bar
