%YAML 1.1
%TAG !u! tag:unity3d.com,2011:
--- !u!114 &11400000
MonoBehaviour:
  m_ObjectHideFlags: 0
  m_CorrespondingSourceObject: {fileID: 0}
  m_PrefabInstance: {fileID: 0}
  m_PrefabAsset: {fileID: 0}
  m_GameObject: {fileID: 0}
  m_Enabled: 1
  m_EditorHideFlags: 0
  m_Script: {fileID: 11500000, guid: 182eb47472f64de388dd50183c0411d8, type: 3}
  m_Name: SO_Infocard_134240
  m_EditorClassIdentifier: 
  <Key>k__BackingField: 134240
  <Value>k__BackingField: 'I have a friend who told me this isn''t a disease. I can''t
    tell you who he is or what he said it was, but watch your back out there pilot.
    <br>


'
