%YAML 1.1
%TAG !u! tag:unity3d.com,2011:
--- !u!114 &11400000
MonoBehaviour:
  m_ObjectHideFlags: 0
  m_CorrespondingSourceObject: {fileID: 0}
  m_PrefabInstance: {fileID: 0}
  m_PrefabAsset: {fileID: 0}
  m_GameObject: {fileID: 0}
  m_Enabled: 1
  m_EditorHideFlags: 0
  m_Script: {fileID: 11500000, guid: 182eb47472f64de388dd50183c0411d8, type: 3}
  m_Name: SO_Infocard_525409
  m_EditorClassIdentifier: 
  <Key>k__BackingField: 525409
  <Value>k__BackingField: 'On my first training flight with a batch of greens, we
    came upon a squad of Gaians. Now Gaians aren''t exactly the best pilots, but
    at least they can fire and maintain formation at the same time. Usually. My brilliant
    trainees opened fire while outside twice the distance of their weapons range,
    and were out of juice by the time we closed to range. I think the Gaians must
    have taken pity on us, because they just dodged for a while then buggered off.
    I think I heard them laughing on a comm channel. I should have spaced those trainees
    myself. A long nap in an escape pod is just what these twits need to shape them
    up. <br>


'
