%YAML 1.1
%TAG !u! tag:unity3d.com,2011:
--- !u!114 &11400000
MonoBehaviour:
  m_ObjectHideFlags: 0
  m_CorrespondingSourceObject: {fileID: 0}
  m_PrefabInstance: {fileID: 0}
  m_PrefabAsset: {fileID: 0}
  m_GameObject: {fileID: 0}
  m_Enabled: 1
  m_EditorHideFlags: 0
  m_Script: {fileID: 11500000, guid: 182eb47472f64de388dd50183c0411d8, type: 3}
  m_Name: SO_Infocard_133493
  m_EditorClassIdentifier: 
  <Key>k__BackingField: 133493
  <Value>k__BackingField: 'The Saiun Cloud was so beautiful to me when I was first
    assigned to this system. Now I look upon its painted scape with fear, for there
    the worst of Kusari lurks. Even now I''m sure pirates wait for the next appetizing
    convoy to pass.<br>


'
