%YAML 1.1
%TAG !u! tag:unity3d.com,2011:
--- !u!114 &11400000
MonoBehaviour:
  m_ObjectHideFlags: 0
  m_CorrespondingSourceObject: {fileID: 0}
  m_PrefabInstance: {fileID: 0}
  m_PrefabAsset: {fileID: 0}
  m_GameObject: {fileID: 0}
  m_Enabled: 1
  m_EditorHideFlags: 0
  m_Script: {fileID: 11500000, guid: 182eb47472f64de388dd50183c0411d8, type: 3}
  m_Name: SO_Infocard_132524
  m_EditorClassIdentifier: 
  <Key>k__BackingField: 132524
  <Value>k__BackingField: 'This is the one of the best places to buy Gold, or you
    can head to Dublin for the producer''s price. Just remember, that comes at an
    added risk of Corsair and Molly attack. I recommend sticking to the military
    patrol route from the gate to Graves if you go there. <br>


'
