%YAML 1.1
%TAG !u! tag:unity3d.com,2011:
--- !u!114 &11400000
MonoBehaviour:
  m_ObjectHideFlags: 0
  m_CorrespondingSourceObject: {fileID: 0}
  m_PrefabInstance: {fileID: 0}
  m_PrefabAsset: {fileID: 0}
  m_GameObject: {fileID: 0}
  m_Enabled: 1
  m_EditorHideFlags: 0
  m_Script: {fileID: 11500000, guid: 182eb47472f64de388dd50183c0411d8, type: 3}
  m_Name: SO_Infocard_462063
  m_EditorClassIdentifier: 
  <Key>k__BackingField: 462063
  <Value>k__BackingField: 'The Golden Chrysanthemums occasionally dock here for supplies,
    just as they do at Roppongi Station in the New Tokyo system. However, there is
    less risk for them out here as there are no police or navy patrols in the entire
    system. It is a shame really, because the Hogosha wouldn''t be nearly so audacious
    with the navy around to keep an eye on them. Either way, the GC girls are friendly
    enough, and always eager for stories and news from beyond Kusari.<br>


'
