%YAML 1.1
%TAG !u! tag:unity3d.com,2011:
--- !u!114 &11400000
MonoBehaviour:
  m_ObjectHideFlags: 0
  m_CorrespondingSourceObject: {fileID: 0}
  m_PrefabInstance: {fileID: 0}
  m_PrefabAsset: {fileID: 0}
  m_GameObject: {fileID: 0}
  m_Enabled: 1
  m_EditorHideFlags: 0
  m_Script: {fileID: 11500000, guid: 182eb47472f64de388dd50183c0411d8, type: 3}
  m_Name: SO_Infocard_132903
  m_EditorClassIdentifier: 
  <Key>k__BackingField: 132903
  <Value>k__BackingField: 'Almost all Kusari shipping stops in Tokyo. My family is
    here, but I don''t see them often. It is a lonely life, that of a tanshin funin.
    We just brought a load of Fertilizers from Shinkaku in Tau-29. I''m transferring
    to an armored transport leaving for Hokkaido on a Marine deployment to the Matsumoto
    within the next hour. Hokkaido is not an easy trip. Maybe I''ll have some whiskey
    before I go.<br>


'
