%YAML 1.1
%TAG !u! tag:unity3d.com,2011:
--- !u!114 &11400000
MonoBehaviour:
  m_ObjectHideFlags: 0
  m_CorrespondingSourceObject: {fileID: 0}
  m_PrefabInstance: {fileID: 0}
  m_PrefabAsset: {fileID: 0}
  m_GameObject: {fileID: 0}
  m_Enabled: 1
  m_EditorHideFlags: 0
  m_Script: {fileID: 11500000, guid: 182eb47472f64de388dd50183c0411d8, type: 3}
  m_Name: SO_Infocard_513439
  m_EditorClassIdentifier: 
  <Key>k__BackingField: 513439
  <Value>k__BackingField: '"End of the line", that''s what most of the Armed Forces
    call this station. It is fitting, that the northernmost outpost in Bretonian
    space is now an IMG station. Still, the chaps here do good work by producing
    a little H-fuel, some Hydrocarbons, and enough Water and Oxygen to sate the needs
    of everyone in the system. It saves the Armed Forces from having to have that
    hauled from New London. <br>


'
