%YAML 1.1
%TAG !u! tag:unity3d.com,2011:
--- !u!114 &11400000
MonoBehaviour:
  m_ObjectHideFlags: 0
  m_CorrespondingSourceObject: {fileID: 0}
  m_PrefabInstance: {fileID: 0}
  m_PrefabAsset: {fileID: 0}
  m_GameObject: {fileID: 0}
  m_Enabled: 1
  m_EditorHideFlags: 0
  m_Script: {fileID: 11500000, guid: 182eb47472f64de388dd50183c0411d8, type: 3}
  m_Name: SO_Infocard_509709
  m_EditorClassIdentifier: 
  <Key>k__BackingField: 509709
  <Value>k__BackingField: 'You see this? It''s a knife. I like sharp knives. The
    only thing I like more is plunging them into the soft flesh of Royalists. Unfortunately,
    due to the nature of this war, I have to make do with an Agama instead. Most
    of the time.<br>


'
