%YAML 1.1
%TAG !u! tag:unity3d.com,2011:
--- !u!114 &11400000
MonoBehaviour:
  m_ObjectHideFlags: 0
  m_CorrespondingSourceObject: {fileID: 0}
  m_PrefabInstance: {fileID: 0}
  m_PrefabAsset: {fileID: 0}
  m_GameObject: {fileID: 0}
  m_Enabled: 1
  m_EditorHideFlags: 0
  m_Script: {fileID: 11500000, guid: 182eb47472f64de388dd50183c0411d8, type: 3}
  m_Name: SO_Infocard_133224
  m_EditorClassIdentifier: 
  <Key>k__BackingField: 133224
  <Value>k__BackingField: 'When the <i>Hispania</i> was badly damaged while traveling
    to the Sirius Sector, the crew had to determine the best way to survive. Half
    of the crew wanted to abandon ship and make the rest of the journey using <i>Hispania</i>''s
    shuttles; the other half believed they could reach Sirius in the <i>Hispania</i>.
    Those who chose to stay behind held the ship together until planetfall here on
    Malta.<br>


'
