%YAML 1.1
%TAG !u! tag:unity3d.com,2011:
--- !u!114 &11400000
MonoBehaviour:
  m_ObjectHideFlags: 0
  m_CorrespondingSourceObject: {fileID: 0}
  m_PrefabInstance: {fileID: 0}
  m_PrefabAsset: {fileID: 0}
  m_GameObject: {fileID: 0}
  m_Enabled: 1
  m_EditorHideFlags: 0
  m_Script: {fileID: 11500000, guid: 182eb47472f64de388dd50183c0411d8, type: 3}
  m_Name: SO_Infocard_132136
  m_EditorClassIdentifier: 
  <Key>k__BackingField: 132136
  <Value>k__BackingField: 'One of my buddies was chasing some Outcasts near the West
    Dallas Debris Field a few weeks ago. He tried to cut across the edge of the Negra
    Pequena to catch up with them, but he stayed in too long and bought the farm.
    Too bad, he was pretty good. <br>


'
