%YAML 1.1
%TAG !u! tag:unity3d.com,2011:
--- !u!114 &11400000
MonoBehaviour:
  m_ObjectHideFlags: 0
  m_CorrespondingSourceObject: {fileID: 0}
  m_PrefabInstance: {fileID: 0}
  m_PrefabAsset: {fileID: 0}
  m_GameObject: {fileID: 0}
  m_Enabled: 1
  m_EditorHideFlags: 0
  m_Script: {fileID: 11500000, guid: 182eb47472f64de388dd50183c0411d8, type: 3}
  m_Name: SO_Infocard_133086
  m_EditorClassIdentifier: 
  <Key>k__BackingField: 133086
  <Value>k__BackingField: 'My father was a Bounty Hunter and so was his father before
    him. Dad started taking me hunting with him when I turned fourteen. I''ve been
    doing this ever since, and I''ve bagged over four hundred criminals in that time.
    <br>


'
