%YAML 1.1
%TAG !u! tag:unity3d.com,2011:
--- !u!114 &11400000
MonoBehaviour:
  m_ObjectHideFlags: 0
  m_CorrespondingSourceObject: {fileID: 0}
  m_PrefabInstance: {fileID: 0}
  m_PrefabAsset: {fileID: 0}
  m_GameObject: {fileID: 0}
  m_Enabled: 1
  m_EditorHideFlags: 0
  m_Script: {fileID: 11500000, guid: 182eb47472f64de388dd50183c0411d8, type: 3}
  m_Name: SO_Infocard_132735
  m_EditorClassIdentifier: 
  <Key>k__BackingField: 132735
  <Value>k__BackingField: 'I make a run to Freeport 10 in Tau-37 every so often.
    I take Robotics, Hull Panels, and Polymers up there. I suppose you could do the
    same. That is, if the Outcasts will let you that far north. I''m not sure why
    Freeport 10 needs that many Robotics and Hull Panels, but it''s not really my
    concern. <br>


'
