%YAML 1.1
%TAG !u! tag:unity3d.com,2011:
--- !u!114 &11400000
MonoBehaviour:
  m_ObjectHideFlags: 0
  m_CorrespondingSourceObject: {fileID: 0}
  m_PrefabInstance: {fileID: 0}
  m_PrefabAsset: {fileID: 0}
  m_GameObject: {fileID: 0}
  m_Enabled: 1
  m_EditorHideFlags: 0
  m_Script: {fileID: 11500000, guid: 182eb47472f64de388dd50183c0411d8, type: 3}
  m_Name: SO_Infocard_133969
  m_EditorClassIdentifier: 
  <Key>k__BackingField: 133969
  <Value>k__BackingField: 'The Unioners hit our Water transport coming down from
    Hamburg yesterday. Usually they don''t bother with the small prey like that.
    Must of been bored or something. The captain dropped their cargo and left it
    to the pirates, who shortly realized the error they''d made. <br>


'
