%YAML 1.1
%TAG !u! tag:unity3d.com,2011:
--- !u!114 &11400000
MonoBehaviour:
  m_ObjectHideFlags: 0
  m_CorrespondingSourceObject: {fileID: 0}
  m_PrefabInstance: {fileID: 0}
  m_PrefabAsset: {fileID: 0}
  m_GameObject: {fileID: 0}
  m_Enabled: 1
  m_EditorHideFlags: 0
  m_Script: {fileID: 11500000, guid: 182eb47472f64de388dd50183c0411d8, type: 3}
  m_Name: SO_Infocard_471663
  m_EditorClassIdentifier: 
  <Key>k__BackingField: 471663
  <Value>k__BackingField: 'Have you seen the new Karasu design? Try and keep your
    eye on this one, it''s the front-line-fighter for GMG paramilitary forces and
    it hasn''t disappointed its pilots. It is highly agile, has a very small front
    profile and still packs a very strong punch. <br>


'
