%YAML 1.1
%TAG !u! tag:unity3d.com,2011:
--- !u!114 &11400000
MonoBehaviour:
  m_ObjectHideFlags: 0
  m_CorrespondingSourceObject: {fileID: 0}
  m_PrefabInstance: {fileID: 0}
  m_PrefabAsset: {fileID: 0}
  m_GameObject: {fileID: 0}
  m_Enabled: 1
  m_EditorHideFlags: 0
  m_Script: {fileID: 11500000, guid: 182eb47472f64de388dd50183c0411d8, type: 3}
  m_Name: SO_Infocard_131723
  m_EditorClassIdentifier: 
  <Key>k__BackingField: 131723
  <Value>k__BackingField: 'We we''re pretty sure that the Xenos have a base in the
    Denko Cloud in Kepler. Or at least had, can''t imagine they''d stay there with
    no commercial traffic and all that radiation. Good riddance to them. <br>


'
