%YAML 1.1
%TAG !u! tag:unity3d.com,2011:
--- !u!114 &11400000
MonoBehaviour:
  m_ObjectHideFlags: 0
  m_CorrespondingSourceObject: {fileID: 0}
  m_PrefabInstance: {fileID: 0}
  m_PrefabAsset: {fileID: 0}
  m_GameObject: {fileID: 0}
  m_Enabled: 1
  m_EditorHideFlags: 0
  m_Script: {fileID: 11500000, guid: 182eb47472f64de388dd50183c0411d8, type: 3}
  m_Name: SO_Infocard_133808
  m_EditorClassIdentifier: 
  <Key>k__BackingField: 133808
  <Value>k__BackingField: 'Bonn receives most of its basic supplies from New Berlin,
    with the exception of food. That''s brought in from Stuttgart by Synth Foods.
    This station is also the exclusive Rheinland distributor for spare Trade Lane
    parts -- always in demand in the Omega systems. <br><nbsp><br>


'
