%YAML 1.1
%TAG !u! tag:unity3d.com,2011:
--- !u!114 &11400000
MonoBehaviour:
  m_ObjectHideFlags: 0
  m_CorrespondingSourceObject: {fileID: 0}
  m_PrefabInstance: {fileID: 0}
  m_PrefabAsset: {fileID: 0}
  m_GameObject: {fileID: 0}
  m_Enabled: 1
  m_EditorHideFlags: 0
  m_Script: {fileID: 11500000, guid: 182eb47472f64de388dd50183c0411d8, type: 3}
  m_Name: SO_Infocard_131228
  m_EditorClassIdentifier: 
  <Key>k__BackingField: 131228
  <Value>k__BackingField: 'The Xenos don''t usually mess with Liberty shipping, but
    that all changes when it comes to Side Arms. The Xenos love stealing guns, they''ve
    been concentrating attacks on the Detroit Munitions Plant for some time now.
    Ageira is guarding the plant better, so now they''re focusing on the Trade Lane
    between here and Detroit. <br>


'
