%YAML 1.1
%TAG !u! tag:unity3d.com,2011:
--- !u!114 &11400000
MonoBehaviour:
  m_ObjectHideFlags: 0
  m_CorrespondingSourceObject: {fileID: 0}
  m_PrefabInstance: {fileID: 0}
  m_PrefabAsset: {fileID: 0}
  m_GameObject: {fileID: 0}
  m_Enabled: 1
  m_EditorHideFlags: 0
  m_Script: {fileID: 11500000, guid: 182eb47472f64de388dd50183c0411d8, type: 3}
  m_Name: SO_Infocard_133573
  m_EditorClassIdentifier: 
  <Key>k__BackingField: 133573
  <Value>k__BackingField: 'If there were ever an accident in Nansei, all of Kyushu
    would know immediately. This entire complex would be vaporized in an instant.
    Antimatter destroys matter on contact in a mutually destructive collision. We
    have several metric tons stored here for research purposes. That would make a
    1000-megaton thermonuclear weapon explosion look like a candle flame in comparison.<br>


'
