%YAML 1.1
%TAG !u! tag:unity3d.com,2011:
--- !u!114 &11400000
MonoBehaviour:
  m_ObjectHideFlags: 0
  m_CorrespondingSourceObject: {fileID: 0}
  m_PrefabInstance: {fileID: 0}
  m_PrefabAsset: {fileID: 0}
  m_GameObject: {fileID: 0}
  m_Enabled: 1
  m_EditorHideFlags: 0
  m_Script: {fileID: 11500000, guid: 182eb47472f64de388dd50183c0411d8, type: 3}
  m_Name: SO_Infocard_131551
  m_EditorClassIdentifier: 
  <Key>k__BackingField: 131551
  <Value>k__BackingField: 'The reefs here are stupendous. We took the five-day sail
    and sea package. They dive for all sorts of strange creatures and prepare absolutely
    amazing meals every night. The night sky is just incredible here. You can see
    the Barrier in all of its glory stretching off into space. <br><nbsp><br>


'
