%YAML 1.1
%TAG !u! tag:unity3d.com,2011:
--- !u!114 &11400000
MonoBehaviour:
  m_ObjectHideFlags: 0
  m_CorrespondingSourceObject: {fileID: 0}
  m_PrefabInstance: {fileID: 0}
  m_PrefabAsset: {fileID: 0}
  m_GameObject: {fileID: 0}
  m_Enabled: 1
  m_EditorHideFlags: 0
  m_Script: {fileID: 11500000, guid: 182eb47472f64de388dd50183c0411d8, type: 3}
  m_Name: SO_Infocard_525672
  m_EditorClassIdentifier: 
  <Key>k__BackingField: 525672
  <Value>k__BackingField: 'Huh, you wanna know about my name? My parents had a real
    sense of humour, I guess. I love it though! You don''t even want to know my middle
    name, although it begins with F. Anyway, it kinda fits with what I do, so I ain''t
    complaining. <br>


'
