%YAML 1.1
%TAG !u! tag:unity3d.com,2011:
--- !u!114 &11400000
MonoBehaviour:
  m_ObjectHideFlags: 0
  m_CorrespondingSourceObject: {fileID: 0}
  m_PrefabInstance: {fileID: 0}
  m_PrefabAsset: {fileID: 0}
  m_GameObject: {fileID: 0}
  m_Enabled: 1
  m_EditorHideFlags: 0
  m_Script: {fileID: 11500000, guid: 182eb47472f64de388dd50183c0411d8, type: 3}
  m_Name: SO_Infocard_524342
  m_EditorClassIdentifier: 
  <Key>k__BackingField: 524342
  <Value>k__BackingField: 'The slave revolt has been a tipping point in our struggle
    against the Outcasts here. And while the revolt did fail in ousting the maskers
    from their position of power entirely, it has leveled the playing field for the
    rest of us. We plan to send envoys to Freeport 10 as a show of support, together
    we might deter any acts of aggression the &quot;victors&quot; of this war might
    be planning.<br>


'
