%YAML 1.1
%TAG !u! tag:unity3d.com,2011:
--- !u!114 &11400000
MonoBehaviour:
  m_ObjectHideFlags: 0
  m_CorrespondingSourceObject: {fileID: 0}
  m_PrefabInstance: {fileID: 0}
  m_PrefabAsset: {fileID: 0}
  m_GameObject: {fileID: 0}
  m_Enabled: 1
  m_EditorHideFlags: 0
  m_Script: {fileID: 11500000, guid: 182eb47472f64de388dd50183c0411d8, type: 3}
  m_Name: SO_Infocard_468806
  m_EditorClassIdentifier: 
  <Key>k__BackingField: 468806
  <Value>k__BackingField: 'The Hessian movement opposes the current expansionist,
    militaristic government of Rheinland. They''re fighting a war on two fronts:
    One with the Rheinland military forces, the other with the Corsairs. If they
    could concentrate all their forces on Rheinland, I bet they could beat the military
    back easily.<br>


'
