%YAML 1.1
%TAG !u! tag:unity3d.com,2011:
--- !u!114 &11400000
MonoBehaviour:
  m_ObjectHideFlags: 0
  m_CorrespondingSourceObject: {fileID: 0}
  m_PrefabInstance: {fileID: 0}
  m_PrefabAsset: {fileID: 0}
  m_GameObject: {fileID: 0}
  m_Enabled: 1
  m_EditorHideFlags: 0
  m_Script: {fileID: 11500000, guid: a9d7e182f1a5473f8cb5b7a8a258a22b, type: 3}
  m_Name: SO_Ship_CorsairDreadnought
  m_EditorClassIdentifier: 
  serializationData:
    SerializedFormat: 2
    SerializedBytes: 
    ReferencedUnityObjects:
    - {fileID: 11400000, guid: 2c818e5cf37644b549abb7bbae3e6e8a, type: 2}
    - {fileID: 11400000, guid: 5243ca8b3840c44a796dfbcb7f422b9b, type: 2}
    SerializedBytesString: 
    Prefab: {fileID: 0}
    PrefabModificationsReferencedUnityObjects: []
    PrefabModifications: []
    SerializationNodes:
    - Name: <Name>k__BackingField
      Entry: 10
      Data: 0
    - Name: <Infocard>k__BackingField
      Entry: 10
      Data: 1
    - Name: <SteeringTorque>k__BackingField
      Entry: 7
      Data: 0|System.Tuple`3[[System.Single, mscorlib],[System.Single, mscorlib],[System.Single,
        mscorlib]], mscorlib
    - Name: m_Item1
      Entry: 4
      Data: 5.4E+09
    - Name: m_Item2
      Entry: 4
      Data: 5.4E+09
    - Name: m_Item3
      Entry: 4
      Data: 5.4E+09
    - Name: 
      Entry: 8
      Data: 
    - Name: <AngularDrag>k__BackingField
      Entry: 7
      Data: 1|System.Tuple`3[[System.Single, mscorlib],[System.Single, mscorlib],[System.Single,
        mscorlib]], mscorlib
    - Name: m_Item1
      Entry: 4
      Data: 2.5E+10
    - Name: m_Item2
      Entry: 4
      Data: 2.5E+10
    - Name: m_Item3
      Entry: 4
      Data: 2.5E+10
    - Name: 
      Entry: 8
      Data: 
    - Name: <RotationInertia>k__BackingField
      Entry: 7
      Data: 2|System.Tuple`3[[System.Single, mscorlib],[System.Single, mscorlib],[System.Single,
        mscorlib]], mscorlib
    - Name: m_Item1
      Entry: 4
      Data: 2.2E+10
    - Name: m_Item2
      Entry: 4
      Data: 2.2E+10
    - Name: m_Item3
      Entry: 4
      Data: 2.2E+10
    - Name: 
      Entry: 8
      Data: 
  <Nickname>k__BackingField: dsy_legate
  <Model>k__BackingField: {fileID: 0}
  <HoldSize>k__BackingField: 1600
  <HitPoints>k__BackingField: 4915000
  <Nanobots>k__BackingField: 0
  <ShieldBats>k__BackingField: 10400
  <ShipClass>k__BackingField: 18
  <ShipType>k__BackingField: 5
  <Mass>k__BackingField: 250000
  <StrafeForce>k__BackingField: 5000000
  <StrafePowerUsage>k__BackingField: 250
  <MaxBankAngle>k__BackingField: 15
  <LinearDrag>k__BackingField: 120000
  <NudgeForce>k__BackingField: 3000000
