%YAML 1.1
%TAG !u! tag:unity3d.com,2011:
--- !u!114 &11400000
MonoBehaviour:
  m_ObjectHideFlags: 0
  m_CorrespondingSourceObject: {fileID: 0}
  m_PrefabInstance: {fileID: 0}
  m_PrefabAsset: {fileID: 0}
  m_GameObject: {fileID: 0}
  m_Enabled: 1
  m_EditorHideFlags: 0
  m_Script: {fileID: 11500000, guid: 182eb47472f64de388dd50183c0411d8, type: 3}
  m_Name: SO_Infocard_525372
  m_EditorClassIdentifier: 
  <Key>k__BackingField: 525372
  <Value>k__BackingField: 'The Armed Forces aren''t too interested in putting the
    hurt on us. Sure, they''ve got a lot of firepower in this system, but those guns
    are aimed at Gallia, not us. Bretonia knows Gallia is attacking us as much as
    them, so I guess they hope our presence here will thin the Gallic ranks a bit.
    <br>


'
