%YAML 1.1
%TAG !u! tag:unity3d.com,2011:
--- !u!114 &11400000
MonoBehaviour:
  m_ObjectHideFlags: 0
  m_CorrespondingSourceObject: {fileID: 0}
  m_PrefabInstance: {fileID: 0}
  m_PrefabAsset: {fileID: 0}
  m_GameObject: {fileID: 0}
  m_Enabled: 1
  m_EditorHideFlags: 0
  m_Script: {fileID: 11500000, guid: 182eb47472f64de388dd50183c0411d8, type: 3}
  m_Name: SO_Infocard_131705
  m_EditorClassIdentifier: 
  <Key>k__BackingField: 131705
  <Value>k__BackingField: 'I''m running a load of Synth Paste up from Los Angeles
    to the biodome operation on Deshima, and then on to Roppongi. I''ll sure be sorry
    to leave Liberty. Gets pretty hostile up there in Kusari space, especially with
    that Farmers Alliance.<br><nbsp><br>


'
