%YAML 1.1
%TAG !u! tag:unity3d.com,2011:
--- !u!114 &11400000
MonoBehaviour:
  m_ObjectHideFlags: 0
  m_CorrespondingSourceObject: {fileID: 0}
  m_PrefabInstance: {fileID: 0}
  m_PrefabAsset: {fileID: 0}
  m_GameObject: {fileID: 0}
  m_Enabled: 1
  m_EditorHideFlags: 0
  m_Script: {fileID: 11500000, guid: a9d7e182f1a5473f8cb5b7a8a258a22b, type: 3}
  m_Name: SO_Ship_AICruiser
  m_EditorClassIdentifier: 
  serializationData:
    SerializedFormat: 2
    SerializedBytes: 
    ReferencedUnityObjects:
    - {fileID: 11400000, guid: 6b6821e61bd2f44aa9d73f1159097f9f, type: 2}
    - {fileID: 11400000, guid: c00cfef4ebb884ca4bd32c38a151c5f7, type: 2}
    SerializedBytesString: 
    Prefab: {fileID: 0}
    PrefabModificationsReferencedUnityObjects: []
    PrefabModifications: []
    SerializationNodes:
    - Name: <Name>k__BackingField
      Entry: 10
      Data: 0
    - Name: <Infocard>k__BackingField
      Entry: 10
      Data: 1
    - Name: <SteeringTorque>k__BackingField
      Entry: 7
      Data: 0|System.Tuple`3[[System.Single, mscorlib],[System.Single, mscorlib],[System.Single,
        mscorlib]], mscorlib
    - Name: m_Item1
      Entry: 4
      Data: 1.033368E+08
    - Name: m_Item2
      Entry: 4
      Data: 1.033368E+08
    - Name: m_Item3
      Entry: 4
      Data: 1.033368E+08
    - Name: 
      Entry: 8
      Data: 
    - Name: <AngularDrag>k__BackingField
      Entry: 7
      Data: 1|System.Tuple`3[[System.Single, mscorlib],[System.Single, mscorlib],[System.Single,
        mscorlib]], mscorlib
    - Name: m_Item1
      Entry: 4
      Data: 2.871E+08
    - Name: m_Item2
      Entry: 4
      Data: 2.871E+08
    - Name: m_Item3
      Entry: 4
      Data: 2.871E+08
    - Name: 
      Entry: 8
      Data: 
    - Name: <RotationInertia>k__BackingField
      Entry: 7
      Data: 2|System.Tuple`3[[System.Single, mscorlib],[System.Single, mscorlib],[System.Single,
        mscorlib]], mscorlib
    - Name: m_Item1
      Entry: 4
      Data: 1.82592E+08
    - Name: m_Item2
      Entry: 4
      Data: 1.82592E+08
    - Name: m_Item3
      Entry: 4
      Data: 9.8592E+07
    - Name: 
      Entry: 8
      Data: 
  <Nickname>k__BackingField: dsy_harvestercr
  <Model>k__BackingField: {fileID: 0}
  <HoldSize>k__BackingField: 700
  <HitPoints>k__BackingField: 1658000
  <Nanobots>k__BackingField: 0
  <ShieldBats>k__BackingField: 1700
  <ShipClass>k__BackingField: 13
  <ShipType>k__BackingField: 0
  <Mass>k__BackingField: 14000
  <StrafeForce>k__BackingField: 400000
  <StrafePowerUsage>k__BackingField: 400000
  <MaxBankAngle>k__BackingField: 23
  <LinearDrag>k__BackingField: 22400
  <NudgeForce>k__BackingField: 30000
