%YAML 1.1
%TAG !u! tag:unity3d.com,2011:
--- !u!114 &11400000
MonoBehaviour:
  m_ObjectHideFlags: 0
  m_CorrespondingSourceObject: {fileID: 0}
  m_PrefabInstance: {fileID: 0}
  m_PrefabAsset: {fileID: 0}
  m_GameObject: {fileID: 0}
  m_Enabled: 1
  m_EditorHideFlags: 0
  m_Script: {fileID: 11500000, guid: 182eb47472f64de388dd50183c0411d8, type: 3}
  m_Name: SO_Infocard_131535
  m_EditorClassIdentifier: 
  <Key>k__BackingField: 131535
  <Value>k__BackingField: 'The Outcasts run Cardamine in here from somewhere out
    in the Tau worlds. They ship it out from here into Liberty, with the Rogues handling
    much of the dangerous work in New York. We pay a pretty high price even here.
    If you wanted to make a killing, get in close with the Outcasts and buy some
    Cardamine further up the stream, closer to the source. <br>


'
