%YAML 1.1
%TAG !u! tag:unity3d.com,2011:
--- !u!114 &11400000
MonoBehaviour:
  m_ObjectHideFlags: 0
  m_CorrespondingSourceObject: {fileID: 0}
  m_PrefabInstance: {fileID: 0}
  m_PrefabAsset: {fileID: 0}
  m_GameObject: {fileID: 0}
  m_Enabled: 1
  m_EditorHideFlags: 0
  m_Script: {fileID: 11500000, guid: 182eb47472f64de388dd50183c0411d8, type: 3}
  m_Name: SO_Infocard_524316
  m_EditorClassIdentifier: 
  <Key>k__BackingField: 524316
  <Value>k__BackingField: 'Business is booming friend. Want my advice? Snatch whatever
    workable salvage you can from Dublin and bring it back to us here. We''ll pay
    you a pretty penny for it considering how valuable ship components are becoming
    to the Mollys and Corsairs. Just be careful when they start fighting, can''t
    guarantee they won''t accidentally kill you out of spite for our frugality.<br>


'
