%YAML 1.1
%TAG !u! tag:unity3d.com,2011:
--- !u!114 &11400000
MonoBehaviour:
  m_ObjectHideFlags: 0
  m_CorrespondingSourceObject: {fileID: 0}
  m_PrefabInstance: {fileID: 0}
  m_PrefabAsset: {fileID: 0}
  m_GameObject: {fileID: 0}
  m_Enabled: 1
  m_EditorHideFlags: 0
  m_Script: {fileID: 11500000, guid: 182eb47472f64de388dd50183c0411d8, type: 3}
  m_Name: SO_Infocard_476500
  m_EditorClassIdentifier: 
  <Key>k__BackingField: 476500
  <Value>k__BackingField: 'Hola, Senor. Are you by chance the pilot of the transport
    that just delivered our newest contingent of, ah, shall we say, workers? Munitions
    manufacturing is a dangerous and exhausting occupation, there''s no doubt of
    that. We burn through workers like an Outcast through cardamine. Ah, well, what
    I mean to say is, our workers rotate back out to their homes frequently. While
    here, they are well paid and well treated, I assure you. Let me offer you a drink.<br>


'
