%YAML 1.1
%TAG !u! tag:unity3d.com,2011:
--- !u!114 &11400000
MonoBehaviour:
  m_ObjectHideFlags: 0
  m_CorrespondingSourceObject: {fileID: 0}
  m_PrefabInstance: {fileID: 0}
  m_PrefabAsset: {fileID: 0}
  m_GameObject: {fileID: 0}
  m_Enabled: 1
  m_EditorHideFlags: 0
  m_Script: {fileID: 11500000, guid: 182eb47472f64de388dd50183c0411d8, type: 3}
  m_Name: SO_Infocard_133626
  m_EditorClassIdentifier: 
  <Key>k__BackingField: 133626
  <Value>k__BackingField: 'This base was built here to supply Bretonia with much-needed
    Hydrocarbons and Polymers. First, they''ll get shipped to the Zoner base here,
    and then off to New London to be used for our proud old battleships and patrol
    crafts. Too bad we don''t see any of them here - the BPA and CDI instead are
    supposed to be keeping the lanes and Nottingham safe. Uh... Relatively safe.
    <br>


'
