%YAML 1.1
%TAG !u! tag:unity3d.com,2011:
--- !u!114 &11400000
MonoBehaviour:
  m_ObjectHideFlags: 0
  m_CorrespondingSourceObject: {fileID: 0}
  m_PrefabInstance: {fileID: 0}
  m_PrefabAsset: {fileID: 0}
  m_GameObject: {fileID: 0}
  m_Enabled: 1
  m_EditorHideFlags: 0
  m_Script: {fileID: 11500000, guid: 182eb47472f64de388dd50183c0411d8, type: 3}
  m_Name: SO_Infocard_462616
  m_EditorClassIdentifier: 
  <Key>k__BackingField: 462616
  <Value>k__BackingField: 'If it wasn''t so boring, a trip to Leduc Station would
    be a milk run. But they hussle you out of there so fast I wonder sometimes why
    we don''t just jettison the cargo while we cruise past and let them tractor it
    in! That''d ease my mind too, those bioscanners give me the creeps.<br>


'
