%YAML 1.1
%TAG !u! tag:unity3d.com,2011:
--- !u!114 &11400000
MonoBehaviour:
  m_ObjectHideFlags: 0
  m_CorrespondingSourceObject: {fileID: 0}
  m_PrefabInstance: {fileID: 0}
  m_PrefabAsset: {fileID: 0}
  m_GameObject: {fileID: 0}
  m_Enabled: 1
  m_EditorHideFlags: 0
  m_Script: {fileID: 11500000, guid: 182eb47472f64de388dd50183c0411d8, type: 3}
  m_Name: SO_Infocard_132891
  m_EditorClassIdentifier: 
  <Key>k__BackingField: 132891
  <Value>k__BackingField: 'We believe there is a Jump Hole in the Kanto Field that
    leads to Kyushu and points beyond. From there, the Blood Dragons and Golden C.
    can access our system and attack the Kusari people. We are certain that the Hogosha
    know its location, but they will not tell us, as it is most likely used for Artifact
    smuggling.<br>


'
