%YAML 1.1
%TAG !u! tag:unity3d.com,2011:
--- !u!114 &11400000
MonoBehaviour:
  m_ObjectHideFlags: 0
  m_CorrespondingSourceObject: {fileID: 0}
  m_PrefabInstance: {fileID: 0}
  m_PrefabAsset: {fileID: 0}
  m_GameObject: {fileID: 0}
  m_Enabled: 1
  m_EditorHideFlags: 0
  m_Script: {fileID: 11500000, guid: 182eb47472f64de388dd50183c0411d8, type: 3}
  m_Name: SO_Infocard_504987
  m_EditorClassIdentifier: 
  <Key>k__BackingField: 504987
  <Value>k__BackingField: 'I just finished an interesting book on the degradation
    of Rheinland''s Planet Stuttgart''s environment. It seems Synth Foods'' treatment
    has done a number on it, and intentionally to boot. That smells of Planetform''s
    planning - destroy the local ecology so that only what you intend to can survive.
    <br>


'
