%YAML 1.1
%TAG !u! tag:unity3d.com,2011:
--- !u!114 &11400000
MonoBehaviour:
  m_ObjectHideFlags: 0
  m_CorrespondingSourceObject: {fileID: 0}
  m_PrefabInstance: {fileID: 0}
  m_PrefabAsset: {fileID: 0}
  m_GameObject: {fileID: 0}
  m_Enabled: 1
  m_EditorHideFlags: 0
  m_Script: {fileID: 11500000, guid: 182eb47472f64de388dd50183c0411d8, type: 3}
  m_Name: SO_Infocard_515146
  m_EditorClassIdentifier: 
  <Key>k__BackingField: 515146
  <Value>k__BackingField: 'The political situation has changed recently. The Nomads
    are applying more and more pressure to this system. But what actually worries
    me the most is the ''little'' war going on between the Order and the Core. Neither
    side wants to acknowledge the superiority of one another and both seek to think
    that only their way is the correct one. Eventually, they''ll see where this leads
    them. But not without any collateral damage to the innocent population publically
    aligning with neither faction. I am going to dislike it if the Core tries to
    further impose their own regulations upon us. The Order often is not any better,
    but they atleast pack their threat in neat wording. Either way is not what I
    sought for when I left the houses. What worries me the most actually is the fact
    that either faction could seek a central staging point in this battleground -
    which Freeport 11 would be ideal for, especially if the Nomads keep increasing
    their pressure. I do consider looking for a different home, as I keep losing
    shipment after shipment. The Core and Order claim to be our protectors, but neither
    of them is fit for the job if they keep fighting each other. It would be a different
    matter if the Zoners could defend themselves, but we have to rely on winning
    the favour of our neighbors, simple as that.<br>


'
