%YAML 1.1
%TAG !u! tag:unity3d.com,2011:
--- !u!114 &11400000
MonoBehaviour:
  m_ObjectHideFlags: 0
  m_CorrespondingSourceObject: {fileID: 0}
  m_PrefabInstance: {fileID: 0}
  m_PrefabAsset: {fileID: 0}
  m_GameObject: {fileID: 0}
  m_Enabled: 1
  m_EditorHideFlags: 0
  m_Script: {fileID: 11500000, guid: 182eb47472f64de388dd50183c0411d8, type: 3}
  m_Name: SO_Infocard_133791
  m_EditorClassIdentifier: 
  <Key>k__BackingField: 133791
  <Value>k__BackingField: 'The Ring is a key transfer point for Colorado-bound raw
    materials like Copper and Cobalt. Daumann ships them here from their mines in
    Dresden and Omega-7. The security risks are considered too high for Republican
    to ship directly from those systems. <br><nbsp><br>


'
