%YAML 1.1
%TAG !u! tag:unity3d.com,2011:
--- !u!114 &11400000
MonoBehaviour:
  m_ObjectHideFlags: 0
  m_CorrespondingSourceObject: {fileID: 0}
  m_PrefabInstance: {fileID: 0}
  m_PrefabAsset: {fileID: 0}
  m_GameObject: {fileID: 0}
  m_Enabled: 1
  m_EditorHideFlags: 0
  m_Script: {fileID: 11500000, guid: 182eb47472f64de388dd50183c0411d8, type: 3}
  m_Name: SO_Infocard_133223
  m_EditorClassIdentifier: 
  <Key>k__BackingField: 133223
  <Value>k__BackingField: 'The <i>Hispania</i>, our sleeper ship that launched from
    Sol, escaped the Coalition forces undamaged, but there was a saboteur aboard.
    We had almost made it to Sirius when an explosion woke the crew and her passengers
    from their stasis sleep. The ship was crippled, adrift in the vastness of interstellar
    space.<br>


'
