%YAML 1.1
%TAG !u! tag:unity3d.com,2011:
--- !u!114 &11400000
MonoBehaviour:
  m_ObjectHideFlags: 0
  m_CorrespondingSourceObject: {fileID: 0}
  m_PrefabInstance: {fileID: 0}
  m_PrefabAsset: {fileID: 0}
  m_GameObject: {fileID: 0}
  m_Enabled: 1
  m_EditorHideFlags: 0
  m_Script: {fileID: 11500000, guid: 182eb47472f64de388dd50183c0411d8, type: 3}
  m_Name: SO_Infocard_524354
  m_EditorClassIdentifier: 
  <Key>k__BackingField: 524354
  <Value>k__BackingField: 'This place pales in comparison to Malta, but as far as
    rest stops are concerned, it is the finest available to us on the long journey
    to Buffalo base. Eska, the Rogue in charge of the place keeps his men on a tight
    leash as well, so long as he is flattered appropriately and paid his dues when
    asked. Still, this resort could stand to be more than just a den of self indulgence,
    if it were guided by a firm hand like ours.<br>


'
