%YAML 1.1
%TAG !u! tag:unity3d.com,2011:
--- !u!114 &11400000
MonoBehaviour:
  m_ObjectHideFlags: 0
  m_CorrespondingSourceObject: {fileID: 0}
  m_PrefabInstance: {fileID: 0}
  m_PrefabAsset: {fileID: 0}
  m_GameObject: {fileID: 0}
  m_Enabled: 1
  m_EditorHideFlags: 0
  m_Script: {fileID: 11500000, guid: 182eb47472f64de388dd50183c0411d8, type: 3}
  m_Name: SO_Infocard_525280
  m_EditorClassIdentifier: 
  <Key>k__BackingField: 525280
  <Value>k__BackingField: 'Our escort fighters are some of the best in the colonies,
    rivalling the military in skill. We frequently manage to beat back enemy raiding
    parties, which is just as well since the Outcasts love to continually launch
    raids against our operations and convoys. A number of our lads have gone and
    joined up with the Armed Forces now that Gallia has invaded Leeds. They forfeit
    their Guild membership when doing so, but we don''t stop anyone from leaving
    if they want to. Unlike BMM, we don''t work that way. Folk choose to remain with
    the Guild. That''s one of the things that draws people to our organisation. <br>


'
