%YAML 1.1
%TAG !u! tag:unity3d.com,2011:
--- !u!114 &11400000
MonoBehaviour:
  m_ObjectHideFlags: 0
  m_CorrespondingSourceObject: {fileID: 0}
  m_PrefabInstance: {fileID: 0}
  m_PrefabAsset: {fileID: 0}
  m_GameObject: {fileID: 0}
  m_Enabled: 1
  m_EditorHideFlags: 0
  m_Script: {fileID: 11500000, guid: 182eb47472f64de388dd50183c0411d8, type: 3}
  m_Name: SO_Infocard_133105
  m_EditorClassIdentifier: 
  <Key>k__BackingField: 133105
  <Value>k__BackingField: 'Two of my escorts bought the farm back in Magellan, and
    so did one of my gunners. Too bad, we had made it all the way from Newark with
    a full load of H-Fuel without incident until then. Luckily, our transports made
    it safely to Freeport 4, where we patched outselves up and waited for replacement
    escorts to be sent. <br>


'
