%YAML 1.1
%TAG !u! tag:unity3d.com,2011:
--- !u!114 &11400000
MonoBehaviour:
  m_ObjectHideFlags: 0
  m_CorrespondingSourceObject: {fileID: 0}
  m_PrefabInstance: {fileID: 0}
  m_PrefabAsset: {fileID: 0}
  m_GameObject: {fileID: 0}
  m_Enabled: 1
  m_EditorHideFlags: 0
  m_Script: {fileID: 11500000, guid: 182eb47472f64de388dd50183c0411d8, type: 3}
  m_Name: SO_Infocard_465391
  m_EditorClassIdentifier: 
  <Key>k__BackingField: 465391
  <Value>k__BackingField: 'There should be a wrecked ship somewhere north of the
    Baffin jump hole. I arranged for it to have some navigation problems and go off
    course. The Outcasts are transporting gas containers and they are being tight
    lipped about what is in them. I am curious what they have up their sleeves, and
    why they are not telling their allies about it.<br>


'
