%YAML 1.1
%TAG !u! tag:unity3d.com,2011:
--- !u!114 &11400000
MonoBehaviour:
  m_ObjectHideFlags: 0
  m_CorrespondingSourceObject: {fileID: 0}
  m_PrefabInstance: {fileID: 0}
  m_PrefabAsset: {fileID: 0}
  m_GameObject: {fileID: 0}
  m_Enabled: 1
  m_EditorHideFlags: 0
  m_Script: {fileID: 11500000, guid: 182eb47472f64de388dd50183c0411d8, type: 3}
  m_Name: SO_Infocard_133927
  m_EditorClassIdentifier: 
  <Key>k__BackingField: 133927
  <Value>k__BackingField: 'Daumann is the real culprit in the Eighty-Years War. The
    Imperial Navy Command had grave doubts about the wisdom of fighting a guerrilla-style
    war in the Crow Nebula against an enemy that was so well-supplied by Kusari.
    But Daumann saw the huge profits to be made in lucrative shipbuilding contracts,
    and bribed hundreds of key government officials. The rest is history. <br><nbsp><br>


'
