%YAML 1.1
%TAG !u! tag:unity3d.com,2011:
--- !u!114 &11400000
MonoBehaviour:
  m_ObjectHideFlags: 0
  m_CorrespondingSourceObject: {fileID: 0}
  m_PrefabInstance: {fileID: 0}
  m_PrefabAsset: {fileID: 0}
  m_GameObject: {fileID: 0}
  m_Enabled: 1
  m_EditorHideFlags: 0
  m_Script: {fileID: 11500000, guid: 182eb47472f64de388dd50183c0411d8, type: 3}
  m_Name: SO_Infocard_134040
  m_EditorClassIdentifier: 
  <Key>k__BackingField: 134040
  <Value>k__BackingField: 'The Bundschuh need not lower itself to common piracy like
    the Red Hessians. Instead, we are funded by the enlightened Berlin intelligentsia
    looking to do away with the burdens of a corrupt government. This frees us to
    work directly toward our political agenda without being sidetracked by financial
    necessities. <br><nbsp><br>


'
