%YAML 1.1
%TAG !u! tag:unity3d.com,2011:
--- !u!114 &11400000
MonoBehaviour:
  m_ObjectHideFlags: 0
  m_CorrespondingSourceObject: {fileID: 0}
  m_PrefabInstance: {fileID: 0}
  m_PrefabAsset: {fileID: 0}
  m_GameObject: {fileID: 0}
  m_Enabled: 1
  m_EditorHideFlags: 0
  m_Script: {fileID: 11500000, guid: 182eb47472f64de388dd50183c0411d8, type: 3}
  m_Name: SO_Infocard_522056
  m_EditorClassIdentifier: 
  <Key>k__BackingField: 522056
  <Value>k__BackingField: 'I''m part of ALG''s operation in the system, we mostly
    try to coordinate with Bristol in order to do proper cleanups when it comes to
    ship salvaging. There''s plenty of work to be done, but it''s not proving easy
    given how frequently we get roughed up by local thugs. I can see why Liberty
    locks these people up in Huntsville and throws away the key.<br>


'
