%YAML 1.1
%TAG !u! tag:unity3d.com,2011:
--- !u!114 &11400000
MonoBehaviour:
  m_ObjectHideFlags: 0
  m_CorrespondingSourceObject: {fileID: 0}
  m_PrefabInstance: {fileID: 0}
  m_PrefabAsset: {fileID: 0}
  m_GameObject: {fileID: 0}
  m_Enabled: 1
  m_EditorHideFlags: 0
  m_Script: {fileID: 11500000, guid: 182eb47472f64de388dd50183c0411d8, type: 3}
  m_Name: SO_Infocard_132560
  m_EditorClassIdentifier: 
  <Key>k__BackingField: 132560
  <Value>k__BackingField: 'We go further into the clouds than the Armed Forces do.
    I''ve gone right by the Omega-5 Jump Hole more than once. That takes some guts,
    let me tell ya. The Corsairs get really nasty if you get too close to their access
    points. If you''re lucky, they''ll have found some Hessians to shoot though.
    They hate Hessians even more than us. I''ve never been in Omega-5. Not too many
    Hunters survive to tell their tales of that area. <br>


'
