%YAML 1.1
%TAG !u! tag:unity3d.com,2011:
--- !u!114 &11400000
MonoBehaviour:
  m_ObjectHideFlags: 0
  m_CorrespondingSourceObject: {fileID: 0}
  m_PrefabInstance: {fileID: 0}
  m_PrefabAsset: {fileID: 0}
  m_GameObject: {fileID: 0}
  m_Enabled: 1
  m_EditorHideFlags: 0
  m_Script: {fileID: 11500000, guid: 182eb47472f64de388dd50183c0411d8, type: 3}
  m_Name: SO_Infocard_133135
  m_EditorClassIdentifier: 
  <Key>k__BackingField: 133135
  <Value>k__BackingField: 'If you want to know the best place to hide in Omicron
    Alpha, it''s in the wreckage of the <i>Hispania</i>. That''s the ship the Outcasts
    came to Sirius in. They''ve pulled most of the salvage out of there, but you
    can still find stuff. You didn''t know this old Bounty Hunter was educated, did
    you? <br>


'
