%YAML 1.1
%TAG !u! tag:unity3d.com,2011:
--- !u!114 &11400000
MonoBehaviour:
  m_ObjectHideFlags: 0
  m_CorrespondingSourceObject: {fileID: 0}
  m_PrefabInstance: {fileID: 0}
  m_PrefabAsset: {fileID: 0}
  m_GameObject: {fileID: 0}
  m_Enabled: 1
  m_EditorHideFlags: 0
  m_Script: {fileID: 11500000, guid: 182eb47472f64de388dd50183c0411d8, type: 3}
  m_Name: SO_Infocard_132963
  m_EditorClassIdentifier: 
  <Key>k__BackingField: 132963
  <Value>k__BackingField: 'Kusari would have minimal criminal problems if the government
    agreed to some of the reforms proposed by Blood Dragon and Golden C. sympathizers
    some time ago. The new government insists on those groups laying down arms first,
    more likely they just don''t want any radical voices in the government.<br>


'
