%YAML 1.1
%TAG !u! tag:unity3d.com,2011:
--- !u!114 &11400000
MonoBehaviour:
  m_ObjectHideFlags: 0
  m_CorrespondingSourceObject: {fileID: 0}
  m_PrefabInstance: {fileID: 0}
  m_PrefabAsset: {fileID: 0}
  m_GameObject: {fileID: 0}
  m_Enabled: 1
  m_EditorHideFlags: 0
  m_Script: {fileID: 11500000, guid: 182eb47472f64de388dd50183c0411d8, type: 3}
  m_Name: SO_Infocard_133907
  m_EditorClassIdentifier: 
  <Key>k__BackingField: 133907
  <Value>k__BackingField: 'It feels strange to stand here in this city. The Zoners
    do not have a planet that we can call home. We are accustomed to the low-gravity
    environments of our Freeports. We only visit House systems like Hamburg if we
    must procure supplies that are not sold by passing ships. <br><nbsp><br>


'
