%YAML 1.1
%TAG !u! tag:unity3d.com,2011:
--- !u!114 &11400000
MonoBehaviour:
  m_ObjectHideFlags: 0
  m_CorrespondingSourceObject: {fileID: 0}
  m_PrefabInstance: {fileID: 0}
  m_PrefabAsset: {fileID: 0}
  m_GameObject: {fileID: 0}
  m_Enabled: 1
  m_EditorHideFlags: 0
  m_Script: {fileID: 11500000, guid: 182eb47472f64de388dd50183c0411d8, type: 3}
  m_Name: SO_Infocard_393729
  m_EditorClassIdentifier: 
  <Key>k__BackingField: 393729
  <Value>k__BackingField: " <br><b><p align=\"center\">Stats<br></b><p align=\"left\">
    <br>Gun/Turret Mounts: 6/0<br>Base Armor: 17200<br>Cargo Space: 70<br>Power Output:
    1825/32880<br>Thruster Energy: 100/1000<br>Batteries/NanoBots: 155/73<br>Equipment
    Mounts: CM 2xTorp CD <br> <br><b><p align=\"center\">Maneuverability<br></b><p
    align=\"left\"> <br>Max Turn Rate: 64.27\xB0<br>Time to Max Turn: 1.86s<br>Time
    to turn 180\xB0: 3.07s<br>Maximum Strafe Speed: 28.33m/s<br>Distance Strafed
    in 0.5s: 6.85m<br>\n\n"
