%YAML 1.1
%TAG !u! tag:unity3d.com,2011:
--- !u!114 &11400000
MonoBehaviour:
  m_ObjectHideFlags: 0
  m_CorrespondingSourceObject: {fileID: 0}
  m_PrefabInstance: {fileID: 0}
  m_PrefabAsset: {fileID: 0}
  m_GameObject: {fileID: 0}
  m_Enabled: 1
  m_EditorHideFlags: 0
  m_Script: {fileID: 11500000, guid: 77745e53922c405d884b74e75f714afa, type: 3}
  m_Name: SO_Npc_LibertyNavyCaptainJackBently
  m_EditorClassIdentifier: 
  serializationData:
    SerializedFormat: 2
    SerializedBytes: 
    ReferencedUnityObjects:
    - {fileID: 11400000, guid: 63aa20a72bb054d908013b3fa6d1a206, type: 2}
    - {fileID: 11400000, guid: 084f4f92f2926493d8dca27ffb125890, type: 2}
    - {fileID: 11400000, guid: 4d73ec3a6d088418fad3112db70e7447, type: 2}
    - {fileID: 11400000, guid: e00fefb4914304332a87f8c651661090, type: 2}
    - {fileID: 11400000, guid: d638c4329cd794c19bb1afcaf5c02c13, type: 2}
    - {fileID: 11400000, guid: a05c00956571746aaaffcb5c1ffacbdd, type: 2}
    - {fileID: 11400000, guid: bdaa19bc155cb4df798d9b5cd3c00240, type: 2}
    - {fileID: 11400000, guid: 3353833f7ca934de495ec26c601879f9, type: 2}
    - {fileID: 11400000, guid: a9fcd3564560a461ba74685d8111bb73, type: 2}
    - {fileID: 11400000, guid: dd853faa7f39d495394c0763afd0c7cf, type: 2}
    - {fileID: 11400000, guid: 34536de03bf314291ada233dca41e354, type: 2}
    - {fileID: 11400000, guid: e3274bc05153446549c1ea8812b8d4a8, type: 2}
    - {fileID: 11400000, guid: bac185eb696464f99a2d373fde302e73, type: 2}
    - {fileID: 11400000, guid: 8ff64c8f3b0ca48728f57bfbd97030a4, type: 2}
    SerializedBytesString: 
    Prefab: {fileID: 0}
    PrefabModificationsReferencedUnityObjects: []
    PrefabModifications: []
    SerializationNodes:
    - Name: <Name>k__BackingField
      Entry: 10
      Data: 0
    - Name: <Base>k__BackingField
      Entry: 10
      Data: 1
    - Name: <Affiliation>k__BackingField
      Entry: 10
      Data: 2
    - Name: <Bribes>k__BackingField
      Entry: 7
      Data: 0|System.Collections.Generic.Dictionary`2[[FreelancerDataTool.Interfaces.IFaction,
        Assembly-CSharp],[System.Int32, mscorlib]], mscorlib
    - Name: comparer
      Entry: 7
      Data: 1|System.Collections.Generic.ObjectEqualityComparer`1[[FreelancerDataTool.Interfaces.IFaction,
        Assembly-CSharp]], mscorlib
    - Name: 
      Entry: 8
      Data: 
    - Name: 
      Entry: 12
      Data: 0
    - Name: 
      Entry: 13
      Data: 
    - Name: 
      Entry: 8
      Data: 
    - Name: <Rumors>k__BackingField
      Entry: 7
      Data: 2|System.Collections.Generic.List`1[[FreelancerDataTool.Interfaces.IInfocard,
        Assembly-CSharp]], mscorlib
    - Name: 
      Entry: 12
      Data: 11
    - Name: 
      Entry: 10
      Data: 3
    - Name: 
      Entry: 10
      Data: 4
    - Name: 
      Entry: 10
      Data: 5
    - Name: 
      Entry: 10
      Data: 6
    - Name: 
      Entry: 10
      Data: 7
    - Name: 
      Entry: 10
      Data: 8
    - Name: 
      Entry: 10
      Data: 9
    - Name: 
      Entry: 10
      Data: 10
    - Name: 
      Entry: 10
      Data: 11
    - Name: 
      Entry: 10
      Data: 12
    - Name: 
      Entry: 10
      Data: 13
    - Name: 
      Entry: 13
      Data: 
    - Name: 
      Entry: 8
      Data: 
  <Nickname>k__BackingField: li0204_lnavy_004_m
  <Room>k__BackingField: bar
