%YAML 1.1
%TAG !u! tag:unity3d.com,2011:
--- !u!114 &11400000
MonoBehaviour:
  m_ObjectHideFlags: 0
  m_CorrespondingSourceObject: {fileID: 0}
  m_PrefabInstance: {fileID: 0}
  m_PrefabAsset: {fileID: 0}
  m_GameObject: {fileID: 0}
  m_Enabled: 1
  m_EditorHideFlags: 0
  m_Script: {fileID: 11500000, guid: 182eb47472f64de388dd50183c0411d8, type: 3}
  m_Name: SO_Infocard_470128
  m_EditorClassIdentifier: 
  <Key>k__BackingField: 470128
  <Value>k__BackingField: 'You can follow the Buoys to the mining zone in the south
    part of the system, they will steer you clear of the worst of the radiation.
    Watch out for the Red Hessians though, they consider the mining field their turf.
    Best bring an escort along, or if you''re feeling confident in your skills maybe
    you can act as an escort to one of the miners.<br>


'
