%YAML 1.1
%TAG !u! tag:unity3d.com,2011:
--- !u!114 &11400000
MonoBehaviour:
  m_ObjectHideFlags: 0
  m_CorrespondingSourceObject: {fileID: 0}
  m_PrefabInstance: {fileID: 0}
  m_PrefabAsset: {fileID: 0}
  m_GameObject: {fileID: 0}
  m_Enabled: 1
  m_EditorHideFlags: 0
  m_Script: {fileID: 11500000, guid: 182eb47472f64de388dd50183c0411d8, type: 3}
  m_Name: SO_Infocard_509594
  m_EditorClassIdentifier: 
  <Key>k__BackingField: 509594
  <Value>k__BackingField: 'The EFL hotshots who have the privilege of earning a stay
    on Luxury Liner Belleville have come to expect the finest luxuries, Wine, Cigars,
    drugs. Did I mention drugs? The current favorite is Nox. You''d think it would
    be tough getting it on board to our customers, but since the dockmaster is a
    customer, it''s no problem at all.<br>


'
