%YAML 1.1
%TAG !u! tag:unity3d.com,2011:
--- !u!114 &11400000
MonoBehaviour:
  m_ObjectHideFlags: 0
  m_CorrespondingSourceObject: {fileID: 0}
  m_PrefabInstance: {fileID: 0}
  m_PrefabAsset: {fileID: 0}
  m_GameObject: {fileID: 0}
  m_Enabled: 1
  m_EditorHideFlags: 0
  m_Script: {fileID: 11500000, guid: 182eb47472f64de388dd50183c0411d8, type: 3}
  m_Name: SO_Infocard_462840
  m_EditorClassIdentifier: 
  <Key>k__BackingField: 462840
  <Value>k__BackingField: 'Some say this Dreadnought was disabled by pirates in here
    before we set up shop on Springfield. The pirates left the Navy folk to die after
    disabling comms and engines. When the first LPI boarded it... let''s just say
    it wasn''t pretty.<br>


'
