%YAML 1.1
%TAG !u! tag:unity3d.com,2011:
--- !u!114 &11400000
MonoBehaviour:
  m_ObjectHideFlags: 0
  m_CorrespondingSourceObject: {fileID: 0}
  m_PrefabInstance: {fileID: 0}
  m_PrefabAsset: {fileID: 0}
  m_GameObject: {fileID: 0}
  m_Enabled: 1
  m_EditorHideFlags: 0
  m_Script: {fileID: 11500000, guid: 77745e53922c405d884b74e75f714afa, type: 3}
  m_Name: SO_Npc_DaumannHeavyConstructionRep.RubenVonHof
  m_EditorClassIdentifier: 
  serializationData:
    SerializedFormat: 2
    SerializedBytes: 
    ReferencedUnityObjects:
    - {fileID: 11400000, guid: 1a70e89c0659a4c349cb2b1aee106b9a, type: 2}
    - {fileID: 11400000, guid: 9a42566083442492d98aef9f054fe613, type: 2}
    - {fileID: 11400000, guid: b107a784d30094a869f63dee472bac63, type: 2}
    - {fileID: 11400000, guid: 5f0183b68dce54222a7d94ad3430a185, type: 2}
    - {fileID: 11400000, guid: a5bf9bb9fd0ec405299324a565b33c38, type: 2}
    - {fileID: 11400000, guid: 36a63b0f1086047788f78f3678909654, type: 2}
    - {fileID: 11400000, guid: 74e4251e8e6484dbbabb94aa622bbb14, type: 2}
    - {fileID: 11400000, guid: 0d28d406b39ad4e47a1096b0ea3a4266, type: 2}
    - {fileID: 11400000, guid: fea00267fc13e41d998ef9bc0f2de885, type: 2}
    - {fileID: 11400000, guid: ff6d5c83faeae47368ebfbe94bfcb99c, type: 2}
    - {fileID: 11400000, guid: 8a2ea91fe46a84e47b822f77b575f54c, type: 2}
    - {fileID: 11400000, guid: fba6acc0afa5a4381a36aead0adb784b, type: 2}
    - {fileID: 11400000, guid: 2da5a8c38fa9644cc9dbb723d2208629, type: 2}
    - {fileID: 11400000, guid: 01193e4a1f7304c69a066474b273a570, type: 2}
    SerializedBytesString: 
    Prefab: {fileID: 0}
    PrefabModificationsReferencedUnityObjects: []
    PrefabModifications: []
    SerializationNodes:
    - Name: <Name>k__BackingField
      Entry: 10
      Data: 0
    - Name: <Base>k__BackingField
      Entry: 10
      Data: 1
    - Name: <Affiliation>k__BackingField
      Entry: 10
      Data: 2
    - Name: <Bribes>k__BackingField
      Entry: 7
      Data: 0|System.Collections.Generic.Dictionary`2[[FreelancerDataTool.Interfaces.IFaction,
        Assembly-CSharp],[System.Int32, mscorlib]], mscorlib
    - Name: comparer
      Entry: 7
      Data: 1|System.Collections.Generic.ObjectEqualityComparer`1[[FreelancerDataTool.Interfaces.IFaction,
        Assembly-CSharp]], mscorlib
    - Name: 
      Entry: 8
      Data: 
    - Name: 
      Entry: 12
      Data: 0
    - Name: 
      Entry: 13
      Data: 
    - Name: 
      Entry: 8
      Data: 
    - Name: <Rumors>k__BackingField
      Entry: 7
      Data: 2|System.Collections.Generic.List`1[[FreelancerDataTool.Interfaces.IInfocard,
        Assembly-CSharp]], mscorlib
    - Name: 
      Entry: 12
      Data: 11
    - Name: 
      Entry: 10
      Data: 3
    - Name: 
      Entry: 10
      Data: 4
    - Name: 
      Entry: 10
      Data: 5
    - Name: 
      Entry: 10
      Data: 6
    - Name: 
      Entry: 10
      Data: 7
    - Name: 
      Entry: 10
      Data: 8
    - Name: 
      Entry: 10
      Data: 9
    - Name: 
      Entry: 10
      Data: 10
    - Name: 
      Entry: 10
      Data: 11
    - Name: 
      Entry: 10
      Data: 12
    - Name: 
      Entry: 10
      Data: 13
    - Name: 
      Entry: 13
      Data: 
    - Name: 
      Entry: 8
      Data: 
  <Nickname>k__BackingField: rh0401_daumann_003_m
  <Room>k__BackingField: bar
