%YAML 1.1
%TAG !u! tag:unity3d.com,2011:
--- !u!114 &11400000
MonoBehaviour:
  m_ObjectHideFlags: 0
  m_CorrespondingSourceObject: {fileID: 0}
  m_PrefabInstance: {fileID: 0}
  m_PrefabAsset: {fileID: 0}
  m_GameObject: {fileID: 0}
  m_Enabled: 1
  m_EditorHideFlags: 0
  m_Script: {fileID: 11500000, guid: 182eb47472f64de388dd50183c0411d8, type: 3}
  m_Name: SO_Infocard_133265
  m_EditorClassIdentifier: 
  <Key>k__BackingField: 133265
  <Value>k__BackingField: 'Now that our shipyard is operational, we have begun gathering
    the components to build a biodome. If we could have one of those domes under
    direct control of the Corsairs, none of us would ever want again. It would be
    a new age, a time without hunger. Even now we come closer and closer to it. <br><nbsp><br>


'
