%YAML 1.1
%TAG !u! tag:unity3d.com,2011:
--- !u!114 &11400000
MonoBehaviour:
  m_ObjectHideFlags: 0
  m_CorrespondingSourceObject: {fileID: 0}
  m_PrefabInstance: {fileID: 0}
  m_PrefabAsset: {fileID: 0}
  m_GameObject: {fileID: 0}
  m_Enabled: 1
  m_EditorHideFlags: 0
  m_Script: {fileID: 11500000, guid: 182eb47472f64de388dd50183c0411d8, type: 3}
  m_Name: SO_Infocard_133023
  m_EditorClassIdentifier: 
  <Key>k__BackingField: 133023
  <Value>k__BackingField: 'We use the Jump Hole from Sigma-17 to access this system.
    It is in the southeast beyond some oxygen pockets, so you must be very careful.
    Corsairs use if frequently, so don''t linger in the Hole area. <br>


'
