%YAML 1.1
%TAG !u! tag:unity3d.com,2011:
--- !u!114 &11400000
MonoBehaviour:
  m_ObjectHideFlags: 0
  m_CorrespondingSourceObject: {fileID: 0}
  m_PrefabInstance: {fileID: 0}
  m_PrefabAsset: {fileID: 0}
  m_GameObject: {fileID: 0}
  m_Enabled: 1
  m_EditorHideFlags: 0
  m_Script: {fileID: 11500000, guid: 182eb47472f64de388dd50183c0411d8, type: 3}
  m_Name: SO_Infocard_500045
  m_EditorClassIdentifier: 
  <Key>k__BackingField: 500045
  <Value>k__BackingField: " <br><b><p align=\"center\">Stats<br></b><p align=\"left\">
    <br>Gun/Turret Mounts: 0/11<br>Base Armor: 460800<br>Explosion Resistance: 10%<br>Cargo
    Space: 4300<br>Power Output: 7500/90000<br>Thruster Energy: 100/1000<br>Batteries/NanoBots:
    1120/1120<br>Equipment Mounts: CM <br> <br><b><p align=\"center\">Maneuverability<br></b><p
    align=\"left\"> <br>Max Turn Rate: 11.46\xB0<br>Time to Max Turn: 1.38s<br>Time
    to turn 180\xB0: 15.91s<br>Maximum Strafe Speed: 16.67m/s<br>Distance Strafed
    in 0.5s: 2.48m<br>\n\n"
