%YAML 1.1
%TAG !u! tag:unity3d.com,2011:
--- !u!114 &11400000
MonoBehaviour:
  m_ObjectHideFlags: 0
  m_CorrespondingSourceObject: {fileID: 0}
  m_PrefabInstance: {fileID: 0}
  m_PrefabAsset: {fileID: 0}
  m_GameObject: {fileID: 0}
  m_Enabled: 1
  m_EditorHideFlags: 0
  m_Script: {fileID: 11500000, guid: 182eb47472f64de388dd50183c0411d8, type: 3}
  m_Name: SO_Infocard_131266
  m_EditorClassIdentifier: 
  <Key>k__BackingField: 131266
  <Value>k__BackingField: 'A lot of the Luxury Goods produced here in Manhattan are
    headed to the luxury liner Hawaii in the Sigma-19 system. I just got assigned
    the route a few months ago. So far I''ve had nine escorts come and go courtesy
    of the Outcasts. <br>


'
