%YAML 1.1
%TAG !u! tag:unity3d.com,2011:
--- !u!114 &11400000
MonoBehaviour:
  m_ObjectHideFlags: 0
  m_CorrespondingSourceObject: {fileID: 0}
  m_PrefabInstance: {fileID: 0}
  m_PrefabAsset: {fileID: 0}
  m_GameObject: {fileID: 0}
  m_Enabled: 1
  m_EditorHideFlags: 0
  m_Script: {fileID: 11500000, guid: 182eb47472f64de388dd50183c0411d8, type: 3}
  m_Name: SO_Infocard_133699
  m_EditorClassIdentifier: 
  <Key>k__BackingField: 133699
  <Value>k__BackingField: 'We acquiesced to ALG''s request to supply them with metals
    mined from this system because we are trying to foster a friendship between the
    two companies. Since the 80-Years War, Kruger has been struggling to stay afloat.
    A merger between Kruger and ALG would put us back on top. <br><nbsp><br>


'
