%YAML 1.1
%TAG !u! tag:unity3d.com,2011:
--- !u!114 &11400000
MonoBehaviour:
  m_ObjectHideFlags: 0
  m_CorrespondingSourceObject: {fileID: 0}
  m_PrefabInstance: {fileID: 0}
  m_PrefabAsset: {fileID: 0}
  m_GameObject: {fileID: 0}
  m_Enabled: 1
  m_EditorHideFlags: 0
  m_Script: {fileID: 11500000, guid: 182eb47472f64de388dd50183c0411d8, type: 3}
  m_Name: SO_Infocard_513056
  m_EditorClassIdentifier: 
  <Key>k__BackingField: 513056
  <Value>k__BackingField: 'It would not be possible to supply these men purely by
    smuggling, were it not that they are so few in number and ships. That does not
    mean they are a diminished force. This is perhaps the most battle hardened force
    in all of Sirius. <br>


'
