%YAML 1.1
%TAG !u! tag:unity3d.com,2011:
--- !u!114 &11400000
MonoBehaviour:
  m_ObjectHideFlags: 0
  m_CorrespondingSourceObject: {fileID: 0}
  m_PrefabInstance: {fileID: 0}
  m_PrefabAsset: {fileID: 0}
  m_GameObject: {fileID: 0}
  m_Enabled: 1
  m_EditorHideFlags: 0
  m_Script: {fileID: 11500000, guid: 182eb47472f64de388dd50183c0411d8, type: 3}
  m_Name: SO_Infocard_133253
  m_EditorClassIdentifier: 
  <Key>k__BackingField: 133253
  <Value>k__BackingField: 'The first outsider accepted by the Corsairs was a freelancer
    named John Bown. He fought several of our best pilots when he entered the system,
    so he was able to pass. He left with a cargo bay full of Artifacts, and that
    is when trade began. Our economy flourished, allowing us to feed more of our
    people. <br>


'
