%YAML 1.1
%TAG !u! tag:unity3d.com,2011:
--- !u!114 &11400000
MonoBehaviour:
  m_ObjectHideFlags: 0
  m_CorrespondingSourceObject: {fileID: 0}
  m_PrefabInstance: {fileID: 0}
  m_PrefabAsset: {fileID: 0}
  m_GameObject: {fileID: 0}
  m_Enabled: 1
  m_EditorHideFlags: 0
  m_Script: {fileID: 11500000, guid: 182eb47472f64de388dd50183c0411d8, type: 3}
  m_Name: SO_Infocard_131816
  m_EditorClassIdentifier: 
  <Key>k__BackingField: 131816
  <Value>k__BackingField: 'In the old days, they didn''t need Ft. Bush. We just had
    the Baltimore Shipyard out here. With the rise of the Rogues they had to do something.
    Too many ships were getting wasted right in front of our eyes. If they hadn''t
    let that debris build up so close, there wouldn''t be all the problems around
    here. Where there''s debris, there are roaches. That''s what I say. <br><nbsp><br>


'
