%YAML 1.1
%TAG !u! tag:unity3d.com,2011:
--- !u!114 &11400000
MonoBehaviour:
  m_ObjectHideFlags: 0
  m_CorrespondingSourceObject: {fileID: 0}
  m_PrefabInstance: {fileID: 0}
  m_PrefabAsset: {fileID: 0}
  m_GameObject: {fileID: 0}
  m_Enabled: 1
  m_EditorHideFlags: 0
  m_Script: {fileID: 11500000, guid: 182eb47472f64de388dd50183c0411d8, type: 3}
  m_Name: SO_Infocard_133758
  m_EditorClassIdentifier: 
  <Key>k__BackingField: 133758
  <Value>k__BackingField: 'Let me tell you, Rheinland is tough. It''s a cakewalk
    through Liberty, even the Texas system isn''t that bad. Then wham, you hit the
    Independent Worlds. We have to rearm in Houston and beef up the escorts for the
    rest of the trip here. At least we don''t have the LWB headache that Synth Foods
    is dealing with. <br>


'
