%YAML 1.1
%TAG !u! tag:unity3d.com,2011:
--- !u!114 &11400000
MonoBehaviour:
  m_ObjectHideFlags: 0
  m_CorrespondingSourceObject: {fileID: 0}
  m_PrefabInstance: {fileID: 0}
  m_PrefabAsset: {fileID: 0}
  m_GameObject: {fileID: 0}
  m_Enabled: 1
  m_EditorHideFlags: 0
  m_Script: {fileID: 11500000, guid: 182eb47472f64de388dd50183c0411d8, type: 3}
  m_Name: SO_Infocard_525369
  m_EditorClassIdentifier: 
  <Key>k__BackingField: 525369
  <Value>k__BackingField: 'It used to be quiet around here. This base isn''t the
    biggest we have, and was only meant as a small supply station for ships moving
    between the Tau borderworlds and Bretonia, but now, it''s practically on the
    Gallic frontline. Still, the ships that make it into this asteroid field are
    usually only strikecraft, which turns the odds against them in our favor. <br>


'
