%YAML 1.1
%TAG !u! tag:unity3d.com,2011:
--- !u!114 &11400000
MonoBehaviour:
  m_ObjectHideFlags: 0
  m_CorrespondingSourceObject: {fileID: 0}
  m_PrefabInstance: {fileID: 0}
  m_PrefabAsset: {fileID: 0}
  m_GameObject: {fileID: 0}
  m_Enabled: 1
  m_EditorHideFlags: 0
  m_Script: {fileID: 11500000, guid: 182eb47472f64de388dd50183c0411d8, type: 3}
  m_Name: SO_Infocard_462435
  m_EditorClassIdentifier: 
  <Key>k__BackingField: 462435
  <Value>k__BackingField: 'I have worked for the IND for quite some time, and they
    keep saddling me with more and more corporate responsibility... But the thing
    I like best about working for the IND is meeting new people, at the least getting
    out into the field to open new doors to find new clients gives me a chance to
    stay ahead of the desk and keep to the adventure.<br>


'
