%YAML 1.1
%TAG !u! tag:unity3d.com,2011:
--- !u!114 &11400000
MonoBehaviour:
  m_ObjectHideFlags: 0
  m_CorrespondingSourceObject: {fileID: 0}
  m_PrefabInstance: {fileID: 0}
  m_PrefabAsset: {fileID: 0}
  m_GameObject: {fileID: 0}
  m_Enabled: 1
  m_EditorHideFlags: 0
  m_Script: {fileID: 11500000, guid: 182eb47472f64de388dd50183c0411d8, type: 3}
  m_Name: SO_Infocard_131159
  m_EditorClassIdentifier: 
  <Key>k__BackingField: 131159
  <Value>k__BackingField: 'When the Xenos began, we were just miners who kept getting
    shafted by Liberty. There were fewer and fewer jobs as the years rolled by. Finally,
    there was nothing left for us, no jobs, not unless you could use a data pad instead
    of an auto-digger. All our jobs were being done by somebody in Rheinland or Kusari.
    Well, we decided to take back what had been taken from us. <br>


'
