%YAML 1.1
%TAG !u! tag:unity3d.com,2011:
--- !u!114 &11400000
MonoBehaviour:
  m_ObjectHideFlags: 0
  m_CorrespondingSourceObject: {fileID: 0}
  m_PrefabInstance: {fileID: 0}
  m_PrefabAsset: {fileID: 0}
  m_GameObject: {fileID: 0}
  m_Enabled: 1
  m_EditorHideFlags: 0
  m_Script: {fileID: 11500000, guid: 182eb47472f64de388dd50183c0411d8, type: 3}
  m_Name: SO_Infocard_133850
  m_EditorClassIdentifier: 
  <Key>k__BackingField: 133850
  <Value>k__BackingField: 'Berlin ordered this post built about fifty years ago.
    The Hessians were using the old Saar and Harz mining areas as staging grounds
    to attack the southern Trade Lanes. We''re the only thing holding back the Hessian
    hordes from controlling the entire southern end of the New Berlin system. <br><nbsp><br>


'
