%YAML 1.1
%TAG !u! tag:unity3d.com,2011:
--- !u!114 &11400000
MonoBehaviour:
  m_ObjectHideFlags: 0
  m_CorrespondingSourceObject: {fileID: 0}
  m_PrefabInstance: {fileID: 0}
  m_PrefabAsset: {fileID: 0}
  m_GameObject: {fileID: 0}
  m_Enabled: 1
  m_EditorHideFlags: 0
  m_Script: {fileID: 11500000, guid: 182eb47472f64de388dd50183c0411d8, type: 3}
  m_Name: SO_Infocard_477262
  m_EditorClassIdentifier: 
  <Key>k__BackingField: 477262
  <Value>k__BackingField: 'Mutants? Anomalies? Have you been playing those games
    again? We have real problems here.<br> <br>Well, we did have two salvage expeditions
    get into a shootout the other day. Apparently they both claimed the same ruined
    compound and didn''t want to share. Not enough that the planet''s been turned
    into a graveyard, we have to fight ourselves over the bones now, too.<br>


'
