%YAML 1.1
%TAG !u! tag:unity3d.com,2011:
--- !u!114 &11400000
MonoBehaviour:
  m_ObjectHideFlags: 0
  m_CorrespondingSourceObject: {fileID: 0}
  m_PrefabInstance: {fileID: 0}
  m_PrefabAsset: {fileID: 0}
  m_GameObject: {fileID: 0}
  m_Enabled: 1
  m_EditorHideFlags: 0
  m_Script: {fileID: 11500000, guid: 182eb47472f64de388dd50183c0411d8, type: 3}
  m_Name: SO_Infocard_131731
  m_EditorClassIdentifier: 
  <Key>k__BackingField: 131731
  <Value>k__BackingField: 'Ageira Technologies produces the most sophisticated technology
    in the Sirius Sector. We have exclusively designed and manufactured all of the
    Trade Lanes and Jump Gates that have made hyper-fast, long-distance space travel
    feasible for the first time in human history. <br>


'
