%YAML 1.1
%TAG !u! tag:unity3d.com,2011:
--- !u!114 &11400000
MonoBehaviour:
  m_ObjectHideFlags: 0
  m_CorrespondingSourceObject: {fileID: 0}
  m_PrefabInstance: {fileID: 0}
  m_PrefabAsset: {fileID: 0}
  m_GameObject: {fileID: 0}
  m_Enabled: 1
  m_EditorHideFlags: 0
  m_Script: {fileID: 11500000, guid: 77745e53922c405d884b74e75f714afa, type: 3}
  m_Name: SO_Npc_KusariStatePoliceDetectiveTakakoMiura
  m_EditorClassIdentifier: 
  serializationData:
    SerializedFormat: 2
    SerializedBytes: 
    ReferencedUnityObjects:
    - {fileID: 11400000, guid: f67b298e45635415dae132eddae242d9, type: 2}
    - {fileID: 11400000, guid: 06f8b1ab66f314edb89e34b4d88755e5, type: 2}
    - {fileID: 11400000, guid: 65cb16ea8ce8a4ad9ab06dc5f0ce29c3, type: 2}
    - {fileID: 11400000, guid: 5280abcc4e04a40d1b003c7d491e363f, type: 2}
    - {fileID: 11400000, guid: c8653e772fd72437fa8a2e68719afd3b, type: 2}
    - {fileID: 11400000, guid: 1d286cd338c524d3cbacac69517559b5, type: 2}
    - {fileID: 11400000, guid: c957fb3ff999249fe824e9ae7464c7a1, type: 2}
    - {fileID: 11400000, guid: 588bf9eff4aec41088831c8cdcddd475, type: 2}
    - {fileID: 11400000, guid: caf8e44bc66354568a73034b78450d56, type: 2}
    - {fileID: 11400000, guid: c66f01bc0ad2b449aacb8790923d4bc1, type: 2}
    - {fileID: 11400000, guid: 66d8c2102a8ee46fab0eadece4bd6e4b, type: 2}
    SerializedBytesString: 
    Prefab: {fileID: 0}
    PrefabModificationsReferencedUnityObjects: []
    PrefabModifications: []
    SerializationNodes:
    - Name: <Name>k__BackingField
      Entry: 10
      Data: 0
    - Name: <Base>k__BackingField
      Entry: 10
      Data: 1
    - Name: <Affiliation>k__BackingField
      Entry: 10
      Data: 2
    - Name: <Bribes>k__BackingField
      Entry: 7
      Data: 0|System.Collections.Generic.Dictionary`2[[FreelancerDataTool.Interfaces.IFaction,
        Assembly-CSharp],[System.Int32, mscorlib]], mscorlib
    - Name: comparer
      Entry: 7
      Data: 1|System.Collections.Generic.ObjectEqualityComparer`1[[FreelancerDataTool.Interfaces.IFaction,
        Assembly-CSharp]], mscorlib
    - Name: 
      Entry: 8
      Data: 
    - Name: 
      Entry: 12
      Data: 0
    - Name: 
      Entry: 13
      Data: 
    - Name: 
      Entry: 8
      Data: 
    - Name: <Rumors>k__BackingField
      Entry: 7
      Data: 2|System.Collections.Generic.List`1[[FreelancerDataTool.Interfaces.IInfocard,
        Assembly-CSharp]], mscorlib
    - Name: 
      Entry: 12
      Data: 8
    - Name: 
      Entry: 10
      Data: 3
    - Name: 
      Entry: 10
      Data: 4
    - Name: 
      Entry: 10
      Data: 5
    - Name: 
      Entry: 10
      Data: 6
    - Name: 
      Entry: 10
      Data: 7
    - Name: 
      Entry: 10
      Data: 8
    - Name: 
      Entry: 10
      Data: 9
    - Name: 
      Entry: 10
      Data: 10
    - Name: 
      Entry: 13
      Data: 
    - Name: 
      Entry: 8
      Data: 
  <Nickname>k__BackingField: ku0406_kpolice_003_f
  <Room>k__BackingField: bar
