%YAML 1.1
%TAG !u! tag:unity3d.com,2011:
--- !u!114 &11400000
MonoBehaviour:
  m_ObjectHideFlags: 0
  m_CorrespondingSourceObject: {fileID: 0}
  m_PrefabInstance: {fileID: 0}
  m_PrefabAsset: {fileID: 0}
  m_GameObject: {fileID: 0}
  m_Enabled: 1
  m_EditorHideFlags: 0
  m_Script: {fileID: 11500000, guid: 182eb47472f64de388dd50183c0411d8, type: 3}
  m_Name: SO_Infocard_463033
  m_EditorClassIdentifier: 
  <Key>k__BackingField: 463033
  <Value>k__BackingField: 'This is the place where we make most of our Bio-Neural
    Processors. We hit Ageira''s high-tech computing shipments, bring them here in
    transports and adjust them to our needs. When you think about it, most of our
    ships are built thanks to these. Funny, isn''t it?<br>


'
