%YAML 1.1
%TAG !u! tag:unity3d.com,2011:
--- !u!114 &11400000
MonoBehaviour:
  m_ObjectHideFlags: 0
  m_CorrespondingSourceObject: {fileID: 0}
  m_PrefabInstance: {fileID: 0}
  m_PrefabAsset: {fileID: 0}
  m_GameObject: {fileID: 0}
  m_Enabled: 1
  m_EditorHideFlags: 0
  m_Script: {fileID: 11500000, guid: 182eb47472f64de388dd50183c0411d8, type: 3}
  m_Name: SO_Infocard_517016
  m_EditorClassIdentifier: 
  <Key>k__BackingField: 517016
  <Value>k__BackingField: " <br><b><p align=\"center\">Stats<br></b><p align=\"left\">
    <br>Gun/Turret Mounts: 0/16<br>Base Armor: 3481500<br>Cargo Space: 1700<br>Power
    Output: 110000/6600000<br>Thruster Energy: 100/1000<br>Batteries/NanoBots: 8320/0<br>Equipment
    Mounts: CM <br> <br><b><p align=\"center\">Maneuverability<br></b><p align=\"left\">
    <br>Max Turn Rate: 10.31\xB0<br>Time to Max Turn: 6.91s<br>Time to turn 180\xB0:
    18.45s<br>Maximum Strafe Speed: 50m/s<br>Distance Strafed in 2s: 31.18m<br>\n\n"
