%YAML 1.1
%TAG !u! tag:unity3d.com,2011:
--- !u!114 &11400000
MonoBehaviour:
  m_ObjectHideFlags: 0
  m_CorrespondingSourceObject: {fileID: 0}
  m_PrefabInstance: {fileID: 0}
  m_PrefabAsset: {fileID: 0}
  m_GameObject: {fileID: 0}
  m_Enabled: 1
  m_EditorHideFlags: 0
  m_Script: {fileID: 11500000, guid: 182eb47472f64de388dd50183c0411d8, type: 3}
  m_Name: SO_Infocard_505120
  m_EditorClassIdentifier: 
  <Key>k__BackingField: 505120
  <Value>k__BackingField: ' <br><b><p align="center">Stats<br></b><p align="left">
    <br>Gun/Turret Mounts: 1/0<br>Base Armor: 2800<br>Cargo Space: 35<br>Power Output:
    290/2900<br>Batteries/NanoBots: 23/23<br>Impulse Speed: 80<br>Cruise Speed: 425<br>Equipment
    Mounts: CM CD <br>


'
