%YAML 1.1
%TAG !u! tag:unity3d.com,2011:
--- !u!114 &11400000
MonoBehaviour:
  m_ObjectHideFlags: 0
  m_CorrespondingSourceObject: {fileID: 0}
  m_PrefabInstance: {fileID: 0}
  m_PrefabAsset: {fileID: 0}
  m_GameObject: {fileID: 0}
  m_Enabled: 1
  m_EditorHideFlags: 0
  m_Script: {fileID: 11500000, guid: 182eb47472f64de388dd50183c0411d8, type: 3}
  m_Name: SO_Infocard_132556
  m_EditorClassIdentifier: 
  <Key>k__BackingField: 132556
  <Value>k__BackingField: 'Cryer is trying to synthetically derive Cardamine from
    the Alien Organisms. Cardamine is naturally harvested by the Outcasts within
    the Omicron systems of the Edge Nebula. If Cryer can reproduce it here, but in
    a milder and more socially acceptable form, then all the Cardamine addicts in
    Sirius will be able to switch to our legal version. The Stabiline drug is a direct
    result of that research - it allows Cardamine addicts to survive, but it doesn''t
    cure their addiction. Nothing can, given it''s a physical mutation that the addicts
    undergo. <br>


'
