%YAML 1.1
%TAG !u! tag:unity3d.com,2011:
--- !u!114 &11400000
MonoBehaviour:
  m_ObjectHideFlags: 0
  m_CorrespondingSourceObject: {fileID: 0}
  m_PrefabInstance: {fileID: 0}
  m_PrefabAsset: {fileID: 0}
  m_GameObject: {fileID: 0}
  m_Enabled: 1
  m_EditorHideFlags: 0
  m_Script: {fileID: 11500000, guid: 182eb47472f64de388dd50183c0411d8, type: 3}
  m_Name: SO_Infocard_525295
  m_EditorClassIdentifier: 
  <Key>k__BackingField: 525295
  <Value>k__BackingField: 'I hate having that damn battleship hanging around outside
    the station all the time. Its crew are jittery enough at the best of times. When
    the alien station suddenly raised it shields in 800 AS they actually opened fire
    on it! Not that it did them a whole lot of good, the shield didn''t even destabilise.
    I''m glad the station didn''t also have an automated offensive system. <br>


'
