%YAML 1.1
%TAG !u! tag:unity3d.com,2011:
--- !u!114 &11400000
MonoBehaviour:
  m_ObjectHideFlags: 0
  m_CorrespondingSourceObject: {fileID: 0}
  m_PrefabInstance: {fileID: 0}
  m_PrefabAsset: {fileID: 0}
  m_GameObject: {fileID: 0}
  m_Enabled: 1
  m_EditorHideFlags: 0
  m_Script: {fileID: 11500000, guid: 182eb47472f64de388dd50183c0411d8, type: 3}
  m_Name: SO_Infocard_66121
  m_EditorClassIdentifier: 
  <Key>k__BackingField: 66121
  <Value>k__BackingField: '<b>RHEINLAND<br></b> <br><b><u>Settled Planets<br></b></u>Stuttgart<br>Baden-Baden<br>
    <br><b><u>Bases<br></b></u>Freiburg Station<br>Ulm Border Station<br>Konstanz
    Border Station<br>Battleship Karlsruhe<br> <br><b><u>Corporations<br></b></u>Synth
    Foods<br>Orbital Spa and Cruise<br>RGS Shipping<br> <br><b><u>Criminals<br></b></u>Red
    Hessians<br>Farmers Alliance<br> <br><b><u>Produces<br></b></u>Synth Paste<br>


'
