%YAML 1.1
%TAG !u! tag:unity3d.com,2011:
--- !u!114 &11400000
MonoBehaviour:
  m_ObjectHideFlags: 0
  m_CorrespondingSourceObject: {fileID: 0}
  m_PrefabInstance: {fileID: 0}
  m_PrefabAsset: {fileID: 0}
  m_GameObject: {fileID: 0}
  m_Enabled: 1
  m_EditorHideFlags: 0
  m_Script: {fileID: 11500000, guid: 182eb47472f64de388dd50183c0411d8, type: 3}
  m_Name: SO_Infocard_133455
  m_EditorClassIdentifier: 
  <Key>k__BackingField: 133455
  <Value>k__BackingField: 'I fly a patrol into the Keiun to hunt down Gaijin pirates.
    They are mostly coming in from that area. I also escort convoys from the Border
    Worlds. Often times the ships have been so beaten up out there that to be attacked
    here in Shikoku almost ensures their death.<br>


'
