%YAML 1.1
%TAG !u! tag:unity3d.com,2011:
--- !u!114 &11400000
MonoBehaviour:
  m_ObjectHideFlags: 0
  m_CorrespondingSourceObject: {fileID: 0}
  m_PrefabInstance: {fileID: 0}
  m_PrefabAsset: {fileID: 0}
  m_GameObject: {fileID: 0}
  m_Enabled: 1
  m_EditorHideFlags: 0
  m_Script: {fileID: 11500000, guid: 182eb47472f64de388dd50183c0411d8, type: 3}
  m_Name: SO_Infocard_335301
  m_EditorClassIdentifier: 
  <Key>k__BackingField: 335301
  <Value>k__BackingField: " <br><b><p align=\"center\">Stats<br></b><p align=\"left\">
    <br>Gun/Turret Mounts: 0/7<br>Base Armor: 211200<br>Cargo Space: 1500<br>Power
    Output: 4900/40000<br>Thruster Energy: 100/1000<br>Batteries/NanoBots: 440/440<br>Equipment
    Mounts: CM CD Mining Array <br> <br><b><p align=\"center\">Maneuverability<br></b><p
    align=\"left\"> <br>Max Turn Rate: 45.02\xB0<br>Time to Max Turn: 1.48s<br>Time
    to turn 180\xB0: 4.21s<br>Maximum Strafe Speed: 16.67m/s<br>Distance Strafed
    in 0.5s: 4.03m<br>\n\n"
