%YAML 1.1
%TAG !u! tag:unity3d.com,2011:
--- !u!114 &11400000
MonoBehaviour:
  m_ObjectHideFlags: 0
  m_CorrespondingSourceObject: {fileID: 0}
  m_PrefabInstance: {fileID: 0}
  m_PrefabAsset: {fileID: 0}
  m_GameObject: {fileID: 0}
  m_Enabled: 1
  m_EditorHideFlags: 0
  m_Script: {fileID: 11500000, guid: 182eb47472f64de388dd50183c0411d8, type: 3}
  m_Name: SO_Infocard_132047
  m_EditorClassIdentifier: 
  <Key>k__BackingField: 132047
  <Value>k__BackingField: 'Deep Space Engineering builds all the greatest of Liberty''s
    technological marvels. From the Jump Gates and Trade Lanes that enable high-speed
    travel throughout the Sirius Sector, to the luxury liners that bring her joy,
    we are Liberty construction. <br>


'
