%YAML 1.1
%TAG !u! tag:unity3d.com,2011:
--- !u!114 &11400000
MonoBehaviour:
  m_ObjectHideFlags: 0
  m_CorrespondingSourceObject: {fileID: 0}
  m_PrefabInstance: {fileID: 0}
  m_PrefabAsset: {fileID: 0}
  m_GameObject: {fileID: 0}
  m_Enabled: 1
  m_EditorHideFlags: 0
  m_Script: {fileID: 11500000, guid: 182eb47472f64de388dd50183c0411d8, type: 3}
  m_Name: SO_Infocard_466141
  m_EditorClassIdentifier: 
  <Key>k__BackingField: 466141
  <Value>k__BackingField: 'Most of our supplies are still enroute. The campaign has
    slowed down our transports and the continuing attacks by the Outcasts and Colonials
    aren''t helping either. If we don''t strengthen our convoys, we might soon find
    ourselves losing critical supplies.<br>


'
