%YAML 1.1
%TAG !u! tag:unity3d.com,2011:
--- !u!114 &11400000
MonoBehaviour:
  m_ObjectHideFlags: 0
  m_CorrespondingSourceObject: {fileID: 0}
  m_PrefabInstance: {fileID: 0}
  m_PrefabAsset: {fileID: 0}
  m_GameObject: {fileID: 0}
  m_Enabled: 1
  m_EditorHideFlags: 0
  m_Script: {fileID: 11500000, guid: 182eb47472f64de388dd50183c0411d8, type: 3}
  m_Name: SO_Infocard_525328
  m_EditorClassIdentifier: 
  <Key>k__BackingField: 525328
  <Value>k__BackingField: 'We''ve kept this base secret even during our ceasefire
    with the Armed Forces a few months back. That wasn''t exactly in line with the
    agreement, but we expected them to not be serious about the agreement anyhow.
    They needed breathing room while Kusari was beating on them, and we needed some
    time to exploit our own gains, like Belfast. <br>


'
