%YAML 1.1
%TAG !u! tag:unity3d.com,2011:
--- !u!114 &11400000
MonoBehaviour:
  m_ObjectHideFlags: 0
  m_CorrespondingSourceObject: {fileID: 0}
  m_PrefabInstance: {fileID: 0}
  m_PrefabAsset: {fileID: 0}
  m_GameObject: {fileID: 0}
  m_Enabled: 1
  m_EditorHideFlags: 0
  m_Script: {fileID: 11500000, guid: 182eb47472f64de388dd50183c0411d8, type: 3}
  m_Name: SO_Infocard_133773
  m_EditorClassIdentifier: 
  <Key>k__BackingField: 133773
  <Value>k__BackingField: 'Rheinland must find a way to manufacture the Superconductors
    that are produced exclusively by Liberty. It seems wasteful to ship our cheap
    raw materials halfway across Sirius to Ageira''s plant in Pueblo. Our new ship
    design is far more advanced than the <i>Westfalen</i>, and will require development
    of new propulsion and shielding technologies. <br><nbsp><br>


'
