%YAML 1.1
%TAG !u! tag:unity3d.com,2011:
--- !u!114 &11400000
MonoBehaviour:
  m_ObjectHideFlags: 0
  m_CorrespondingSourceObject: {fileID: 0}
  m_PrefabInstance: {fileID: 0}
  m_PrefabAsset: {fileID: 0}
  m_GameObject: {fileID: 0}
  m_Enabled: 1
  m_EditorHideFlags: 0
  m_Script: {fileID: 11500000, guid: 182eb47472f64de388dd50183c0411d8, type: 3}
  m_Name: SO_Infocard_477259
  m_EditorClassIdentifier: 
  <Key>k__BackingField: 477259
  <Value>k__BackingField: 'The reconstruction program we''re running here is one
    of the Coalition''s top priorities.<br> <br>We''ve scoured our population for
    architects and engineers, and even outsourced a few projects to certain Sirian
    companies, with oversight of course. We import construction materials and tools
    from our allies. We''re offering incentives to anyone willing to help rebuild.<br>
    <br>We will not rest until every bit of ordnance and wreckage has been cleaned
    up, until every hospital, school, power plant, and factory are up and running
    again, until every family is provided with a safe, comfortable apartment. When
    we''re done, Jiangxi will be even better than before.<br>


'
