%YAML 1.1
%TAG !u! tag:unity3d.com,2011:
--- !u!114 &11400000
MonoBehaviour:
  m_ObjectHideFlags: 0
  m_CorrespondingSourceObject: {fileID: 0}
  m_PrefabInstance: {fileID: 0}
  m_PrefabAsset: {fileID: 0}
  m_GameObject: {fileID: 0}
  m_Enabled: 1
  m_EditorHideFlags: 0
  m_Script: {fileID: 11500000, guid: 77745e53922c405d884b74e75f714afa, type: 3}
  m_Name: SO_Npc_SamuraHeavyIndustriesSectionChiefMakotoHara
  m_EditorClassIdentifier: 
  serializationData:
    SerializedFormat: 2
    SerializedBytes: 
    ReferencedUnityObjects:
    - {fileID: 11400000, guid: b189b7d7fd65c4d67ba23c3c04e5bfa8, type: 2}
    - {fileID: 11400000, guid: 33fb67576f5944b69a7ddf3e68e70438, type: 2}
    - {fileID: 11400000, guid: 5e23e20842aa4496882b507b57edb054, type: 2}
    - {fileID: 11400000, guid: 0e93712912dea4d3e9bd1f5d354110f0, type: 2}
    - {fileID: 11400000, guid: ddcd1a03ab4164f059076336898f5261, type: 2}
    - {fileID: 11400000, guid: 54f027b89ad8f41ff98e8ee181a0ca2c, type: 2}
    - {fileID: 11400000, guid: 2e807add31f3b477fa30ea8601d82c07, type: 2}
    - {fileID: 11400000, guid: 3393be5e44fa54bbaafb714bd1a85f83, type: 2}
    - {fileID: 11400000, guid: 7917b028cf97f46fbbf67548d72f58d0, type: 2}
    - {fileID: 11400000, guid: ddb8c5ed3ff8a475db04940f05873c20, type: 2}
    - {fileID: 11400000, guid: bb1f13cc5b3d24d1d9b2edf3b8195886, type: 2}
    - {fileID: 11400000, guid: 73158acde353f417293e07df8e822b17, type: 2}
    - {fileID: 11400000, guid: 1b12cccb7ebc449078fa75011baaf176, type: 2}
    - {fileID: 11400000, guid: 322cfc4efcaba4059b8280a5fc6b9753, type: 2}
    - {fileID: 11400000, guid: 0d49541da65954878bf61e618b9e7245, type: 2}
    SerializedBytesString: 
    Prefab: {fileID: 0}
    PrefabModificationsReferencedUnityObjects: []
    PrefabModifications: []
    SerializationNodes:
    - Name: <Name>k__BackingField
      Entry: 10
      Data: 0
    - Name: <Base>k__BackingField
      Entry: 10
      Data: 1
    - Name: <Affiliation>k__BackingField
      Entry: 10
      Data: 2
    - Name: <Bribes>k__BackingField
      Entry: 7
      Data: 0|System.Collections.Generic.Dictionary`2[[FreelancerDataTool.Interfaces.IFaction,
        Assembly-CSharp],[System.Int32, mscorlib]], mscorlib
    - Name: comparer
      Entry: 7
      Data: 1|System.Collections.Generic.ObjectEqualityComparer`1[[FreelancerDataTool.Interfaces.IFaction,
        Assembly-CSharp]], mscorlib
    - Name: 
      Entry: 8
      Data: 
    - Name: 
      Entry: 12
      Data: 0
    - Name: 
      Entry: 13
      Data: 
    - Name: 
      Entry: 8
      Data: 
    - Name: <Rumors>k__BackingField
      Entry: 7
      Data: 2|System.Collections.Generic.List`1[[FreelancerDataTool.Interfaces.IInfocard,
        Assembly-CSharp]], mscorlib
    - Name: 
      Entry: 12
      Data: 12
    - Name: 
      Entry: 10
      Data: 3
    - Name: 
      Entry: 10
      Data: 4
    - Name: 
      Entry: 10
      Data: 5
    - Name: 
      Entry: 10
      Data: 6
    - Name: 
      Entry: 10
      Data: 7
    - Name: 
      Entry: 10
      Data: 8
    - Name: 
      Entry: 10
      Data: 9
    - Name: 
      Entry: 10
      Data: 10
    - Name: 
      Entry: 10
      Data: 11
    - Name: 
      Entry: 10
      Data: 12
    - Name: 
      Entry: 10
      Data: 13
    - Name: 
      Entry: 10
      Data: 14
    - Name: 
      Entry: 13
      Data: 
    - Name: 
      Entry: 8
      Data: 
  <Nickname>k__BackingField: ku0302_samura_001_m
  <Room>k__BackingField: bar
