%YAML 1.1
%TAG !u! tag:unity3d.com,2011:
--- !u!114 &11400000
MonoBehaviour:
  m_ObjectHideFlags: 0
  m_CorrespondingSourceObject: {fileID: 0}
  m_PrefabInstance: {fileID: 0}
  m_PrefabAsset: {fileID: 0}
  m_GameObject: {fileID: 0}
  m_Enabled: 1
  m_EditorHideFlags: 0
  m_Script: {fileID: 11500000, guid: 182eb47472f64de388dd50183c0411d8, type: 3}
  m_Name: SO_Infocard_132759
  m_EditorClassIdentifier: 
  <Key>k__BackingField: 132759
  <Value>k__BackingField: 'Though we are Samura employees, this place is so isolated
    from the main body of Samura that we do not feel like we are connected. The farmers
    here are not company soldiers but family men. Harvesting the Organisms here is
    something that my family has been doing for generations. My son is learning the
    tricks of the trade now, and he will likely teach his son afterwards. <br>


'
