%YAML 1.1
%TAG !u! tag:unity3d.com,2011:
--- !u!114 &11400000
MonoBehaviour:
  m_ObjectHideFlags: 0
  m_CorrespondingSourceObject: {fileID: 0}
  m_PrefabInstance: {fileID: 0}
  m_PrefabAsset: {fileID: 0}
  m_GameObject: {fileID: 0}
  m_Enabled: 1
  m_EditorHideFlags: 0
  m_Script: {fileID: 11500000, guid: 182eb47472f64de388dd50183c0411d8, type: 3}
  m_Name: SO_Infocard_463031
  m_EditorClassIdentifier: 
  <Key>k__BackingField: 463031
  <Value>k__BackingField: 'Battleship Ottawa is a joke. It never leaves Huron''s
    orbit, so all we have to do to hit Navy shipments is to wait for the Ottawa to
    be behind Huron. With the planet on their way, undocking fighter wings have to
    travel all around it. It takes so much time that we''re already docked by the
    time they leave orbit.<br>


'
