%YAML 1.1
%TAG !u! tag:unity3d.com,2011:
--- !u!114 &11400000
MonoBehaviour:
  m_ObjectHideFlags: 0
  m_CorrespondingSourceObject: {fileID: 0}
  m_PrefabInstance: {fileID: 0}
  m_PrefabAsset: {fileID: 0}
  m_GameObject: {fileID: 0}
  m_Enabled: 1
  m_EditorHideFlags: 0
  m_Script: {fileID: 11500000, guid: 182eb47472f64de388dd50183c0411d8, type: 3}
  m_Name: SO_Infocard_131664
  m_EditorClassIdentifier: 
  <Key>k__BackingField: 131664
  <Value>k__BackingField: 'Watch the black matter in the system. If you fly into
    some, you aren''t gonna fly back out. Black matter is what led to all the Trade
    Lane trouble with Ageira and the corporate venture that blew up in its face.
    To pin it on somebody, Ageira canned a few of its top-level execs and a development
    team; those guys now operate the Hacker base in Leiden. <br><nbsp><br>


'
