%YAML 1.1
%TAG !u! tag:unity3d.com,2011:
--- !u!114 &11400000
MonoBehaviour:
  m_ObjectHideFlags: 0
  m_CorrespondingSourceObject: {fileID: 0}
  m_PrefabInstance: {fileID: 0}
  m_PrefabAsset: {fileID: 0}
  m_GameObject: {fileID: 0}
  m_Enabled: 1
  m_EditorHideFlags: 0
  m_Script: {fileID: 11500000, guid: 182eb47472f64de388dd50183c0411d8, type: 3}
  m_Name: SO_Infocard_131537
  m_EditorClassIdentifier: 
  <Key>k__BackingField: 131537
  <Value>k__BackingField: 'Our founders designed the entire USI software system to
    track ships and their contents throughout the entire Trade Lane network in the
    Sirius Sector. Ageira didn''t give us a penny extra. So they left and started
    the Lane Hackers, along with a scanner hardware development group from Colorado.
    IC uses the USI system to calculate precise shipping insurance rates. With USI
    there is no cheating, like there was in the old days. The shippers hate it, but
    they have to insure their shipments. Since we have access to the data, we know
    the precise cargo each ship is carrying, along with it''s position on the Trade
    Lane network - so long as the ships are using the Lanes. <br>


'
