%YAML 1.1
%TAG !u! tag:unity3d.com,2011:
--- !u!114 &11400000
MonoBehaviour:
  m_ObjectHideFlags: 0
  m_CorrespondingSourceObject: {fileID: 0}
  m_PrefabInstance: {fileID: 0}
  m_PrefabAsset: {fileID: 0}
  m_GameObject: {fileID: 0}
  m_Enabled: 1
  m_EditorHideFlags: 0
  m_Script: {fileID: 11500000, guid: 182eb47472f64de388dd50183c0411d8, type: 3}
  m_Name: SO_Infocard_503754
  m_EditorClassIdentifier: 
  <Key>k__BackingField: 503754
  <Value>k__BackingField: " <br><b><p align=\"center\">Stats<br></b><p align=\"left\">
    <br>Gun/Turret Mounts: 0/10<br>Base Armor: 6320000<br>Cargo Space: 1800<br>Power
    Output: 77500/4200000<br>Thruster Energy: 200000/1500000<br>Batteries/NanoBots:
    11900/0<br>Equipment Mounts: CM CD <br> <br><b><p align=\"center\">Maneuverability<br></b><p
    align=\"left\"> <br>Max Turn Rate: 6.5\xB0<br>Time to Max Turn: 4.41s<br>Time
    to turn 180\xB0: 28.32s<br>Maximum Strafe Speed: 31.25m/s<br>Distance Strafed
    in 2s: 11.63m<br> <br><b><p align=\"center\">Components<br></b><p align=\"left\">
    <br><b>Port Engine<br><TRA bold=\"default\"/>Armor: 1440000<br>Explosion Resistance:
    85%<br>Destruction Damage: 2880000<br> <br><b>Starboard Engine<br><TRA bold=\"default\"/>Armor:
    1440000<br>Explosion Resistance: 85%<br>Destruction Damage: 2880000<br>\n\n"
