%YAML 1.1
%TAG !u! tag:unity3d.com,2011:
--- !u!114 &11400000
MonoBehaviour:
  m_ObjectHideFlags: 0
  m_CorrespondingSourceObject: {fileID: 0}
  m_PrefabInstance: {fileID: 0}
  m_PrefabAsset: {fileID: 0}
  m_GameObject: {fileID: 0}
  m_Enabled: 1
  m_EditorHideFlags: 0
  m_Script: {fileID: 11500000, guid: 182eb47472f64de388dd50183c0411d8, type: 3}
  m_Name: SO_Infocard_468772
  m_EditorClassIdentifier: 
  <Key>k__BackingField: 468772
  <Value>k__BackingField: 'Gateway Shipping has proven to be even more of an irritant
    than Bowex ever envisioned. The war has wreaked havok with our finances. One
    ill conceived method for restoring them was to place the blueprints for the Bretonian
    transport line on the open market. Gateway and the damnable IMG closed the transaction
    and now have production rights on Aland Shipyard! What on earth were the directors
    thinking? <br>


'
