%YAML 1.1
%TAG !u! tag:unity3d.com,2011:
--- !u!114 &11400000
MonoBehaviour:
  m_ObjectHideFlags: 0
  m_CorrespondingSourceObject: {fileID: 0}
  m_PrefabInstance: {fileID: 0}
  m_PrefabAsset: {fileID: 0}
  m_GameObject: {fileID: 0}
  m_Enabled: 1
  m_EditorHideFlags: 0
  m_Script: {fileID: 11500000, guid: 182eb47472f64de388dd50183c0411d8, type: 3}
  m_Name: SO_Infocard_460460
  m_EditorClassIdentifier: 
  <Key>k__BackingField: 460460
  <Value>k__BackingField: 'We lost a lot of sisters on the Matsuda. The Outcasts''
    revolt forced our hand trying to break the blockade on the cardamine smuggling
    route, they have their own troubles and they put their trust in us to hold up
    our end of our bargain. The Dragons will never understand why we did what we
    did, but we flew too close to the proverbial sun and paid the price.


'
