%YAML 1.1
%TAG !u! tag:unity3d.com,2011:
--- !u!114 &11400000
MonoBehaviour:
  m_ObjectHideFlags: 0
  m_CorrespondingSourceObject: {fileID: 0}
  m_PrefabInstance: {fileID: 0}
  m_PrefabAsset: {fileID: 0}
  m_GameObject: {fileID: 0}
  m_Enabled: 1
  m_EditorHideFlags: 0
  m_Script: {fileID: 11500000, guid: 182eb47472f64de388dd50183c0411d8, type: 3}
  m_Name: SO_Infocard_132911
  m_EditorClassIdentifier: 
  <Key>k__BackingField: 132911
  <Value>k__BackingField: 'Universal handles part of the Luxury Goods trade between
    Manhattan and Tokyo. It is a very competitive route, but there''s room for three.
    We usually pick up Niobium for the return trip. If only we didn''t have those
    dark Independent Worlds to cross, where the bandits are always waiting.<br>


'
