%YAML 1.1
%TAG !u! tag:unity3d.com,2011:
--- !u!114 &11400000
MonoBehaviour:
  m_ObjectHideFlags: 0
  m_CorrespondingSourceObject: {fileID: 0}
  m_PrefabInstance: {fileID: 0}
  m_PrefabAsset: {fileID: 0}
  m_GameObject: {fileID: 0}
  m_Enabled: 1
  m_EditorHideFlags: 0
  m_Script: {fileID: 11500000, guid: 182eb47472f64de388dd50183c0411d8, type: 3}
  m_Name: SO_Infocard_525284
  m_EditorClassIdentifier: 
  <Key>k__BackingField: 525284
  <Value>k__BackingField: 'Most of our pilots come from Liberty and Bretonia. Some
    Red Hessians or Mollys who don''t want to be on the wrong side of the law anymore
    also join up with us. That''s why we have a number of Rheinlanders working in
    Bretonia and vice-versa. Some people need to leave their home to be safe. The
    IMG doesn''t much care about your past so long as you clean up your act. <br>


'
