%YAML 1.1
%TAG !u! tag:unity3d.com,2011:
--- !u!114 &11400000
MonoBehaviour:
  m_ObjectHideFlags: 0
  m_CorrespondingSourceObject: {fileID: 0}
  m_PrefabInstance: {fileID: 0}
  m_PrefabAsset: {fileID: 0}
  m_GameObject: {fileID: 0}
  m_Enabled: 1
  m_EditorHideFlags: 0
  m_Script: {fileID: 11500000, guid: 182eb47472f64de388dd50183c0411d8, type: 3}
  m_Name: SO_Infocard_132526
  m_EditorClassIdentifier: 
  <Key>k__BackingField: 132526
  <Value>k__BackingField: 'We focus our efforts in New London, Manchester, and Cambridge;
    the military takes over in Dublin and the systems bordering Bretonian core space.
    Needless to say, the military also handle the Gallic threat, although the police
    forces do on occasion interdict Gallic marauders looking for unprotected shipping.
    <br>


'
