%YAML 1.1
%TAG !u! tag:unity3d.com,2011:
--- !u!114 &11400000
MonoBehaviour:
  m_ObjectHideFlags: 0
  m_CorrespondingSourceObject: {fileID: 0}
  m_PrefabInstance: {fileID: 0}
  m_PrefabAsset: {fileID: 0}
  m_GameObject: {fileID: 0}
  m_Enabled: 1
  m_EditorHideFlags: 0
  m_Script: {fileID: 11500000, guid: 182eb47472f64de388dd50183c0411d8, type: 3}
  m_Name: SO_Infocard_517072
  m_EditorClassIdentifier: 
  <Key>k__BackingField: 517072
  <Value>k__BackingField: " <br><b><p align=\"center\">Stats<br></b><p align=\"left\">
    <br>Gun/Turret Mounts: 0/12<br>Base Armor: 358400<br>Cargo Space: 4200<br>Power
    Output: 7500/90000<br>Thruster Energy: 100/1000<br>Batteries/NanoBots: 800/800<br>Equipment
    Mounts: <br> <br><b><p align=\"center\">Maneuverability<br></b><p align=\"left\">
    <br>Max Turn Rate: 11.46\xB0<br>Time to Max Turn: 0.46s<br>Time to turn 180\xB0:
    15.77s<br>Maximum Strafe Speed: 16.67m/s<br>Distance Strafed in 0.5s: 2.74m<br>\n\n"
