%YAML 1.1
%TAG !u! tag:unity3d.com,2011:
--- !u!114 &11400000
MonoBehaviour:
  m_ObjectHideFlags: 0
  m_CorrespondingSourceObject: {fileID: 0}
  m_PrefabInstance: {fileID: 0}
  m_PrefabAsset: {fileID: 0}
  m_GameObject: {fileID: 0}
  m_Enabled: 1
  m_EditorHideFlags: 0
  m_Script: {fileID: 11500000, guid: 182eb47472f64de388dd50183c0411d8, type: 3}
  m_Name: SO_Infocard_133350
  m_EditorClassIdentifier: 
  <Key>k__BackingField: 133350
  <Value>k__BackingField: 'The GMG has assured us that they can handle the criminal
    problem in Sigma-13, but this does not seem to be the case. They should bring
    in the military -- that would seal the border. <br>


'
