%YAML 1.1
%TAG !u! tag:unity3d.com,2011:
--- !u!114 &11400000
MonoBehaviour:
  m_ObjectHideFlags: 0
  m_CorrespondingSourceObject: {fileID: 0}
  m_PrefabInstance: {fileID: 0}
  m_PrefabAsset: {fileID: 0}
  m_GameObject: {fileID: 0}
  m_Enabled: 1
  m_EditorHideFlags: 0
  m_Script: {fileID: 11500000, guid: 182eb47472f64de388dd50183c0411d8, type: 3}
  m_Name: SO_Infocard_133143
  m_EditorClassIdentifier: 
  <Key>k__BackingField: 133143
  <Value>k__BackingField: 'The Jump Hole to our core systems is well hidden because
    of all the nebulas in this system. This part of Sirius is also very isolated
    from the colony Houses. That''s why we didn''t discover each other for so long.
    Now Sirius just seems to keep getting smaller. I suppose that is alright as long
    as our Cardamine continues to sell. <br>


'
