%YAML 1.1
%TAG !u! tag:unity3d.com,2011:
--- !u!114 &11400000
MonoBehaviour:
  m_ObjectHideFlags: 0
  m_CorrespondingSourceObject: {fileID: 0}
  m_PrefabInstance: {fileID: 0}
  m_PrefabAsset: {fileID: 0}
  m_GameObject: {fileID: 0}
  m_Enabled: 1
  m_EditorHideFlags: 0
  m_Script: {fileID: 11500000, guid: 182eb47472f64de388dd50183c0411d8, type: 3}
  m_Name: SO_Infocard_134027
  m_EditorClassIdentifier: 
  <Key>k__BackingField: 134027
  <Value>k__BackingField: 'The police in this system are the dregs of the Rheinland
    Federal Police. They cannot even keep the Bundschuh in check. Of course, that
    is why they find themselves in the most unfashionable system in all of Rheinland.
    Ach, I hate coming here. <br><nbsp><br>


'
