%YAML 1.1
%TAG !u! tag:unity3d.com,2011:
--- !u!114 &11400000
MonoBehaviour:
  m_ObjectHideFlags: 0
  m_CorrespondingSourceObject: {fileID: 0}
  m_PrefabInstance: {fileID: 0}
  m_PrefabAsset: {fileID: 0}
  m_GameObject: {fileID: 0}
  m_Enabled: 1
  m_EditorHideFlags: 0
  m_Script: {fileID: 11500000, guid: 182eb47472f64de388dd50183c0411d8, type: 3}
  m_Name: SO_Infocard_502237
  m_EditorClassIdentifier: 
  <Key>k__BackingField: 502237
  <Value>k__BackingField: '<b>ALLIES: <br></b>Unione Corse, The Maquis<br><b> <br>ENEMIES:
    <br></b>Gallic Navy, GNI, Gallic Corporations<br> <br>The Gallic Brigands are
    a large, loosely affiliated union of space pirates that first appeared in Gallia
    near the end of the third century AGS. Though many Brigands originated from the
    heavily stratified societies of places such as Amiens and Marne, a plurality
    of today''s members are born into a life of crime on one of the Brigands many
    stations. Despite their great numbers, the Brigands rarely act as an organized
    force, and many are fiercely independent, fashioning themselves after romantic
    notions of old Earth''s highwaymen who took from the rich and gave to the poor.
    In reality, most are little more than common criminals who frequently engage
    in smuggling, theft, and even open piracy on Gallia''s tradelanes.<br> <br>Shockingly
    little has changed for the Brigands in Confederal Gallia, trading freedom of
    movement in the Council''s territories for a similar understanding in Minarchy
    space. The easily bribed Royal Police have been replaced by the Gendarmes, whose
    poor training and equipment has become something of a laughing stock to Gallia''s
    criminal underground. The Brigands have even taken on an influx of the old Royal
    Police''s more crooked members, disinterested in their new place in Gallic society.
    As a result, Brigand activity has reached in all time high in the Gallic core
    worlds, and is not expected to decline any time soon.<br>


'
