%YAML 1.1
%TAG !u! tag:unity3d.com,2011:
--- !u!114 &11400000
MonoBehaviour:
  m_ObjectHideFlags: 0
  m_CorrespondingSourceObject: {fileID: 0}
  m_PrefabInstance: {fileID: 0}
  m_PrefabAsset: {fileID: 0}
  m_GameObject: {fileID: 0}
  m_Enabled: 1
  m_EditorHideFlags: 0
  m_Script: {fileID: 11500000, guid: 182eb47472f64de388dd50183c0411d8, type: 3}
  m_Name: SO_Infocard_134008
  m_EditorClassIdentifier: 
  <Key>k__BackingField: 134008
  <Value>k__BackingField: 'Boron and High-Temperature Alloys will be taken all the
    way to Narita in the heart of Kusari from this base. It will be Republican shippers
    that brave the Border Worlds to keep trade running smoothly. <br><nbsp><br>


'
