%YAML 1.1
%TAG !u! tag:unity3d.com,2011:
--- !u!114 &11400000
MonoBehaviour:
  m_ObjectHideFlags: 0
  m_CorrespondingSourceObject: {fileID: 0}
  m_PrefabInstance: {fileID: 0}
  m_PrefabAsset: {fileID: 0}
  m_GameObject: {fileID: 0}
  m_Enabled: 1
  m_EditorHideFlags: 0
  m_Script: {fileID: 11500000, guid: a9d7e182f1a5473f8cb5b7a8a258a22b, type: 3}
  m_Name: SO_Ship_MollyGunboat
  m_EditorClassIdentifier: 
  serializationData:
    SerializedFormat: 2
    SerializedBytes: 
    ReferencedUnityObjects:
    - {fileID: 11400000, guid: fb45161c7da094b0f9884c58977f76e7, type: 2}
    - {fileID: 11400000, guid: dea23fbd1b8a343e5a45edd0a86e7b6b, type: 2}
    SerializedBytesString: 
    Prefab: {fileID: 0}
    PrefabModificationsReferencedUnityObjects: []
    PrefabModifications: []
    SerializationNodes:
    - Name: <Name>k__BackingField
      Entry: 10
      Data: 0
    - Name: <Infocard>k__BackingField
      Entry: 10
      Data: 1
    - Name: <SteeringTorque>k__BackingField
      Entry: 7
      Data: 0|System.Tuple`3[[System.Single, mscorlib],[System.Single, mscorlib],[System.Single,
        mscorlib]], mscorlib
    - Name: m_Item1
      Entry: 4
      Data: 6.557E+07
    - Name: m_Item2
      Entry: 4
      Data: 6.557E+07
    - Name: m_Item3
      Entry: 4
      Data: 9E+07
    - Name: 
      Entry: 8
      Data: 
    - Name: <AngularDrag>k__BackingField
      Entry: 7
      Data: 1|System.Tuple`3[[System.Single, mscorlib],[System.Single, mscorlib],[System.Single,
        mscorlib]], mscorlib
    - Name: m_Item1
      Entry: 4
      Data: 1E+08
    - Name: m_Item2
      Entry: 4
      Data: 1E+08
    - Name: m_Item3
      Entry: 4
      Data: 1E+08
    - Name: 
      Entry: 8
      Data: 
    - Name: <RotationInertia>k__BackingField
      Entry: 7
      Data: 2|System.Tuple`3[[System.Single, mscorlib],[System.Single, mscorlib],[System.Single,
        mscorlib]], mscorlib
    - Name: m_Item1
      Entry: 4
      Data: 4.74E+07
    - Name: m_Item2
      Entry: 4
      Data: 4.74E+07
    - Name: m_Item3
      Entry: 4
      Data: 5.5E+07
    - Name: 
      Entry: 8
      Data: 
  <Nickname>k__BackingField: molly_gb
  <Model>k__BackingField: {fileID: 0}
  <HoldSize>k__BackingField: 220
  <HitPoints>k__BackingField: 361750
  <Nanobots>k__BackingField: 605
  <ShieldBats>k__BackingField: 1300
  <ShipClass>k__BackingField: 11
  <ShipType>k__BackingField: 4
  <Mass>k__BackingField: 1050
  <StrafeForce>k__BackingField: 20000
  <StrafePowerUsage>k__BackingField: 200
  <MaxBankAngle>k__BackingField: 18
  <LinearDrag>k__BackingField: 1
  <NudgeForce>k__BackingField: 30000
