%YAML 1.1
%TAG !u! tag:unity3d.com,2011:
--- !u!114 &11400000
MonoBehaviour:
  m_ObjectHideFlags: 0
  m_CorrespondingSourceObject: {fileID: 0}
  m_PrefabInstance: {fileID: 0}
  m_PrefabAsset: {fileID: 0}
  m_GameObject: {fileID: 0}
  m_Enabled: 1
  m_EditorHideFlags: 0
  m_Script: {fileID: 11500000, guid: 182eb47472f64de388dd50183c0411d8, type: 3}
  m_Name: SO_Infocard_132229
  m_EditorClassIdentifier: 
  <Key>k__BackingField: 132229
  <Value>k__BackingField: 'The Mollys once attempted to drop some MOX bombs into
    the upper atmosphere of New London. Those aristocrats were always a worried bunch.
    Now they actually have something serious to worry about. They''ve seen on Cambridge
    what that kind of thing can do. Still, once a Molly leaves the asteroid field,
    exposed, it takes our sensors less then a few seconds to pick him up. <br>


'
