%YAML 1.1
%TAG !u! tag:unity3d.com,2011:
--- !u!114 &11400000
MonoBehaviour:
  m_ObjectHideFlags: 0
  m_CorrespondingSourceObject: {fileID: 0}
  m_PrefabInstance: {fileID: 0}
  m_PrefabAsset: {fileID: 0}
  m_GameObject: {fileID: 0}
  m_Enabled: 1
  m_EditorHideFlags: 0
  m_Script: {fileID: 11500000, guid: 77745e53922c405d884b74e75f714afa, type: 3}
  m_Name: SO_Npc_ZonersScottShelton
  m_EditorClassIdentifier: 
  serializationData:
    SerializedFormat: 2
    SerializedBytes: 
    ReferencedUnityObjects:
    - {fileID: 11400000, guid: 4b5cd282f26354e0faaa0aec32911c56, type: 2}
    - {fileID: 11400000, guid: eb0afc96d7d944df481fc11e886c7e92, type: 2}
    - {fileID: 11400000, guid: 0420cf83d448a4041bd7dbaab3df644a, type: 2}
    - {fileID: 11400000, guid: 6bcf94db8fa9d43dd8b3840e05f244ed, type: 2}
    - {fileID: 11400000, guid: ba049413157b74ee4bd98fc26c3741ff, type: 2}
    - {fileID: 11400000, guid: 6d5462ddbdff244bfb290d6d82048e2b, type: 2}
    - {fileID: 11400000, guid: 8b41ea54625f349d197852411d2fe936, type: 2}
    - {fileID: 11400000, guid: 1cc1db4ec24a040c2b302044b9bfbd9a, type: 2}
    - {fileID: 11400000, guid: f78c7839cfbe64dbd80e23733d86dd75, type: 2}
    - {fileID: 11400000, guid: fa1142f1833c14f468dc18169c8e5407, type: 2}
    - {fileID: 11400000, guid: f5261e53e89be4d87bbd06eee0496fe8, type: 2}
    - {fileID: 11400000, guid: 1e6c8300766f64eacb49e3f0d04e80f0, type: 2}
    - {fileID: 11400000, guid: 0d424eae1c40746dfb95f9998dc48dd3, type: 2}
    - {fileID: 11400000, guid: 8e151eb1653a34fd49cef6565468096f, type: 2}
    - {fileID: 11400000, guid: 8334be988d0064ec59149521fccf9943, type: 2}
    SerializedBytesString: 
    Prefab: {fileID: 0}
    PrefabModificationsReferencedUnityObjects: []
    PrefabModifications: []
    SerializationNodes:
    - Name: <Name>k__BackingField
      Entry: 10
      Data: 0
    - Name: <Base>k__BackingField
      Entry: 10
      Data: 1
    - Name: <Affiliation>k__BackingField
      Entry: 10
      Data: 2
    - Name: <Bribes>k__BackingField
      Entry: 7
      Data: 0|System.Collections.Generic.Dictionary`2[[FreelancerDataTool.Interfaces.IFaction,
        Assembly-CSharp],[System.Int32, mscorlib]], mscorlib
    - Name: comparer
      Entry: 7
      Data: 1|System.Collections.Generic.ObjectEqualityComparer`1[[FreelancerDataTool.Interfaces.IFaction,
        Assembly-CSharp]], mscorlib
    - Name: 
      Entry: 8
      Data: 
    - Name: 
      Entry: 12
      Data: 0
    - Name: 
      Entry: 13
      Data: 
    - Name: 
      Entry: 8
      Data: 
    - Name: <Rumors>k__BackingField
      Entry: 7
      Data: 2|System.Collections.Generic.List`1[[FreelancerDataTool.Interfaces.IInfocard,
        Assembly-CSharp]], mscorlib
    - Name: 
      Entry: 12
      Data: 12
    - Name: 
      Entry: 10
      Data: 3
    - Name: 
      Entry: 10
      Data: 4
    - Name: 
      Entry: 10
      Data: 5
    - Name: 
      Entry: 10
      Data: 6
    - Name: 
      Entry: 10
      Data: 7
    - Name: 
      Entry: 10
      Data: 8
    - Name: 
      Entry: 10
      Data: 9
    - Name: 
      Entry: 10
      Data: 10
    - Name: 
      Entry: 10
      Data: 11
    - Name: 
      Entry: 10
      Data: 12
    - Name: 
      Entry: 10
      Data: 13
    - Name: 
      Entry: 10
      Data: 14
    - Name: 
      Entry: 13
      Data: 
    - Name: 
      Entry: 8
      Data: 
  <Nickname>k__BackingField: iw0501_zoners_003_m
  <Room>k__BackingField: bar
