%YAML 1.1
%TAG !u! tag:unity3d.com,2011:
--- !u!114 &11400000
MonoBehaviour:
  m_ObjectHideFlags: 0
  m_CorrespondingSourceObject: {fileID: 0}
  m_PrefabInstance: {fileID: 0}
  m_PrefabAsset: {fileID: 0}
  m_GameObject: {fileID: 0}
  m_Enabled: 1
  m_EditorHideFlags: 0
  m_Script: {fileID: 11500000, guid: 182eb47472f64de388dd50183c0411d8, type: 3}
  m_Name: SO_Infocard_133380
  m_EditorClassIdentifier: 
  <Key>k__BackingField: 133380
  <Value>k__BackingField: 'Our base is in Chugoku, through the jump hole in the Kayo
    Cloud. If you want to bring us supplies, there is good money to be made. We especially
    need food and reactor fuel like MOX.<br>


'
