%YAML 1.1
%TAG !u! tag:unity3d.com,2011:
--- !u!114 &11400000
MonoBehaviour:
  m_ObjectHideFlags: 0
  m_CorrespondingSourceObject: {fileID: 0}
  m_PrefabInstance: {fileID: 0}
  m_PrefabAsset: {fileID: 0}
  m_GameObject: {fileID: 0}
  m_Enabled: 1
  m_EditorHideFlags: 0
  m_Script: {fileID: 11500000, guid: 182eb47472f64de388dd50183c0411d8, type: 3}
  m_Name: SO_Infocard_471658
  m_EditorClassIdentifier: 
  <Key>k__BackingField: 471658
  <Value>k__BackingField: 'The Namura originally set out on its journey in almost
    the exact specifications of the old Rheinland warship of those times. After learning
    the details of its destruction, the remaining two warships weren''t redeployed
    until after they received hull upgrades and sensory optimizations. In hindsight,
    it was foolish of us to deploy it the way we did. The ship fared no better against
    the Outcasts then it did against our military fighters in the battle of Yanagi.
    <br>


'
