%YAML 1.1
%TAG !u! tag:unity3d.com,2011:
--- !u!114 &11400000
MonoBehaviour:
  m_ObjectHideFlags: 0
  m_CorrespondingSourceObject: {fileID: 0}
  m_PrefabInstance: {fileID: 0}
  m_PrefabAsset: {fileID: 0}
  m_GameObject: {fileID: 0}
  m_Enabled: 1
  m_EditorHideFlags: 0
  m_Script: {fileID: 11500000, guid: 182eb47472f64de388dd50183c0411d8, type: 3}
  m_Name: SO_Infocard_133864
  m_EditorClassIdentifier: 
  <Key>k__BackingField: 133864
  <Value>k__BackingField: 'I''ve just come in from the Freital base in Omega-11 with
    some Diamonds mined from the Von Rohe Belt. You''re on the edge of nowhere out
    there -- Corsair country to the south and west. We''ve got a little war with
    them going in Omega-5, if you want some action. <br><nbsp><br>


'
