%YAML 1.1
%TAG !u! tag:unity3d.com,2011:
--- !u!114 &11400000
MonoBehaviour:
  m_ObjectHideFlags: 0
  m_CorrespondingSourceObject: {fileID: 0}
  m_PrefabInstance: {fileID: 0}
  m_PrefabAsset: {fileID: 0}
  m_GameObject: {fileID: 0}
  m_Enabled: 1
  m_EditorHideFlags: 0
  m_Script: {fileID: 11500000, guid: 182eb47472f64de388dd50183c0411d8, type: 3}
  m_Name: SO_Infocard_131155
  m_EditorClassIdentifier: 
  <Key>k__BackingField: 131155
  <Value>k__BackingField: 'The Outcasts know we need their Cardamine, and they look
    down on us for it. I can see it in their eyes, even if they don''t say anything.
    I don''t like them holding the Cardamine over us, but I need it. <br>


'
