%YAML 1.1
%TAG !u! tag:unity3d.com,2011:
--- !u!114 &11400000
MonoBehaviour:
  m_ObjectHideFlags: 0
  m_CorrespondingSourceObject: {fileID: 0}
  m_PrefabInstance: {fileID: 0}
  m_PrefabAsset: {fileID: 0}
  m_GameObject: {fileID: 0}
  m_Enabled: 1
  m_EditorHideFlags: 0
  m_Script: {fileID: 11500000, guid: a9d7e182f1a5473f8cb5b7a8a258a22b, type: 3}
  m_Name: SO_Ship_Kaichou
  m_EditorClassIdentifier: 
  serializationData:
    SerializedFormat: 2
    SerializedBytes: 
    ReferencedUnityObjects:
    - {fileID: 11400000, guid: 4b93d6474f424476aaa98f2697fb3568, type: 2}
    - {fileID: 11400000, guid: 2ab34e9c408614760bb706e8d39b9d80, type: 2}
    SerializedBytesString: 
    Prefab: {fileID: 0}
    PrefabModificationsReferencedUnityObjects: []
    PrefabModifications: []
    SerializationNodes:
    - Name: <Name>k__BackingField
      Entry: 10
      Data: 0
    - Name: <Infocard>k__BackingField
      Entry: 10
      Data: 1
    - Name: <SteeringTorque>k__BackingField
      Entry: 7
      Data: 0|System.Tuple`3[[System.Single, mscorlib],[System.Single, mscorlib],[System.Single,
        mscorlib]], mscorlib
    - Name: m_Item1
      Entry: 4
      Data: 80500
    - Name: m_Item2
      Entry: 4
      Data: 80500
    - Name: m_Item3
      Entry: 4
      Data: 97000
    - Name: 
      Entry: 8
      Data: 
    - Name: <AngularDrag>k__BackingField
      Entry: 7
      Data: 1|System.Tuple`3[[System.Single, mscorlib],[System.Single, mscorlib],[System.Single,
        mscorlib]], mscorlib
    - Name: m_Item1
      Entry: 4
      Data: 71000
    - Name: m_Item2
      Entry: 4
      Data: 71000
    - Name: m_Item3
      Entry: 4
      Data: 64000
    - Name: 
      Entry: 8
      Data: 
    - Name: <RotationInertia>k__BackingField
      Entry: 7
      Data: 2|System.Tuple`3[[System.Single, mscorlib],[System.Single, mscorlib],[System.Single,
        mscorlib]], mscorlib
    - Name: m_Item1
      Entry: 4
      Data: 21000
    - Name: m_Item2
      Entry: 4
      Data: 21000
    - Name: m_Item3
      Entry: 4
      Data: 10000
    - Name: 
      Entry: 8
      Data: 
  <Nickname>k__BackingField: dsy_taiidan_vhf
  <Model>k__BackingField: {fileID: 0}
  <HoldSize>k__BackingField: 95
  <HitPoints>k__BackingField: 18900
  <Nanobots>k__BackingField: 79
  <ShieldBats>k__BackingField: 170
  <ShipClass>k__BackingField: 5
  <ShipType>k__BackingField: 1
  <Mass>k__BackingField: 200
  <StrafeForce>k__BackingField: 17000
  <StrafePowerUsage>k__BackingField: 2
  <MaxBankAngle>k__BackingField: 30
  <LinearDrag>k__BackingField: 1
  <NudgeForce>k__BackingField: 30000
