%YAML 1.1
%TAG !u! tag:unity3d.com,2011:
--- !u!114 &11400000
MonoBehaviour:
  m_ObjectHideFlags: 0
  m_CorrespondingSourceObject: {fileID: 0}
  m_PrefabInstance: {fileID: 0}
  m_PrefabAsset: {fileID: 0}
  m_GameObject: {fileID: 0}
  m_Enabled: 1
  m_EditorHideFlags: 0
  m_Script: {fileID: 11500000, guid: 182eb47472f64de388dd50183c0411d8, type: 3}
  m_Name: SO_Infocard_465401
  m_EditorClassIdentifier: 
  <Key>k__BackingField: 465401
  <Value>k__BackingField: '<b>TAU BORDER WORLDS<br></b> <br><b><u>Settled Planets<br></b></u>None<br>
    <br><b><u>Bases<br></b></u>Shasta Orbital Skyhook<br>Pueblo Bonito<br>Sedona
    Station<br> <br><b><u>Corporations<br></b></u>None<br> <br><b><u>Criminals<br></b></u>Unknown<br>
    <br><b><u>Produces<br></b></u>Pineal Amulets<br>Alien Organisms<br>


'
