%YAML 1.1
%TAG !u! tag:unity3d.com,2011:
--- !u!114 &11400000
MonoBehaviour:
  m_ObjectHideFlags: 0
  m_CorrespondingSourceObject: {fileID: 0}
  m_PrefabInstance: {fileID: 0}
  m_PrefabAsset: {fileID: 0}
  m_GameObject: {fileID: 0}
  m_Enabled: 1
  m_EditorHideFlags: 0
  m_Script: {fileID: 11500000, guid: 182eb47472f64de388dd50183c0411d8, type: 3}
  m_Name: SO_Infocard_468764
  m_EditorClassIdentifier: 
  <Key>k__BackingField: 468764
  <Value>k__BackingField: 'I think all this fear-mongering about Rheinland is ridiculous.
    Surely they''re willing to stay on their half of the Omegas, and we''ll stay
    on ours. All those tub-thumpers saying they hate us and are going to invade are
    just trying to stir up inter-house tension. <br>


'
