%YAML 1.1
%TAG !u! tag:unity3d.com,2011:
--- !u!114 &11400000
MonoBehaviour:
  m_ObjectHideFlags: 0
  m_CorrespondingSourceObject: {fileID: 0}
  m_PrefabInstance: {fileID: 0}
  m_PrefabAsset: {fileID: 0}
  m_GameObject: {fileID: 0}
  m_Enabled: 1
  m_EditorHideFlags: 0
  m_Script: {fileID: 11500000, guid: 182eb47472f64de388dd50183c0411d8, type: 3}
  m_Name: SO_Infocard_513206
  m_EditorClassIdentifier: 
  <Key>k__BackingField: 513206
  <Value>k__BackingField: 'If y''can bring in some Prisoners from the Bowex lads
    that are tryin'' to squirrel ''em away to Newgate from the Norfolk, we''ll happily
    toss ye a credit or two for it. For the real big bucks though, Engine Components
    are the way to go. The techies like the ones from Rheinland the best - very well
    built, and they can take a missile or two before something cracks. Our sort of
    gear, really. <br>


'
