%YAML 1.1
%TAG !u! tag:unity3d.com,2011:
--- !u!114 &11400000
MonoBehaviour:
  m_ObjectHideFlags: 0
  m_CorrespondingSourceObject: {fileID: 0}
  m_PrefabInstance: {fileID: 0}
  m_PrefabAsset: {fileID: 0}
  m_GameObject: {fileID: 0}
  m_Enabled: 1
  m_EditorHideFlags: 0
  m_Script: {fileID: 11500000, guid: 182eb47472f64de388dd50183c0411d8, type: 3}
  m_Name: SO_Infocard_525360
  m_EditorClassIdentifier: 
  <Key>k__BackingField: 525360
  <Value>k__BackingField: 'We started as a small group of students who saw how much
    damage the corporations were doing to the Bretonian planets. Take a look at Leeds,
    if you want proof as to how they''ve ruined Bretonia, but New London isn''t much
    better. Foggy and smoggy. For our refusal to let BMM kill what little living
    space Bretonia has left, we''ve been branded as extremists. For refusing to let
    Planetform spin a fantasy about using dead planets as replacements for the ones
    Bretonia has squandered, we''re called terrorists. So be it. <br>


'
