%YAML 1.1
%TAG !u! tag:unity3d.com,2011:
--- !u!114 &11400000
MonoBehaviour:
  m_ObjectHideFlags: 0
  m_CorrespondingSourceObject: {fileID: 0}
  m_PrefabInstance: {fileID: 0}
  m_PrefabAsset: {fileID: 0}
  m_GameObject: {fileID: 0}
  m_Enabled: 1
  m_EditorHideFlags: 0
  m_Script: {fileID: 11500000, guid: 182eb47472f64de388dd50183c0411d8, type: 3}
  m_Name: SO_Infocard_514465
  m_EditorClassIdentifier: 
  <Key>k__BackingField: 514465
  <Value>k__BackingField: 'Sandur is the heart and soul of the Gaian movement now.
    Our brightest minds and most gifted pilots, and their families, make their homes
    here. We''re slowly evacuating those sympathetic to our cause to this base. Given
    the strength of the enemy that Bretonia faces, I''m not sure New London, and
    even Cambridge will be safe much longer. <br>


'
