%YAML 1.1
%TAG !u! tag:unity3d.com,2011:
--- !u!114 &11400000
MonoBehaviour:
  m_ObjectHideFlags: 0
  m_CorrespondingSourceObject: {fileID: 0}
  m_PrefabInstance: {fileID: 0}
  m_PrefabAsset: {fileID: 0}
  m_GameObject: {fileID: 0}
  m_Enabled: 1
  m_EditorHideFlags: 0
  m_Script: {fileID: 11500000, guid: 182eb47472f64de388dd50183c0411d8, type: 3}
  m_Name: SO_Infocard_521188
  m_EditorClassIdentifier: 
  <Key>k__BackingField: 521188
  <Value>k__BackingField: " <br><b><p align=\"center\">Stats<br></b><p align=\"left\">
    <br>Gun/Turret Mounts: 4/0<br>Base Armor: 11650<br>Explosion Resistance: 25%<br>Cargo
    Space: 45<br>Power Output: 1140/6240<br>Thruster Energy: 80/400<br>Batteries/NanoBots:
    40/40<br>Equipment Mounts: CM CD <br> <br><b><p align=\"center\">Maneuverability<br></b><p
    align=\"left\"> <br>Max Turn Rate: 85.01\xB0<br>Time to Max Turn: 2.23s<br>Time
    to turn 180\xB0: 2.44s<br>Maximum Strafe Speed: 27.5m/s<br>Distance Strafed in
    0.5s: 9.06m<br>\n\n"
