%YAML 1.1
%TAG !u! tag:unity3d.com,2011:
--- !u!114 &11400000
MonoBehaviour:
  m_ObjectHideFlags: 0
  m_CorrespondingSourceObject: {fileID: 0}
  m_PrefabInstance: {fileID: 0}
  m_PrefabAsset: {fileID: 0}
  m_GameObject: {fileID: 0}
  m_Enabled: 1
  m_EditorHideFlags: 0
  m_Script: {fileID: 11500000, guid: 182eb47472f64de388dd50183c0411d8, type: 3}
  m_Name: SO_Infocard_517245
  m_EditorClassIdentifier: 
  <Key>k__BackingField: 517245
  <Value>k__BackingField: " <br><b><p align=\"center\">Stats<br></b><p align=\"left\">
    <br>Gun/Turret Mounts: 0/11<br>Base Armor: 332800<br>Cargo Space: 4300<br>Power
    Output: 5000/50000<br>Thruster Energy: 100/1000<br>Batteries/NanoBots: 720/720<br>Equipment
    Mounts: <br> <br><b><p align=\"center\">Maneuverability<br></b><p align=\"left\">
    <br>Max Turn Rate: 15.28\xB0<br>Time to Max Turn: 1.38s<br>Time to turn 180\xB0:
    11.98s<br>Maximum Strafe Speed: 16.67m/s<br>Distance Strafed in 0.5s: 2.74m<br>\n\n"
