%YAML 1.1
%TAG !u! tag:unity3d.com,2011:
--- !u!114 &11400000
MonoBehaviour:
  m_ObjectHideFlags: 0
  m_CorrespondingSourceObject: {fileID: 0}
  m_PrefabInstance: {fileID: 0}
  m_PrefabAsset: {fileID: 0}
  m_GameObject: {fileID: 0}
  m_Enabled: 1
  m_EditorHideFlags: 0
  m_Script: {fileID: 11500000, guid: 182eb47472f64de388dd50183c0411d8, type: 3}
  m_Name: SO_Infocard_132300
  m_EditorClassIdentifier: 
  <Key>k__BackingField: 132300
  <Value>k__BackingField: 'I used to haul H-fuel from the Hokkaido system, but now
    that Leeds is blockaded, I''m trying to find decent routes into Rheinland and
    Liberty. Although our corporation can go into Kusari again, it''s a long haul
    to go around the Taus to get there. <br>


'
