%YAML 1.1
%TAG !u! tag:unity3d.com,2011:
--- !u!114 &11400000
MonoBehaviour:
  m_ObjectHideFlags: 0
  m_CorrespondingSourceObject: {fileID: 0}
  m_PrefabInstance: {fileID: 0}
  m_PrefabAsset: {fileID: 0}
  m_GameObject: {fileID: 0}
  m_Enabled: 1
  m_EditorHideFlags: 0
  m_Script: {fileID: 11500000, guid: 182eb47472f64de388dd50183c0411d8, type: 3}
  m_Name: SO_Infocard_133160
  m_EditorClassIdentifier: 
  <Key>k__BackingField: 133160
  <Value>k__BackingField: 'My brother works for BMM. There is no way I would ever
    do that work. BMM will work you to death and then dock your pay for sleeping
    on the job when you keel over. I''ve got my pride. I don''t need some damn overseer
    yelling at me about corporate profits and what not. It''s just me, the Niob and
    the Outcasts out here. And the Outcasts you can shoot back at. <br>


'
