%YAML 1.1
%TAG !u! tag:unity3d.com,2011:
--- !u!114 &11400000
MonoBehaviour:
  m_ObjectHideFlags: 0
  m_CorrespondingSourceObject: {fileID: 0}
  m_PrefabInstance: {fileID: 0}
  m_PrefabAsset: {fileID: 0}
  m_GameObject: {fileID: 0}
  m_Enabled: 1
  m_EditorHideFlags: 0
  m_Script: {fileID: 11500000, guid: 182eb47472f64de388dd50183c0411d8, type: 3}
  m_Name: SO_Infocard_131900
  m_EditorClassIdentifier: 
  <Key>k__BackingField: 131900
  <Value>k__BackingField: 'It''s frustrating trying to stop the Cardamine smuggling.
    All of those rich New Yorkers keep buying the drugs, then they turn around and
    tell us that it''s a big problem that has to be fought. Rumor is that Cryer is
    doing some pretty hard lobbying back in Manhattan to keep the drug war going.
    <br>


'
