%YAML 1.1
%TAG !u! tag:unity3d.com,2011:
--- !u!114 &11400000
MonoBehaviour:
  m_ObjectHideFlags: 0
  m_CorrespondingSourceObject: {fileID: 0}
  m_PrefabInstance: {fileID: 0}
  m_PrefabAsset: {fileID: 0}
  m_GameObject: {fileID: 0}
  m_Enabled: 1
  m_EditorHideFlags: 0
  m_Script: {fileID: 11500000, guid: 182eb47472f64de388dd50183c0411d8, type: 3}
  m_Name: SO_Infocard_131308
  m_EditorClassIdentifier: 
  <Key>k__BackingField: 131308
  <Value>k__BackingField: 'When I got out off "the Wall" I didn''t have many choices
    ahead of me, at least no appealing choices. I knew I didn''t want to go back
    to making clothes on the Huntsville. I also knew I didn''t like most of the scum
    I did time with.<br><nbsp><br>


'
