%YAML 1.1
%TAG !u! tag:unity3d.com,2011:
--- !u!114 &11400000
MonoBehaviour:
  m_ObjectHideFlags: 0
  m_CorrespondingSourceObject: {fileID: 0}
  m_PrefabInstance: {fileID: 0}
  m_PrefabAsset: {fileID: 0}
  m_GameObject: {fileID: 0}
  m_Enabled: 1
  m_EditorHideFlags: 0
  m_Script: {fileID: 11500000, guid: 182eb47472f64de388dd50183c0411d8, type: 3}
  m_Name: SO_Infocard_460874
  m_EditorClassIdentifier: 
  <Key>k__BackingField: 460874
  <Value>k__BackingField: 'Planetform''s eager to let us have access to this station.
    It''s in a good spot for us. In turn, all they ask is that we help them mop up
    the Gaians when those ecofreaks show up. I hardly even break a sweat when dealing
    with those guys. They''re barely worth the fuel and ammo, but hey, a good hunting
    nest is worth something too. <br>


'
