%YAML 1.1
%TAG !u! tag:unity3d.com,2011:
--- !u!114 &11400000
MonoBehaviour:
  m_ObjectHideFlags: 0
  m_CorrespondingSourceObject: {fileID: 0}
  m_PrefabInstance: {fileID: 0}
  m_PrefabAsset: {fileID: 0}
  m_GameObject: {fileID: 0}
  m_Enabled: 1
  m_EditorHideFlags: 0
  m_Script: {fileID: 11500000, guid: 182eb47472f64de388dd50183c0411d8, type: 3}
  m_Name: SO_Infocard_475413
  m_EditorClassIdentifier: 
  <Key>k__BackingField: 475413
  <Value>k__BackingField: 'Morioka is well hidden within the Keiun Cloud. The Kusari
    police don''t dare to chase after us once we leave open space and enter the Keiun
    Cloud. There are not only Golden Chrysanthemums found in this nebula, but also
    Rogues and Lane Hackers who come to Morioka to trade with us. The occasional
    foolish police pilot who does give chase, rarely makes it out alive.<br>


'
