%YAML 1.1
%TAG !u! tag:unity3d.com,2011:
--- !u!114 &11400000
MonoBehaviour:
  m_ObjectHideFlags: 0
  m_CorrespondingSourceObject: {fileID: 0}
  m_PrefabInstance: {fileID: 0}
  m_PrefabAsset: {fileID: 0}
  m_GameObject: {fileID: 0}
  m_Enabled: 1
  m_EditorHideFlags: 0
  m_Script: {fileID: 11500000, guid: 182eb47472f64de388dd50183c0411d8, type: 3}
  m_Name: SO_Infocard_466666
  m_EditorClassIdentifier: 
  <Key>k__BackingField: 466666
  <Value>k__BackingField: 'If yer in a fix and you''re gonna get caught, get caught
    by the LPI. Bounty Hunters will like as not put a bullet in your head, but the
    LPI needs to keep Huntsville producing. Remember, for every live Xeno that goes
    into Huntsvillve, three come out.<br>


'
