%YAML 1.1
%TAG !u! tag:unity3d.com,2011:
--- !u!114 &11400000
MonoBehaviour:
  m_ObjectHideFlags: 0
  m_CorrespondingSourceObject: {fileID: 0}
  m_PrefabInstance: {fileID: 0}
  m_PrefabAsset: {fileID: 0}
  m_GameObject: {fileID: 0}
  m_Enabled: 1
  m_EditorHideFlags: 0
  m_Script: {fileID: 11500000, guid: 182eb47472f64de388dd50183c0411d8, type: 3}
  m_Name: SO_Infocard_468770
  m_EditorClassIdentifier: 
  <Key>k__BackingField: 468770
  <Value>k__BackingField: 'Bowex''s Royal Charters and trade monopolies were recently
    revealed to be a double edged sword. The Queen herself decided that Refugee evacuation
    efforts were to be given a maximum priority before Leeds fell. The government
    forced us to shift a good portion of our luxury commodity trade fleets to the
    task, putting a huge dent in our profit margins. We''ve had to make several humiliating
    concessions to our rivals in order to refill our coffers. <br>


'
