%YAML 1.1
%TAG !u! tag:unity3d.com,2011:
--- !u!114 &11400000
MonoBehaviour:
  m_ObjectHideFlags: 0
  m_CorrespondingSourceObject: {fileID: 0}
  m_PrefabInstance: {fileID: 0}
  m_PrefabAsset: {fileID: 0}
  m_GameObject: {fileID: 0}
  m_Enabled: 1
  m_EditorHideFlags: 0
  m_Script: {fileID: 11500000, guid: 182eb47472f64de388dd50183c0411d8, type: 3}
  m_Name: SO_Infocard_460868
  m_EditorClassIdentifier: 
  <Key>k__BackingField: 460868
  <Value>k__BackingField: 'I''m proud to work for this company. Bringing life to
    dead worlds. Improving worlds so that famine and lack of living space are a thing
    of the past. Planetform works for the benefit of all of humanity. Granted, the
    processes are expensive and only the major houses can really afford our services,
    but still, a new planet brought to life means a new chance at life for millions,
    if not billions. <br>


'
