%YAML 1.1
%TAG !u! tag:unity3d.com,2011:
--- !u!114 &11400000
MonoBehaviour:
  m_ObjectHideFlags: 0
  m_CorrespondingSourceObject: {fileID: 0}
  m_PrefabInstance: {fileID: 0}
  m_PrefabAsset: {fileID: 0}
  m_GameObject: {fileID: 0}
  m_Enabled: 1
  m_EditorHideFlags: 0
  m_Script: {fileID: 11500000, guid: 182eb47472f64de388dd50183c0411d8, type: 3}
  m_Name: SO_Infocard_133638
  m_EditorClassIdentifier: 
  <Key>k__BackingField: 133638
  <Value>k__BackingField: 'BMM and Daumann have a pretty serious rivalry in this
    system. I''m looking forward to some real hostility getting started between the
    two of ''em. Some of my buddies I served with on the Newgate are coming here
    to work for BMM harassing Daumann. They aren''t in the Guild, so they can do
    that. <br>


'
