Siesta Version  : 5.0.0-alpha-123-gfb8fd7d02
Architecture    : ----
Compiler version: GNU-11.4.0
Compiler flags  : -fallow-argument-mismatch;-O3 -march=native
PP flags        : ----
Libraries       : ----
Parallelisations: none
GEMM3M support
NetCDF support
NetCDF-4 support
Lua support

Runtime information:
* Directory : /home/fnpedron/Siesta/siesta-dev/Tests/04.SCFMixing/work/broyden
* Running in serial mode.
>> Start of run:  28-SEP-2023  15:35:40

                           *********************** 
                           *  WELCOME TO SIESTA  * 
                           *********************** 

reinit: Reading from standard input
reinit: Dumping input in INPUT_TMP.34169
************************** Dump of input data file ****************************
%include ../../basejob.fdf
SystemLabel       broyden
Mixer.Debug.MPI
SCF.Mixer.Weight 0.01
SCF.Mixer.History 6
%block SCF.Mixers
  broyden
%endblock
%block SCF.Mixer.broyden
  method broyden
  weight 0.01
  weight.linear 0.005
%endblock
************************** End of input data file *****************************

reinit: -----------------------------------------------------------------------
reinit: System Name: Linear Fe3 cluster.
reinit: -----------------------------------------------------------------------
reinit: System Label: broyden
reinit: -----------------------------------------------------------------------

initatom: Reading input for the pseudopotentials and atomic orbitals ----------
Species number:   1 Atomic number:   26 Label: Fe_nc


---- Processing specs for species: Fe_nc
Ground state valence configuration:   4s02  3d06
Reading pseudopotential information in formatted form from:
  /home/fnpedron/Siesta/siesta-dev/Tests/Pseudos/Fe_nc.psf

---- Pseudopotential check for Fe

Pseudized shells:
4s( 1.00) rc: 2.00
4p( 0.00) rc: 2.00
3d( 7.00) rc: 2.00
4f( 0.00) rc: 2.00
Valence configuration for ps generation: (assumed as above)
For Fe_nc, standard SIESTA heuristics set lmxkb to 3
 (one more than the basis l, including polarization orbitals).
Use PS.lmax or PS.KBprojectors blocks to override.

<basis_specs>
===============================================================================
Fe_nc                Z=  26    Mass=  55.845        Charge= 0.17977+309
Lmxo=2 Lmxkb= 3    BasisType=split      Semic=F
L=0  Nsemic=0  Cnfigmx=4
          i=1  nzeta=1  polorb=0  (4s)
            splnorm:   0.15000    
               vcte:    40.000    
               rinn:  -0.90000    
               qcoe:    0.0000    
               qyuk:    0.0000    
               qwid:   0.10000E-01
                rcs:    0.0000    
            lambdas:    1.0000    
L=1  Nsemic=0  Cnfigmx=4
          i=1  nzeta=0  polorb=0  (4p)  (empty shell (??) )
L=2  Nsemic=0  Cnfigmx=3
          i=1  nzeta=1  polorb=0  (3d)
            splnorm:   0.15000    
               vcte:    40.000    
               rinn:  -0.90000    
               qcoe:    0.0000    
               qyuk:    0.0000    
               qwid:   0.10000E-01
                rcs:    0.0000    
            lambdas:    1.0000    
-------------------------------------------------------------------------------
L=0  Nkbl=1  erefs: 0.17977+309
L=1  Nkbl=1  erefs: 0.17977+309
L=2  Nkbl=1  erefs: 0.17977+309
L=3  Nkbl=1  erefs: 0.17977+309
===============================================================================
</basis_specs>

Using PAO.SplitTailNorm
atom: Called for Fe_nc                 (Z =  26)
Maximum radius (at nrval) set to   50.00000 8518

read_vps: Pseudopotential generation method:
read_vps: ATM3      Troullier-Martins                       
Valence charge in pseudo generation:    8.00000

read_vps: Pseudopotential includes a core correction:
read_vps: Pseudo-core for xc-correction

xc_check: Exchange-correlation functional:
xc_check: Ceperley-Alder
V l=0 = -2*Zval/r beyond r=  2.8472
V l=1 = -2*Zval/r beyond r=  2.8472
V l=2 = -2*Zval/r beyond r=  2.8472
V l=3 = -2*Zval/r beyond r=  2.8472
All V_l potentials equal beyond r=  1.9894
This should be close to max(r_c) in ps generation
All pots = -2*Zval/r beyond r=  2.8472
Using large-core scheme (fit) for Vlocal

atom: Estimated core radius    2.84716
Fit of Vlocal with continuous 2nd derivative
Fitting vlocal at       1.9954
Choosing vlocal chloc cutoff:***  3.100644
qtot up to nchloc:    8.00000259
atom: Maximum radius for chlocal:    3.10064
atom: Maximum radius for r*vlocal+2*Zval:    3.10064

KBgen: Kleinman-Bylander projectors: 
GHOST: No ghost state for L =  0
   l= 0   rc=  1.991366   el= -0.319855   Ekb=  3.826230   kbcos=  0.253712
GHOST: No ghost state for L =  1
   l= 1   rc=  2.019582   el= -0.070931   Ekb=  3.335986   kbcos=  0.155791
GHOST: No ghost state for L =  2
   l= 2   rc=  1.989365   el= -0.307264   Ekb=-12.632066   kbcos= -0.657060
GHOST: No ghost state for L =  3
   l= 3   rc=  2.015527   el=  0.019538   Ekb= -1.701666   kbcos= -0.006384

KBgen: Total number of Kleinman-Bylander projectors:  16
atom: -------------------------------------------------------------------------

atom: SANKEY-TYPE ORBITALS:

SPLIT: Orbitals with angular momentum L= 0

SPLIT: Basis orbitals for state 4s

SPLIT: PAO cut-off radius determined from an
SPLIT: energy shift=  0.010000 Ry
Split based on tail norm

   izeta = 1
                 lambda =    1.000000
                     rc =    7.355669
                 energy =   -0.308198
                kinetic =    0.284874
    potential(screened) =   -0.593072
       potential(ionic) =   -5.763042

SPLIT: Orbitals with angular momentum L= 2

SPLIT: Basis orbitals for state 3d

SPLIT: PAO cut-off radius determined from an
SPLIT: energy shift=  0.010000 Ry
Split based on tail norm

   izeta = 1
                 lambda =    1.000000
                     rc =    4.584362
                 energy =   -0.296412
                kinetic =    8.773647
    potential(screened) =   -9.070058
       potential(ionic) =  -18.006145
atom: Total number of Sankey-type orbitals:  6

atm_pop: Valence configuration (for local Pseudopot. screening):
 4s( 2.00)                                                            
 4p( 0.00)                                                            
 3d( 6.00)                                                            
Vna: chval, zval:    8.00000   8.00000

Vna:  Cut-off radius for the neutral-atom potential:   7.355669
comcore: Pseudo-core radius Rcore=  3.839063

atom: _________________________________________________________________________

prinput: Basis input 

PAO.BasisType split     

%block ChemicalSpeciesLabel
    1   26 Fe_nc                   # Species index, atomic number, species label
%endblock ChemicalSpeciesLabel

%block PAO.Basis                 # Define Basis set
# WARNING: This information might be incomplete!
Fe_nc                 2                    # Species label, number of l-shells
 n=4   0   1                         # n, l, Nzeta 
   7.356   
   1.000   
 n=3   2   1                         # n, l, Nzeta 
   4.584   
   1.000   
%endblock PAO.Basis

prinput: ----------------------------------------------------------------------

Dumping basis to NetCDF file Fe_nc.ion.nc
coor:   Atomic-coordinates input format  =     Cartesian coordinates
coor:                                            (in Bohr units)

siesta: Atomic coordinates (Bohr) and species
siesta:      0.00000   0.00000   3.64400  1        1
siesta:      0.00000   0.00000   0.00000  1        2
siesta:      0.00000   0.00000  -3.64400  1        3

siesta: System type = bulk      

initatomlists: Number of atoms, orbitals, and projectors:      3    18    48

siesta: ******************** Simulation parameters ****************************
siesta:
siesta: The following are some of the parameters of the simulation.
siesta: A complete list of the parameters used, including default values,
siesta: can be found in file out.fdf
siesta:
redata: Spin configuration                          = non-collinear
redata: Number of spin components                   = 4
redata: Time-Reversal Symmetry                      = F
redata: Spin spiral                                 = F
redata: Long output                                 =   F
redata: Number of Atomic Species                    =        1
redata: Charge density info will appear in .RHO file
redata: Write Mulliken Pop.                         = Atomic and Orbital charges
redata: Matel table size (NRTAB)                    =     1024
redata: Mesh Cutoff                                 =   150.0000 Ry
redata: Net charge of the system                    =     0.0000 |e|
redata: Min. number of SCF Iter                     =        0
redata: Max. number of SCF Iter                     =     1000
redata: SCF convergence failure will abort job
redata: SCF mix quantity                            = Hamiltonian
redata: Mix DM or H after convergence               =   F
redata: Recompute H after scf cycle                 =   F
redata: Mix DM in first SCF step                    =   T
redata: Write Pulay info on disk                    =   F
redata: New DM Occupancy tolerance                  = 0.000000000001
redata: No kicks to SCF
redata: DM Mixing Weight for Kicks                  =     0.5000
redata: Require Harris convergence for SCF          =   F
redata: Harris energy tolerance for SCF             =     0.000100 eV
redata: Require DM convergence for SCF              =   T
redata: DM tolerance for SCF                        =     0.000100
redata: Require EDM convergence for SCF             =   F
redata: EDM tolerance for SCF                       =     0.001000 eV
redata: Require H convergence for SCF               =   T
redata: Hamiltonian tolerance for SCF               =     0.001000 eV
redata: Require (free) Energy convergence for SCF   =   F
redata: (free) Energy tolerance for SCF             =     0.000100 eV
redata: Using DFT-D3 dispersion                     =   F
redata: Using Saved Data (generic)                  =   F
redata: Use continuation files for DM               =   F
redata: Neglect nonoverlap interactions             =   F
redata: Method of Calculation                       = Diagonalization
redata: Electronic Temperature                      =   299.9863 K
redata: Fix the spin of the system                  =   F
redata: Max. number of TDED Iter                    =        1
redata: Number of TDED substeps                     =        3
redata: Dynamics option                             = Single-point calculation
mix.SCF: Debug messages                          = T
mix.SCF: Broyden mixing                          = broyden
mix.SCF:    History steps                        = 6
mix.SCF:    Linear mixing weight                 =     0.005000
mix.SCF:    Inverse Jacobian weight              =     0.010000
mix.SCF:    Weight prime                         =     0.010000
mix.SCF:    SVD condition                        = 0.1000E-07
mix.SCF: Spin-component mixing                   all
redata: Save all siesta data in one NC              =   F
redata: ***********************************************************************

%block SCF.Mixers
  broyden
%endblock SCF.Mixers

%block SCF.Mixer.broyden
  # Mixing method
  method broyden

  # Mixing options
  weight 0.0100
  weight.linear 0.0050
  weight.prime 0.0100
  history 6
%endblock SCF.Mixer.broyden

DM_history_depth set to one: no extrapolation allowed by default for geometry relaxation
Size of DM history Fstack: 1
Total number of electrons:    24.000000
Total ionic charge:    24.000000

siesta: k-grid: Number of k-points = 1
siesta: k-point is Gamma-only

diag: Algorithm                                     = D&C
diag: Used triangular part                          = Lower
diag: Absolute tolerance                            =  0.100E-15
diag: Orthogonalization factor                      =  0.100E-05
diag: Memory factor                                 =  1.0000


ts: **************************************************************
ts: Save H and S matrices                           =    F
ts: Save DM and EDM matrices                        =    F
ts: Only save the overlap matrix S                  =    F
ts: **************************************************************

************************ Begin: TS CHECKS AND WARNINGS ************************
************************ End: TS CHECKS AND WARNINGS **************************


                     ====================================
                        Single-point calculation
                     ====================================

outcell: Unit cell vectors (Ang):
        6.350127    0.000000    0.000000
        0.000000    6.350127    0.000000
        0.000000    0.000000   10.583544

outcell: Cell vector modules (Ang)   :    6.350127    6.350127   10.583544
outcell: Cell angles (23,13,12) (deg):     90.0000     90.0000     90.0000
outcell: Cell volume (Ang**3)        :    426.7720
Gamma-point calculation with interaction between periodic images
Some features might not work optimally:
e.g. DM initialization from atomic data
<dSpData1D:S at geom step 0
  <sparsity:sparsity for geom step 0
    nrows_g=18 nrows=18 sparsity=1.0000 nnzs=324, refcount: 7>
  <dData1D:(new from dSpData1D) n=324, refcount: 1>
refcount: 1>
new_DM -- step:     1
Initializing Density Matrix...
DM filled with atomic data (user-defined):
<dSpData2D:DM initialized from atoms
  <sparsity:sparsity for geom step 0
    nrows_g=18 nrows=18 sparsity=1.0000 nnzs=324, refcount: 8>
  <dData2D:DM n=324 m=4, refcount: 1>
refcount: 1>
     spin moment: {S} , |S| = {    1.50000    0.00000    0.00000 }     1.50000
No. of atoms with KB's overlaping orbs in proc 0. Max # of overlaps:       3      18

InitMesh: MESH = 48 x 48 x 80 = 184320
InitMesh: Mesh cutoff (required, used) =   150.000   157.914 Ry
New grid distribution [1]: sub = 2

stepf: Fermi-Dirac step function

siesta: Program's energy decomposition (eV):
siesta: Ebs     =       233.382980
siesta: Eions   =      2102.576618
siesta: Ena     =        92.089899
siesta: Ekin    =      2830.136646
siesta: Enl     =     -1830.437030
siesta: Eso     =         0.000000
siesta: Edftu   =         0.000000
siesta: DEna    =      -119.241817
siesta: DUscf   =        55.250614
siesta: DUext   =         0.000000
siesta: Ex      =     -1119.237717
siesta: Ec      =       -98.052084
siesta: Exc     =     -1217.289801
siesta: EbV     =         0.000000
siesta: eta*DQ  =         0.000000
siesta: Emadel  =         0.000000
siesta: Emeta   =         0.000000
siesta: Emolmec =         0.000000
siesta: Ekinion =         0.000000
siesta: Eharris =     -2221.519245
siesta: Etot    =     -2292.068105
siesta: FreeEng =     -2292.162149

        iscf     Eharris(eV)        E_KS(eV)     FreeEng(eV)     dDmax    Ef(eV) dHmax(eV)
   scf:    1    -2221.519245    -2292.068105    -2292.162149  0.995856 -9.385094 33.781828
     spin moment: {S} , |S| = {    1.52849    0.00000   -0.00000 }     1.52849
mix (0): Broyden
mix (0): Broyden (initial), alpha = 0.5000E-02
timer: Routine,Calls,Time,% = IterSCF        1       0.050  17.33
   scf:    2    -2295.645679    -2293.902021    -2293.994534  0.050310 -9.308882 32.395486
     spin moment: {S} , |S| = {    1.45873    0.00000   -0.00000 }     1.45873
mix (0): Broyden
mix (0): n_hist = 2 / 6
mix (0): weights =  0.1473E+01
mix (0): G =   0.010000, sum(coeff) = 0.1569E+02, coeff =  0.1569E+02
   scf:    3    -2298.216838    -2306.684398    -2306.770245  0.368034 -7.725929 19.358920
     spin moment: {S} , |S| = {    2.36798    0.00000   -0.00000 }     2.36798
mix (0): Broyden
mix (0): n_hist = 3 / 6
mix (0): weights =  0.1473E+01 0.1852E+01
mix (0): G =   0.010000, sum(coeff) = -.9710E+02, coeff =  -.1033E+03 0.6227E+01
mix (0): f(x)[coeff] == 0 :   0.1659E+02,0.0000E+00
   scf:    4    -2270.693400    -2305.083138    -2305.164753  0.405249 -7.128924 28.724034
     spin moment: {S} , |S| = {    0.79758    0.00000    0.00000 }     0.79758
mix (0): Broyden
mix (0): n_hist = 4 / 6
mix (0): weights =  0.1852E+01 0.1852E+01 0.1541E+01
mix (0): G =   0.010000, sum(coeff) = -.6688E+01, coeff =  -.9821E+01 0.2376E+01 0.7562E+00
mix (0): f(x)[coeff] == 0 :   0.2360E+01,0.0000E+00  -.5502E+01,0.0000E+00
   scf:    5    -2268.167372    -2315.835589    -2315.836546  0.638731 -4.186488 15.748084
     spin moment: {S} , |S| = {    1.64861    0.00000   -0.00000 }     1.64861
mix (0): Broyden
mix (0): n_hist = 5 / 6
mix (0): weights =  0.1852E+01 0.1541E+01 0.1541E+01 0.2089E+01
mix (0): G =   0.010000, sum(coeff) = 0.3930E+01, coeff =  0.3919E+01 -.2810E+00 0.4125E+00 -.1207E+00
mix (0): f(x)[coeff] == 0 :   -.5423E+00,0.2630E+01  -.5423E+00,-.2630E+01  0.4503E+01,0.0000E+00
   scf:    6    -2314.547243    -2326.070229    -2326.070815  0.258596 -4.345469  6.048081
     spin moment: {S} , |S| = {    1.19437    0.00000   -0.00000 }     1.19437
mix (0): Broyden
mix (0): n_hist = 6 / 6
mix (0): weights =  0.1541E+01 0.1541E+01 0.2089E+01 0.2089E+01 0.4719E+01
mix (0): G =   0.010000, sum(coeff) = 0.3474E+01, coeff =  0.3769E+01 -.1143E+00 0.4983E-01 -.6877E-02 -.2230E+00
mix (0): f(x)[coeff] == 0 :   0.2016E+01,0.0000E+00  0.2367E-01,0.2001E+01  0.2367E-01,-.2001E+01  -.2094E+01,0.0000E+00
   scf:    7    -2325.243481    -2327.353675    -2327.353839  0.101254 -4.210801  2.749202
     spin moment: {S} , |S| = {    1.44531    0.00000   -0.00000 }     1.44531
mix (0): Broyden
mix (0): n_hist = 6 / 6
mix (0): weights =  0.1541E+01 0.2089E+01 0.2089E+01 0.4719E+01 0.1203E+02
mix (0): G =   0.010000, sum(coeff) = 0.1599E+02, coeff =  0.2251E+00 -.1112E-01 -.2553E+00 0.4520E+01 0.1151E+02
mix (0): f(x)[coeff] == 0 :   0.2008E+00,0.2419E+00  0.2008E+00,-.2419E+00  -.3971E+00,0.2005E+00  -.3971E+00,-.2005E+00
   scf:    8    -2323.944394    -2325.920774    -2325.920986  0.042313 -3.295540  7.139099
     spin moment: {S} , |S| = {    1.51233    0.00000    0.00000 }     1.51233
mix (0): Broyden
mix (0): n_hist = 6 / 6
mix (0): weights =  0.2089E+01 0.2089E+01 0.4719E+01 0.1203E+02 0.3974E+01
mix (0): G =   0.010000, sum(coeff) = 0.4072E+01, coeff =  -.1579E+00 -.2835E+00 0.8581E+00 0.1065E+01 0.2590E+01
mix (0): f(x)[coeff] == 0 :   0.3997E+00,0.0000E+00  -.3042E+00,0.0000E+00  -.2533E+00,0.6611E+00  -.2533E+00,-.6611E+00
   scf:    9    -2325.994470    -2327.484125    -2327.484145  0.089269 -1.970400  3.836375
     spin moment: {S} , |S| = {    1.33031    0.00000    0.00000 }     1.33031
mix (0): Broyden
mix (0): n_hist = 6 / 6
mix (0): weights =  0.2089E+01 0.4719E+01 0.1203E+02 0.3974E+01 0.7963E+01
mix (0): G =   0.010000, sum(coeff) = 0.9109E+00, coeff =  -.2508E+00 -.8454E-01 0.2034E+01 -.1309E+01 0.5208E+00
mix (0): f(x)[coeff] == 0 :   -.3016E+00,0.0000E+00  0.4275E+00,0.0000E+00  0.1194E+01,0.1520E+01  0.1194E+01,-.1520E+01
   scf:   10    -2327.324023    -2327.411283    -2327.411311  0.025680 -2.844428  2.984768
     spin moment: {S} , |S| = {    1.31923    0.00000    0.00000 }     1.31923
mix (0): Broyden
mix (0): n_hist = 6 / 6
mix (0): weights =  0.4719E+01 0.1203E+02 0.3974E+01 0.7963E+01 0.1085E+02
mix (0): G =   0.010000, sum(coeff) = 0.1948E+01, coeff =  -.3493E+00 0.2661E+01 -.3689E+01 0.1764E+01 0.1561E+01
mix (0): f(x)[coeff] == 0 :   0.1660E+00,0.0000E+00  0.5601E+00,0.4944E+00  0.5601E+00,-.4944E+00  -.2417E+01,0.0000E+00
   scf:   11    -2327.254416    -2327.661674    -2327.664265  0.067347 -4.458993  1.084104
     spin moment: {S} , |S| = {    1.48909    0.00000   -0.00000 }     1.48909
mix (0): Broyden
mix (0): n_hist = 6 / 6
mix (0): weights =  0.1203E+02 0.3974E+01 0.7963E+01 0.1085E+02 0.3571E+02
mix (0): G =   0.010000, sum(coeff) = 0.9711E+01, coeff =  0.5417E+01 -.3142E+01 0.2407E+01 0.8428E+01 -.3399E+01
mix (0): f(x)[coeff] == 0 :   -.9710E+00,0.0000E+00  0.3771E+00,0.6830E+00  0.3771E+00,-.6830E+00  0.2696E+01,0.0000E+00
   scf:   12    -2327.409684    -2327.547954    -2327.552187  0.012269 -4.487092  1.750726
     spin moment: {S} , |S| = {    1.51553    0.00000   -0.00000 }     1.51553
mix (0): Broyden
mix (0): n_hist = 6 / 6
mix (0): weights =  0.3974E+01 0.7963E+01 0.1085E+02 0.3571E+02 0.2096E+02
mix (0): G =   0.010000, sum(coeff) = -.2985E+02, coeff =  0.1733E+01 0.1972E+00 -.3753E+01 0.3967E+01 -.3199E+02
mix (0): f(x)[coeff] == 0 :   -.3986E+00,0.0000E+00  0.4587E+00,0.0000E+00  0.3191E-01,0.5434E+00  0.3191E-01,-.5434E+00
   scf:   13    -2321.931814    -2325.409471    -2325.480242  0.257830 -4.741281  6.038216
     spin moment: {S} , |S| = {    1.77219    0.00000    0.00000 }     1.77219
mix (0): Broyden
mix (0): n_hist = 6 / 6
mix (0): weights =  0.7963E+01 0.1085E+02 0.3571E+02 0.2096E+02 0.4727E+01
mix (0): G =   0.010000, sum(coeff) = -.1440E+02, coeff =  0.8671E-01 -.3084E+01 0.1426E+01 -.1210E+02 -.7329E+00
mix (0): f(x)[coeff] == 0 :   0.2839E-01,0.0000E+00  0.5191E-01,0.4977E+00  0.5191E-01,-.4977E+00  -.1664E+02,0.0000E+00
   scf:   14    -2328.162670    -2327.736932    -2327.737040  0.272078 -3.818501  0.794618
     spin moment: {S} , |S| = {    1.42955    0.00000    0.00000 }     1.42955
mix (0): Broyden
mix (0): n_hist = 6 / 6
mix (0): weights =  0.1085E+02 0.3571E+02 0.2096E+02 0.4727E+01 0.4794E+02
mix (0): G =   0.010000, sum(coeff) = 0.7188E+01, coeff =  0.1588E+01 -.6134E+00 0.5095E+01 0.6084E+00 0.5099E+00
mix (0): f(x)[coeff] == 0 :   0.8230E-01,0.5547E+00  0.8230E-01,-.5547E+00  -.6788E+00,0.3073E+01  -.6788E+00,-.3073E+01
   scf:   15    -2327.701839    -2327.730042    -2327.730143  0.008443 -4.013159  0.700411
     spin moment: {S} , |S| = {    1.41667    0.00000    0.00000 }     1.41667
mix (0): Broyden
mix (0): n_hist = 6 / 6
mix (0): weights =  0.3571E+02 0.2096E+02 0.4727E+01 0.4794E+02 0.5333E+02
mix (0): G =   0.010000, sum(coeff) = 0.2197E+01, coeff =  0.1489E+00 0.9732E+00 0.1351E+00 0.1302E+00 0.8096E+00
mix (0): f(x)[coeff] == 0 :   0.5001E+00,0.9595E+00  0.5001E+00,-.9595E+00  -.1004E+01,0.0000E+00  -.1564E+00,0.0000E+00
   scf:   16    -2327.747530    -2327.743634    -2327.743910  0.010866 -4.343291  0.058875
     spin moment: {S} , |S| = {    1.44652    0.00000    0.00000 }     1.44652
mix (0): Broyden
mix (0): n_hist = 6 / 6
mix (0): weights =  0.2096E+02 0.4727E+01 0.4794E+02 0.5333E+02 0.1335E+03
mix (0): G =   0.010000, sum(coeff) = 0.2508E-01, coeff =  -.6357E-01 0.8932E-02 0.8000E-02 -.5359E-01 0.1253E+00
mix (0): f(x)[coeff] == 0 :   -.7613E+00,0.0000E+00  0.1335E+00,0.8396E+00  0.1335E+00,-.8396E+00  0.9219E+00,0.0000E+00
   scf:   17    -2327.743622    -2327.743657    -2327.744010  0.000863 -4.361848  0.018045
     spin moment: {S} , |S| = {    1.44917    0.00000    0.00000 }     1.44917
mix (0): Broyden
mix (0): n_hist = 6 / 6
mix (0): weights =  0.4727E+01 0.4794E+02 0.5333E+02 0.1335E+03 0.1436E+03
mix (0): G =   0.010000, sum(coeff) = 0.1413E+02, coeff =  -.1086E+00 -.8698E-01 0.1401E+00 -.1227E+01 0.1542E+02
mix (0): f(x)[coeff] == 0 :   0.3204E+00,0.0000E+00  -.2491E+00,0.0000E+00  0.4122E-02,0.2971E+00  0.4122E-02,-.2971E+00
   scf:   18    -2327.743338    -2327.743505    -2327.744070  0.002020 -4.393215  0.077242
     spin moment: {S} , |S| = {    1.45612    0.00000   -0.00000 }     1.45612
mix (0): Broyden
mix (0): n_hist = 6 / 6
mix (0): weights =  0.4794E+02 0.5333E+02 0.1335E+03 0.1436E+03 0.1293E+03
mix (0): G =   0.010000, sum(coeff) = -.2616E+01, coeff =  0.3169E-01 -.5320E-01 0.4066E+00 -.4145E+01 0.1143E+01
mix (0): f(x)[coeff] == 0 :   -.5902E-01,0.1815E+00  -.5902E-01,-.1815E+00  0.2157E+00,0.0000E+00  0.3527E+01,0.0000E+00
   scf:   19    -2327.742180    -2327.742897    -2327.743811  0.001906 -4.422344  0.143854
     spin moment: {S} , |S| = {    1.46410    0.00000   -0.00000 }     1.46410
mix (0): Broyden
mix (0): n_hist = 6 / 6
mix (0): weights =  0.5333E+02 0.1335E+03 0.1436E+03 0.1293E+03 0.1155E+03
mix (0): G =   0.010000, sum(coeff) = 0.2334E+02, coeff =  0.3508E+00 -.2346E+01 0.2524E+02 -.1178E+02 0.1188E+02
mix (0): f(x)[coeff] == 0 :   0.4545E-01,0.1118E+00  0.4545E-01,-.1118E+00  0.4504E+00,0.1351E+01  0.4504E+00,-.1351E+01
   scf:   20    -2327.744495    -2327.743967    -2327.744191  0.005129 -4.325849  0.080535
     spin moment: {S} , |S| = {    1.46027    0.00000    0.00000 }     1.46027
mix (0): Broyden
mix (0): n_hist = 6 / 6
mix (0): weights =  0.1335E+03 0.1436E+03 0.1293E+03 0.1155E+03 0.1285E+03
mix (0): G =   0.010000, sum(coeff) = -.1407E+01, coeff =  0.1023E+01 -.6117E+01 0.4081E+01 -.2162E+01 0.1769E+01
mix (0): f(x)[coeff] == 0 :   -.1178E+00,0.1548E+01  -.1178E+00,-.1548E+01  0.1269E+01,0.0000E+00  0.1890E+00,0.0000E+00
   scf:   21    -2327.744372    -2327.744195    -2327.744556  0.002951 -4.366157  0.026577
     spin moment: {S} , |S| = {    1.48239    0.00000    0.00000 }     1.48239
mix (0): Broyden
mix (0): n_hist = 6 / 6
mix (0): weights =  0.1436E+03 0.1293E+03 0.1155E+03 0.1285E+03 0.1414E+03
mix (0): G =   0.010000, sum(coeff) = 0.5494E-01, coeff =  0.2259E+00 -.4450E-01 -.2265E+00 0.8277E-01 0.1724E-01
mix (0): f(x)[coeff] == 0 :   0.1415E+01,0.1987E+00  0.1415E+01,-.1987E+00  -.9624E+00,0.0000E+00  -.6669E+01,0.0000E+00
   scf:   22    -2327.744325    -2327.744264    -2327.744571  0.000592 -4.354413  0.006911
     spin moment: {S} , |S| = {    1.48127    0.00000    0.00000 }     1.48127
mix (0): Broyden
mix (0): n_hist = 6 / 6
mix (0): weights =  0.1293E+03 0.1155E+03 0.1285E+03 0.1414E+03 0.1465E+03
mix (0): G =   0.010000, sum(coeff) = 0.1009E+01, coeff =  0.7531E-01 0.1831E+00 -.2195E-01 -.4077E-01 0.8129E+00
mix (0): f(x)[coeff] == 0 :   0.4313E+00,0.5436E+00  0.4313E+00,-.5436E+00  -.4063E+00,0.1654E+00  -.4063E+00,-.1654E+00
   scf:   23    -2327.744279    -2327.744271    -2327.744575  0.000044 -4.353508  0.006890
     spin moment: {S} , |S| = {    1.48158    0.00000    0.00000 }     1.48158
mix (0): Broyden
mix (0): n_hist = 6 / 6
mix (0): weights =  0.1155E+03 0.1285E+03 0.1414E+03 0.1465E+03 0.1466E+03
mix (0): G =   0.010000, sum(coeff) = 0.4059E+01, coeff =  0.2701E-03 -.1249E-01 0.8082E-02 -.2209E+00 0.4284E+01
mix (0): f(x)[coeff] == 0 :   -.6011E-01,0.1251E+00  -.6011E-01,-.1251E+00  0.1500E+00,0.0000E+00  0.2182E-01,0.0000E+00
   scf:   24    -2327.744304    -2327.744288    -2327.744592  0.000174 -4.353829  0.006745
     spin moment: {S} , |S| = {    1.48352    0.00000   -0.00000 }     1.48352
mix (0): Broyden
mix (0): n_hist = 6 / 6
mix (0): weights =  0.1285E+03 0.1414E+03 0.1465E+03 0.1466E+03 0.1466E+03
mix (0): G =   0.010000, sum(coeff) = 0.2916E+01, coeff =  -.9269E-03 0.7445E-02 0.6040E-01 0.4480E+00 0.2401E+01
mix (0): f(x)[coeff] == 0 :   -.1931E+00,0.0000E+00  0.6592E-01,0.0000E+00  -.2971E-01,0.1716E+00  -.2971E-01,-.1716E+00
   scf:   25    -2327.744376    -2327.744330    -2327.744633  0.000460 -4.353861  0.006366
     spin moment: {S} , |S| = {    1.48861    0.00000   -0.00000 }     1.48861
mix (0): Broyden
mix (0): n_hist = 6 / 6
mix (0): weights =  0.1414E+03 0.1465E+03 0.1466E+03 0.1466E+03 0.1467E+03
mix (0): G =   0.010000, sum(coeff) = -.6056E-01, coeff =  0.3331E-02 -.2258E-01 0.2126E+00 -.6963E+00 0.4424E+00
mix (0): f(x)[coeff] == 0 :   0.2746E-01,0.1386E+00  0.2746E-01,-.1386E+00  0.3126E+00,0.0000E+00  0.1206E+01,0.0000E+00
   scf:   26    -2327.744349    -2327.744339    -2327.744642  0.000109 -4.353859  0.006273
     spin moment: {S} , |S| = {    1.48986    0.00000   -0.00000 }     1.48986
mix (0): Broyden
mix (0): n_hist = 6 / 6
mix (0): weights =  0.1465E+03 0.1466E+03 0.1466E+03 0.1467E+03 0.1467E+03
mix (0): G =   0.010000, sum(coeff) = 0.2827E+01, coeff =  -.6957E-01 0.6860E+00 -.6801E+00 -.3074E+00 0.3198E+01
mix (0): f(x)[coeff] == 0 :   -.7030E+00,0.0000E+00  0.1142E+00,0.0000E+00  0.3425E+00,0.3920E+00  0.3425E+00,-.3920E+00
   scf:   27    -2327.744363    -2327.744351    -2327.744654  0.000130 -4.353837  0.006158
     spin moment: {S} , |S| = {    1.49148    0.00000    0.00000 }     1.49148
mix (0): Broyden
mix (0): n_hist = 6 / 6
mix (0): weights =  0.1466E+03 0.1466E+03 0.1467E+03 0.1467E+03 0.1467E+03
mix (0): G =   0.010000, sum(coeff) = 0.6761E+01, coeff =  0.3682E+00 0.9298E+00 -.6121E+00 0.5021E+00 0.5573E+01
mix (0): f(x)[coeff] == 0 :   0.3822E+00,0.4621E+00  0.3822E+00,-.4621E+00  -.4272E+00,0.3453E-01  -.4272E+00,-.3453E-01
   scf:   28    -2327.744473    -2327.744407    -2327.744709  0.000685 -4.353655  0.005544
     spin moment: {S} , |S| = {    1.50012    0.00000    0.00000 }     1.50012
mix (0): Broyden
mix (0): n_hist = 6 / 6
mix (0): weights =  0.1466E+03 0.1467E+03 0.1467E+03 0.1467E+03 0.1469E+03
mix (0): G =   0.010000, sum(coeff) = -.5067E+00, coeff =  0.1566E+00 0.5155E-01 -.9301E+00 -.6520E+00 0.8672E+00
mix (0): f(x)[coeff] == 0 :   -.5377E+00,0.1451E+00  -.5377E+00,-.1451E+00  0.4112E+00,0.0000E+00  0.1416E+01,0.0000E+00
   scf:   29    -2327.744477    -2327.744440    -2327.744741  0.000471 -4.353567  0.005120
     spin moment: {S} , |S| = {    1.50612    0.00000    0.00000 }     1.50612
mix (0): Broyden
mix (0): n_hist = 6 / 6
mix (0): weights =  0.1467E+03 0.1467E+03 0.1467E+03 0.1469E+03 0.1470E+03
mix (0): G =   0.010000, sum(coeff) = -.4275E+00, coeff =  0.1153E+00 -.5361E+00 -.5562E+00 -.7259E+00 0.1275E+01
mix (0): f(x)[coeff] == 0 :   -.3957E+00,0.5238E+00  -.3957E+00,-.5238E+00  0.1773E+00,0.0000E+00  0.1183E+01,0.0000E+00
   scf:   30    -2327.744444    -2327.744442    -2327.744744  0.000040 -4.353611  0.005088
     spin moment: {S} , |S| = {    1.50667    0.00000   -0.00000 }     1.50667
mix (0): Broyden
mix (0): n_hist = 6 / 6
mix (0): weights =  0.1467E+03 0.1467E+03 0.1469E+03 0.1470E+03 0.1470E+03
mix (0): G =   0.010000, sum(coeff) = 0.6312E+00, coeff =  -.5558E-01 -.9643E-01 0.1313E+00 -.2112E+00 0.8631E+00
mix (0): f(x)[coeff] == 0 :   0.5999E+00,0.0000E+00  -.3065E+00,0.0000E+00  -.2437E-01,0.5913E+00  -.2437E-01,-.5913E+00
   scf:   31    -2327.744444    -2327.744443    -2327.744745  0.000020 -4.353648  0.005077
     spin moment: {S} , |S| = {    1.50695    0.00000   -0.00000 }     1.50695
mix (0): Broyden
mix (0): n_hist = 6 / 6
mix (0): weights =  0.1467E+03 0.1469E+03 0.1470E+03 0.1470E+03 0.1470E+03
mix (0): G =   0.010000, sum(coeff) = 0.3638E+01, coeff =  0.1430E+00 0.4701E+00 -.6218E+00 -.9836E-01 0.3745E+01
mix (0): f(x)[coeff] == 0 :   -.5013E+00,0.0000E+00  -.2553E+00,0.0000E+00  0.3914E+00,0.3809E+00  0.3914E+00,-.3809E+00
   scf:   32    -2327.744459    -2327.744451    -2327.744754  0.000132 -4.353746  0.004987
     spin moment: {S} , |S| = {    1.50862    0.00000   -0.00000 }     1.50862
mix (0): Broyden
mix (0): n_hist = 6 / 6
mix (0): weights =  0.1469E+03 0.1470E+03 0.1470E+03 0.1470E+03 0.1471E+03
mix (0): G =   0.010000, sum(coeff) = 0.5373E+01, coeff =  0.4696E+00 -.6309E+00 0.5546E+00 0.8308E+00 0.4149E+01
mix (0): f(x)[coeff] == 0 :   -.4401E+00,0.5629E+00  -.4401E+00,-.5629E+00  0.3400E+00,0.3257E+00  0.3400E+00,-.3257E+00
   scf:   33    -2327.744523    -2327.744483    -2327.744790  0.000621 -4.354169  0.004557
     spin moment: {S} , |S| = {    1.51649    0.00000   -0.00000 }     1.51649
mix (0): Broyden
mix (0): n_hist = 6 / 6
mix (0): weights =  0.1470E+03 0.1470E+03 0.1470E+03 0.1471E+03 0.1472E+03
mix (0): G =   0.010000, sum(coeff) = 0.1047E+01, coeff =  -.4585E-01 0.8137E+00 0.4503E-01 0.2399E-01 0.2099E+00
mix (0): f(x)[coeff] == 0 :   -.1582E+01,0.0000E+00  0.7060E+00,0.1400E+01  0.7060E+00,-.1400E+01  0.5616E-01,0.0000E+00
   scf:   34    -2327.744498    -2327.744490    -2327.744799  0.000158 -4.354297  0.004450
     spin moment: {S} , |S| = {    1.51850    0.00000   -0.00000 }     1.51850
mix (0): Broyden
mix (0): n_hist = 6 / 6
mix (0): weights =  0.1470E+03 0.1470E+03 0.1471E+03 0.1472E+03 0.1472E+03
mix (0): G =   0.010000, sum(coeff) = 0.6190E+00, coeff =  0.6153E+00 -.1889E-01 -.4485E-01 -.5389E-01 0.1213E+00
mix (0): f(x)[coeff] == 0 :   -.1000E+01,0.1034E+01  -.1000E+01,-.1034E+01  0.1222E+01,0.9783E+00  0.1222E+01,-.9783E+00
   scf:   35    -2327.744492    -2327.744491    -2327.744799  0.000016 -4.354309  0.004437
     spin moment: {S} , |S| = {    1.51871    0.00000   -0.00000 }     1.51871
mix (0): Broyden
mix (0): n_hist = 6 / 6
mix (0): weights =  0.1470E+03 0.1471E+03 0.1472E+03 0.1472E+03 0.1472E+03
mix (0): G =   0.010000, sum(coeff) = 0.7987E+00, coeff =  0.4024E+00 0.3607E-01 -.1610E+00 0.3643E+00 0.1569E+00
mix (0): f(x)[coeff] == 0 :   0.6401E+00,0.7599E+00  0.6401E+00,-.7599E+00  -.9975E+00,0.0000E+00  -.2605E+01,0.0000E+00
   scf:   36    -2327.744489    -2327.744490    -2327.744799  0.000016 -4.354307  0.004449
     spin moment: {S} , |S| = {    1.51850    0.00000   -0.00000 }     1.51850
mix (0): Broyden
mix (0): n_hist = 6 / 6
mix (0): weights =  0.1471E+03 0.1472E+03 0.1472E+03 0.1472E+03 0.1472E+03
mix (0): G =   0.010000, sum(coeff) = 0.2844E+00, coeff =  0.9448E-01 -.1895E+00 0.5236E+00 0.2042E+00 -.3483E+00
mix (0): f(x)[coeff] == 0 :   -.1200E+01,0.0000E+00  0.1673E+00,0.3573E+00  0.1673E+00,-.3573E+00  0.1452E+01,0.0000E+00
   scf:   37    -2327.744490    -2327.744490    -2327.744799  0.000005 -4.354306  0.004450
     spin moment: {S} , |S| = {    1.51846    0.00000   -0.00000 }     1.51846
mix (0): Broyden
mix (0): n_hist = 6 / 6
mix (0): weights =  0.1472E+03 0.1472E+03 0.1472E+03 0.1472E+03 0.1472E+03
mix (0): G =   0.010000, sum(coeff) = 0.1869E+00, coeff =  -.1802E+00 0.5938E+00 0.2239E+00 -.4294E+00 -.2112E-01
mix (0): f(x)[coeff] == 0 :   0.1270E+01,0.0000E+00  0.2897E+00,0.0000E+00  -.1116E+01,0.0000E+00  -.2078E+02,0.0000E+00
   scf:   38    -2327.744490    -2327.744490    -2327.744799  0.000004 -4.354309  0.004447
     spin moment: {S} , |S| = {    1.51850    0.00000   -0.00000 }     1.51850
mix (0): Broyden
mix (0): n_hist = 6 / 6
mix (0): weights =  0.1472E+03 0.1472E+03 0.1472E+03 0.1472E+03 0.1472E+03
mix (0): G =   0.010000, sum(coeff) = -.4767E-01, coeff =  0.4610E-01 0.2540E+00 -.5100E+00 -.7447E-01 0.2366E+00
mix (0): f(x)[coeff] == 0 :   -.1517E+01,0.0000E+00  -.1421E+00,0.0000E+00  0.7218E+00,0.0000E+00  0.1252E+01,0.0000E+00
   scf:   39    -2327.744493    -2327.744492    -2327.744800  0.000032 -4.354318  0.004423
     spin moment: {S} , |S| = {    1.51890    0.00000   -0.00000 }     1.51890
mix (0): Broyden
mix (0): n_hist = 6 / 6
mix (0): weights =  0.1472E+03 0.1472E+03 0.1472E+03 0.1472E+03 0.1472E+03
mix (0): G =   0.010000, sum(coeff) = -.2200E+00, coeff =  0.2741E+00 -.5599E+00 -.1086E+00 0.2237E+00 -.4925E-01
mix (0): f(x)[coeff] == 0 :   -.1426E+01,0.0000E+00  0.4846E+00,0.0000E+00  0.2742E+01,0.7336E+00  0.2742E+01,-.7336E+00
   scf:   40    -2327.744494    -2327.744493    -2327.744802  0.000024 -4.354321  0.004405
     spin moment: {S} , |S| = {    1.51919    0.00000   -0.00000 }     1.51919
mix (0): Broyden
mix (0): n_hist = 6 / 6
mix (0): weights =  0.1472E+03 0.1472E+03 0.1472E+03 0.1472E+03 0.1472E+03
mix (0): G =   0.010000, sum(coeff) = -.3487E+00, coeff =  -.5838E+00 -.1263E+00 0.2182E+00 -.1301E+00 0.2732E+00
mix (0): f(x)[coeff] == 0 :   0.1244E+01,0.0000E+00  -.9117E+00,0.0000E+00  0.7209E-01,0.1371E+01  0.7209E-01,-.1371E+01
   scf:   41    -2327.744495    -2327.744494    -2327.744803  0.000024 -4.354321  0.004387
     spin moment: {S} , |S| = {    1.51949    0.00000   -0.00000 }     1.51949
mix (0): Broyden
mix (0): n_hist = 6 / 6
mix (0): weights =  0.1472E+03 0.1472E+03 0.1472E+03 0.1472E+03 0.1472E+03
mix (0): G =   0.010000, sum(coeff) = 0.5044E+00, coeff =  -.1844E+00 0.1928E+00 -.2259E+00 0.2243E+00 0.4975E+00
mix (0): f(x)[coeff] == 0 :   0.6555E+00,0.0000E+00  0.7226E-01,0.6684E+00  0.7226E-01,-.6684E+00  -.1251E+01,0.0000E+00
   scf:   42    -2327.744497    -2327.744495    -2327.744804  0.000023 -4.354320  0.004369
     spin moment: {S} , |S| = {    1.51976    0.00000   -0.00000 }     1.51976
mix (0): Broyden
mix (0): n_hist = 6 / 6
mix (0): weights =  0.1472E+03 0.1472E+03 0.1472E+03 0.1472E+03 0.1472E+03
mix (0): G =   0.010000, sum(coeff) = 0.1256E+01, coeff =  0.1639E+00 -.3097E+00 0.1791E+00 0.4570E+00 0.7654E+00
mix (0): f(x)[coeff] == 0 :   0.3612E+00,0.3023E+00  0.3612E+00,-.3023E+00  -.6597E+00,0.7281E+00  -.6597E+00,-.7281E+00
   scf:   43    -2327.744499    -2327.744497    -2327.744806  0.000035 -4.354315  0.004342
     spin moment: {S} , |S| = {    1.52017    0.00000   -0.00000 }     1.52017
mix (0): Broyden
mix (0): n_hist = 6 / 6
mix (0): weights =  0.1472E+03 0.1472E+03 0.1472E+03 0.1472E+03 0.1472E+03
mix (0): G =   0.010000, sum(coeff) = 0.2441E+01, coeff =  -.3887E+00 0.1274E+00 0.3971E+00 0.6558E+00 0.1649E+01
mix (0): f(x)[coeff] == 0 :   0.5212E+00,0.0000E+00  -.7573E+00,0.0000E+00  -.8078E-01,0.7686E+00  -.8078E-01,-.7686E+00
   scf:   44    -2327.744506    -2327.744502    -2327.744810  0.000083 -4.354303  0.004277
     spin moment: {S} , |S| = {    1.52117    0.00000    0.00000 }     1.52117
mix (0): Broyden
mix (0): n_hist = 6 / 6
mix (0): weights =  0.1472E+03 0.1472E+03 0.1472E+03 0.1472E+03 0.1473E+03
mix (0): G =   0.010000, sum(coeff) = 0.5092E+01, coeff =  0.2516E-01 0.2227E+00 0.3161E+00 0.1051E+01 0.3477E+01
mix (0): f(x)[coeff] == 0 :   0.1030E+00,0.3681E+00  0.1030E+00,-.3681E+00  -.3768E+00,0.0000E+00  -.1315E+00,0.0000E+00
   scf:   45    -2327.744538    -2327.744519    -2327.744828  0.000349 -4.354255  0.004005
     spin moment: {S} , |S| = {    1.52536    0.00000    0.00000 }     1.52536
mix (0): Broyden
mix (0): n_hist = 6 / 6
mix (0): weights =  0.1472E+03 0.1472E+03 0.1472E+03 0.1473E+03 0.1473E+03
mix (0): G =   0.010000, sum(coeff) = 0.2046E+01, coeff =  -.1620E-01 -.2201E+00 -.1074E+00 0.2380E+00 0.2152E+01
mix (0): f(x)[coeff] == 0 :   0.4874E+00,0.0000E+00  -.2607E+00,0.3656E+00  -.2607E+00,-.3656E+00  -.7661E-01,0.0000E+00
   scf:   46    -2327.744595    -2327.744551    -2327.744861  0.000770 -4.354150  0.003401
     spin moment: {S} , |S| = {    1.53463    0.00000    0.00000 }     1.53463
mix (0): Broyden
mix (0): n_hist = 6 / 6
mix (0): weights =  0.1472E+03 0.1472E+03 0.1473E+03 0.1473E+03 0.1475E+03
mix (0): G =   0.010000, sum(coeff) = -.6495E+00, coeff =  -.1809E+00 -.2028E+00 -.2693E+00 -.3838E+00 0.3872E+00
mix (0): f(x)[coeff] == 0 :   -.6343E+00,0.0000E+00  -.3008E-01,0.6604E+00  -.3008E-01,-.6604E+00  0.1685E+01,0.0000E+00
   scf:   47    -2327.744562    -2327.744557    -2327.744867  0.000139 -4.354137  0.003291
     spin moment: {S} , |S| = {    1.53632    0.00000    0.00000 }     1.53632
mix (0): Broyden
mix (0): n_hist = 6 / 6
mix (0): weights =  0.1472E+03 0.1473E+03 0.1473E+03 0.1475E+03 0.1475E+03
mix (0): G =   0.010000, sum(coeff) = 0.1823E+00, coeff =  -.1891E-02 -.8574E-01 -.1706E+00 -.3316E-01 0.4737E+00
mix (0): f(x)[coeff] == 0 :   -.3558E+00,0.2967E+00  -.3558E+00,-.2967E+00  -.2312E-01,0.0000E+00  0.8047E+00,0.0000E+00
   scf:   48    -2327.744555    -2327.744556    -2327.744866  0.000018 -4.354149  0.003303
     spin moment: {S} , |S| = {    1.53613    0.00000   -0.00000 }     1.53613
mix (0): Broyden
mix (0): n_hist = 6 / 6
mix (0): weights =  0.1473E+03 0.1473E+03 0.1475E+03 0.1475E+03 0.1475E+03
mix (0): G =   0.010000, sum(coeff) = 0.2825E+00, coeff =  0.1779E-02 -.5803E-02 0.6641E-02 -.2655E-01 0.3065E+00
mix (0): f(x)[coeff] == 0 :   -.1628E+00,0.2607E+00  -.1628E+00,-.2607E+00  0.2061E+00,0.1377E+00  0.2061E+00,-.1377E+00
   scf:   49    -2327.744556    -2327.744556    -2327.744866  0.000005 -4.354156  0.003300
     spin moment: {S} , |S| = {    1.53618    0.00000   -0.00000 }     1.53618
mix (0): Broyden
mix (0): n_hist = 6 / 6
mix (0): weights =  0.1473E+03 0.1475E+03 0.1475E+03 0.1475E+03 0.1475E+03
mix (0): G =   0.010000, sum(coeff) = 0.6944E+00, coeff =  0.4004E-01 0.3298E-01 -.1380E+00 0.2091E+00 0.5503E+00
mix (0): f(x)[coeff] == 0 :   0.3601E+00,0.3428E+00  0.3601E+00,-.3428E+00  -.4594E+00,0.0000E+00  -.6408E+00,0.0000E+00
   scf:   50    -2327.744558    -2327.744557    -2327.744867  0.000026 -4.354162  0.003278
     spin moment: {S} , |S| = {    1.53652    0.00000   -0.00000 }     1.53652
mix (0): Broyden
mix (0): n_hist = 6 / 6
mix (0): weights =  0.1475E+03 0.1475E+03 0.1475E+03 0.1475E+03 0.1475E+03
mix (0): G =   0.010000, sum(coeff) = 0.1474E+01, coeff =  0.6343E-01 -.1685E+00 0.1731E+00 0.5314E+00 0.8744E+00
mix (0): f(x)[coeff] == 0 :   0.2499E+00,0.2266E+00  0.2499E+00,-.2266E+00  -.5537E+00,0.5754E+00  -.5537E+00,-.5754E+00
   scf:   51    -2327.744561    -2327.744559    -2327.744869  0.000054 -4.354171  0.003233
     spin moment: {S} , |S| = {    1.53721    0.00000    0.00000 }     1.53721
mix (0): Broyden
mix (0): n_hist = 6 / 6
mix (0): weights =  0.1475E+03 0.1475E+03 0.1475E+03 0.1475E+03 0.1475E+03
mix (0): G =   0.010000, sum(coeff) = 0.2835E+01, coeff =  -.4392E-01 0.5400E-01 0.4640E+00 0.8230E+00 0.1538E+01
mix (0): f(x)[coeff] == 0 :   0.2136E+00,0.0000E+00  -.4139E+00,0.0000E+00  -.1674E+00,0.5431E+00  -.1674E+00,-.5431E+00
   scf:   52    -2327.744566    -2327.744562    -2327.744873  0.000107 -4.354198  0.003144
     spin moment: {S} , |S| = {    1.53861    0.00000    0.00000 }     1.53861
mix (0): Broyden
mix (0): n_hist = 6 / 6
mix (0): weights =  0.1475E+03 0.1475E+03 0.1475E+03 0.1475E+03 0.1476E+03
mix (0): G =   0.010000, sum(coeff) = 0.4851E+01, coeff =  -.1994E+00 0.2678E+00 0.6466E+00 0.1249E+01 0.2887E+01
mix (0): f(x)[coeff] == 0 :   -.6134E+00,0.0000E+00  0.3029E+00,0.0000E+00  -.6107E-01,0.6067E+00  -.6107E-01,-.6067E+00
   scf:   53    -2327.744590    -2327.744575    -2327.744887  0.000403 -4.354289  0.002806
     spin moment: {S} , |S| = {    1.54386    0.00000    0.00000 }     1.54386
mix (0): Broyden
mix (0): n_hist = 6 / 6
mix (0): weights =  0.1475E+03 0.1475E+03 0.1475E+03 0.1476E+03 0.1477E+03
mix (0): G =   0.010000, sum(coeff) = 0.3584E+01, coeff =  -.1926E+00 0.1780E+00 0.4666E+00 0.6107E+00 0.2521E+01
mix (0): f(x)[coeff] == 0 :   -.5634E+00,0.0000E+00  0.3577E+00,0.0000E+00  -.1826E-01,0.6154E+00  -.1826E-01,-.6154E+00
   scf:   54    -2327.744651    -2327.744601    -2327.744918  0.001116 -4.354525  0.001871
     spin moment: {S} , |S| = {    1.55840    0.00000    0.00000 }     1.55840
mix (0): Broyden
mix (0): n_hist = 6 / 6
mix (0): weights =  0.1475E+03 0.1475E+03 0.1476E+03 0.1477E+03 0.1479E+03
mix (0): G =   0.010000, sum(coeff) = 0.8950E+00, coeff =  0.9301E-01 0.2959E+00 0.7358E-01 0.3278E+00 0.1047E+00
mix (0): f(x)[coeff] == 0 :   0.1705E+00,0.9385E+00  0.1705E+00,-.9385E+00  -.3087E+00,0.0000E+00  -.3162E+01,0.0000E+00
   scf:   55    -2327.744612    -2327.744606    -2327.744924  0.000279 -4.354578  0.001637
     spin moment: {S} , |S| = {    1.56205    0.00000    0.00000 }     1.56205
mix (0): Broyden
mix (0): n_hist = 6 / 6
mix (0): weights =  0.1475E+03 0.1476E+03 0.1477E+03 0.1479E+03 0.1480E+03
mix (0): G =   0.010000, sum(coeff) = 0.6816E+00, coeff =  0.2566E+00 -.1066E-01 0.1302E+00 -.1205E+00 0.4259E+00
mix (0): f(x)[coeff] == 0 :   -.4942E+00,0.6709E+00  -.4942E+00,-.6709E+00  0.6356E+00,0.6810E+00  0.6356E+00,-.6810E+00
   scf:   56    -2327.744608    -2327.744607    -2327.744925  0.000054 -4.354583  0.001592
     spin moment: {S} , |S| = {    1.56276    0.00000    0.00000 }     1.56276
mix (0): Broyden
mix (0): n_hist = 6 / 6
mix (0): weights =  0.1476E+03 0.1477E+03 0.1479E+03 0.1480E+03 0.1480E+03
mix (0): G =   0.010000, sum(coeff) = 0.4251E+00, coeff =  -.1037E+00 -.2435E-01 -.2426E-02 0.2104E+00 0.3452E+00
mix (0): f(x)[coeff] == 0 :   0.6519E+00,0.0000E+00  -.1708E+00,0.6869E+00  -.1708E+00,-.6869E+00  -.9198E+00,0.0000E+00
   scf:   57    -2327.744609    -2327.744608    -2327.744926  0.000058 -4.354587  0.001544
     spin moment: {S} , |S| = {    1.56353    0.00000    0.00000 }     1.56353
mix (0): Broyden
mix (0): n_hist = 6 / 6
mix (0): weights =  0.1477E+03 0.1479E+03 0.1480E+03 0.1480E+03 0.1480E+03
mix (0): G =   0.010000, sum(coeff) = 0.3015E+00, coeff =  -.1146E+00 0.3410E-01 0.9052E-01 0.1174E+00 0.1741E+00
mix (0): f(x)[coeff] == 0 :   0.6309E+00,0.0000E+00  -.1003E+01,0.0000E+00  -.1512E+00,0.1009E+01  -.1512E+00,-.1009E+01
   scf:   58    -2327.744609    -2327.744608    -2327.744927  0.000038 -4.354587  0.001513
     spin moment: {S} , |S| = {    1.56403    0.00000   -0.00000 }     1.56403
mix (0): Broyden
mix (0): n_hist = 6 / 6
mix (0): weights =  0.1479E+03 0.1480E+03 0.1480E+03 0.1480E+03 0.1480E+03
mix (0): G =   0.010000, sum(coeff) = 0.2717E+00, coeff =  0.3823E-02 0.2250E-01 0.8424E-02 0.9044E-01 0.1465E+00
mix (0): f(x)[coeff] == 0 :   0.1504E+00,0.4309E+00  0.1504E+00,-.4309E+00  -.1668E+00,0.0000E+00  -.7512E+00,0.0000E+00
   scf:   59    -2327.744609    -2327.744609    -2327.744927  0.000026 -4.354586  0.001492
     spin moment: {S} , |S| = {    1.56438    0.00000   -0.00000 }     1.56438
mix (0): Broyden
mix (0): n_hist = 6 / 6
mix (0): weights =  0.1480E+03 0.1480E+03 0.1480E+03 0.1480E+03 0.1480E+03
mix (0): G =   0.010000, sum(coeff) = 0.3680E+00, coeff =  0.2475E-02 -.1633E-01 0.7075E-01 0.1359E+00 0.1752E+00
mix (0): f(x)[coeff] == 0 :   0.1014E+00,0.1190E+00  0.1014E+00,-.1190E+00  -.4893E+00,0.5818E+00  -.4893E+00,-.5818E+00
   scf:   60    -2327.744609    -2327.744609    -2327.744928  0.000017 -4.354583  0.001478
     spin moment: {S} , |S| = {    1.56462    0.00000   -0.00000 }     1.56462
mix (0): Broyden
mix (0): n_hist = 6 / 6
mix (0): weights =  0.1480E+03 0.1480E+03 0.1480E+03 0.1480E+03 0.1480E+03
mix (0): G =   0.010000, sum(coeff) = 0.5312E+00, coeff =  -.3099E-01 0.5864E-01 0.1290E+00 0.1720E+00 0.2026E+00
mix (0): f(x)[coeff] == 0 :   0.2770E+00,0.0000E+00  -.8020E+00,0.0000E+00  -.1621E+00,0.8138E+00  -.1621E+00,-.8138E+00
   scf:   61    -2327.744610    -2327.744609    -2327.744928  0.000018 -4.354579  0.001464
     spin moment: {S} , |S| = {    1.56487    0.00000   -0.00000 }     1.56487
mix (0): Broyden
mix (0): n_hist = 6 / 6
mix (0): weights =  0.1480E+03 0.1480E+03 0.1480E+03 0.1480E+03 0.1480E+03
mix (0): G =   0.010000, sum(coeff) = 0.7702E+00, coeff =  0.4262E-01 0.1199E+00 0.1680E+00 0.1994E+00 0.2403E+00
mix (0): f(x)[coeff] == 0 :   0.8692E-01,0.7382E+00  0.8692E-01,-.7382E+00  -.5017E+00,0.2630E+00  -.5017E+00,-.2630E+00
   scf:   62    -2327.744610    -2327.744610    -2327.744929  0.000023 -4.354573  0.001446
     spin moment: {S} , |S| = {    1.56519    0.00000   -0.00000 }     1.56519
mix (0): Broyden
mix (0): n_hist = 6 / 6
mix (0): weights =  0.1480E+03 0.1480E+03 0.1480E+03 0.1480E+03 0.1480E+03
mix (0): G =   0.010000, sum(coeff) = 0.1006E+01, coeff =  0.1159E+00 0.1648E+00 0.1964E+00 0.2370E+00 0.2920E+00
mix (0): f(x)[coeff] == 0 :   0.2311E+00,0.7795E+00  0.2311E+00,-.7795E+00  -.6368E+00,0.4413E+00  -.6368E+00,-.4413E+00
   scf:   63    -2327.744611    -2327.744610    -2327.744929  0.000027 -4.354567  0.001425
     spin moment: {S} , |S| = {    1.56556    0.00000   -0.00000 }     1.56556
mix (0): Broyden
mix (0): n_hist = 6 / 6
mix (0): weights =  0.1480E+03 0.1480E+03 0.1480E+03 0.1480E+03 0.1480E+03
mix (0): G =   0.010000, sum(coeff) = 0.1241E+01, coeff =  0.1624E+00 0.1935E+00 0.2331E+00 0.2872E+00 0.3646E+00
mix (0): f(x)[coeff] == 0 :   0.2642E+00,0.7747E+00  0.2642E+00,-.7747E+00  -.6581E+00,0.4814E+00  -.6581E+00,-.4814E+00
   scf:   64    -2327.744611    -2327.744611    -2327.744930  0.000032 -4.354557  0.001400
     spin moment: {S} , |S| = {    1.56600    0.00000   -0.00000 }     1.56600
mix (0): Broyden
mix (0): n_hist = 6 / 6
mix (0): weights =  0.1480E+03 0.1480E+03 0.1480E+03 0.1480E+03 0.1480E+03
mix (0): G =   0.010000, sum(coeff) = 0.1516E+01, coeff =  0.1893E+00 0.2278E+00 0.2807E+00 0.3560E+00 0.4623E+00
mix (0): f(x)[coeff] == 0 :   0.2605E+00,0.7563E+00  0.2605E+00,-.7563E+00  -.6456E+00,0.4725E+00  -.6456E+00,-.4725E+00
   scf:   65    -2327.744612    -2327.744611    -2327.744930  0.000042 -4.354544  0.001368
     spin moment: {S} , |S| = {    1.56658    0.00000   -0.00000 }     1.56658
mix (0): Broyden
mix (0): n_hist = 6 / 6
mix (0): weights =  0.1480E+03 0.1480E+03 0.1480E+03 0.1480E+03 0.1480E+03
mix (0): G =   0.010000, sum(coeff) = 0.1890E+01, coeff =  0.2196E+00 0.2706E+00 0.3430E+00 0.4452E+00 0.6118E+00
mix (0): f(x)[coeff] == 0 :   0.2568E+00,0.7326E+00  0.2568E+00,-.7326E+00  -.6207E+00,0.4586E+00  -.6207E+00,-.4586E+00
   scf:   66    -2327.744613    -2327.744612    -2327.744931  0.000063 -4.354524  0.001320
     spin moment: {S} , |S| = {    1.56746    0.00000    0.00000 }     1.56746
mix (0): Broyden
mix (0): n_hist = 6 / 6
mix (0): weights =  0.1480E+03 0.1480E+03 0.1480E+03 0.1480E+03 0.1481E+03
mix (0): G =   0.010000, sum(coeff) = 0.2424E+01, coeff =  0.2527E+00 0.3203E+00 0.4156E+00 0.5711E+00 0.8640E+00
mix (0): f(x)[coeff] == 0 :   0.2560E+00,0.6951E+00  0.2560E+00,-.6951E+00  -.5865E+00,0.4348E+00  -.5865E+00,-.4348E+00
   scf:   67    -2327.744615    -2327.744614    -2327.744933  0.000110 -4.354488  0.001236
     spin moment: {S} , |S| = {    1.56898    0.00000    0.00000 }     1.56898
mix (0): Broyden
mix (0): n_hist = 6 / 6
mix (0): weights =  0.1480E+03 0.1480E+03 0.1480E+03 0.1481E+03 0.1481E+03
mix (0): G =   0.010000, sum(coeff) = 0.3131E+01, coeff =  0.2727E+00 0.3539E+00 0.4861E+00 0.7354E+00 0.1283E+01
mix (0): f(x)[coeff] == 0 :   0.2521E+00,0.6363E+00  0.2521E+00,-.6363E+00  -.5388E+00,0.4045E+00  -.5388E+00,-.4045E+00
   scf:   68    -2327.744620    -2327.744616    -2327.744936  0.000229 -4.354413  0.001061
     spin moment: {S} , |S| = {    1.57215    0.00000    0.00000 }     1.57215
mix (0): Broyden
mix (0): n_hist = 6 / 6
mix (0): weights =  0.1480E+03 0.1480E+03 0.1481E+03 0.1481E+03 0.1481E+03
mix (0): G =   0.010000, sum(coeff) = 0.3385E+01, coeff =  0.2158E+00 0.2964E+00 0.4484E+00 0.7823E+00 0.1642E+01
mix (0): f(x)[coeff] == 0 :   0.2375E+00,0.5582E+00  0.2375E+00,-.5582E+00  -.4758E+00,0.3617E+00  -.4758E+00,-.3617E+00
   scf:   69    -2327.744630    -2327.744621    -2327.744942  0.000512 -4.354242  0.000670
     spin moment: {S} , |S| = {    1.57925    0.00000    0.00000 }     1.57925
mix (0): Broyden
mix (0): n_hist = 6 / 6
mix (0): weights =  0.1480E+03 0.1481E+03 0.1481E+03 0.1481E+03 0.1482E+03
mix (0): G =   0.010000, sum(coeff) = 0.1713E+01, coeff =  0.7389E-01 0.1132E+00 0.1993E+00 0.4163E+00 0.9107E+00
mix (0): f(x)[coeff] == 0 :   0.2032E+00,0.4888E+00  0.2032E+00,-.4888E+00  -.4318E+00,0.3211E+00  -.4318E+00,-.3211E+00
   scf:   70    -2327.744632    -2327.744623    -2327.744945  0.000595 -4.354041  0.000506
     spin moment: {S} , |S| = {    1.58750    0.00000    0.00000 }     1.58750
mix (0): Broyden
mix (0): n_hist = 6 / 6
mix (0): weights =  0.1481E+03 0.1481E+03 0.1481E+03 0.1482E+03 0.1483E+03
mix (0): G =   0.010000, sum(coeff) = 0.3918E+00, coeff =  0.2067E-01 0.3892E-01 0.7818E-01 0.1318E+00 0.1222E+00
mix (0): f(x)[coeff] == 0 :   0.8266E-01,0.5641E+00  0.8266E-01,-.5641E+00  -.6220E+00,0.3651E+00  -.6220E+00,-.3651E+00
   scf:   71    -2327.744623    -2327.744623    -2327.744946  0.000164 -4.353985  0.000492
     spin moment: {S} , |S| = {    1.58978    0.00000    0.00000 }     1.58978
mix (0): Broyden
mix (0): n_hist = 6 / 6
mix (0): weights =  0.1481E+03 0.1481E+03 0.1482E+03 0.1483E+03 0.1483E+03
mix (0): G =   0.010000, sum(coeff) = 0.1204E+00, coeff =  0.7754E-02 0.1595E-01 0.2515E-01 0.2437E-01 0.4719E-01
mix (0): f(x)[coeff] == 0 :   0.1746E+00,0.6984E+00  0.1746E+00,-.6984E+00  -.4328E+00,0.3601E+00  -.4328E+00,-.3601E+00
   scf:   72    -2327.744623    -2327.744623    -2327.744946  0.000040 -4.353972  0.000490
     spin moment: {S} , |S| = {    1.59034    0.00000   -0.00000 }     1.59034

SCF Convergence by DM+H criterion
max |DM_out - DM_in|         :     0.0000397469
max |H_out - H_in|      (eV) :     0.0004895704
SCF cycle converged after 72 iterations
mix (0): resetting history of all mixers

Using DM_out to compute the final energy and forces
No. of atoms with KB's overlaping orbs in proc 0. Max # of overlaps:       3      18

siesta: E_KS(eV) =            -2327.7446

siesta: E_KS - E_eggbox =     -2327.7446
     spin moment: {S} , |S| = {    1.59034    0.00000   -0.00000 }     1.59034

siesta: Atomic forces (eV/Ang):
----------------------------------------
   Tot    0.000000    0.000000   -0.000000
----------------------------------------
   Max    0.631604
   Res    0.297741    sqrt( Sum f_i^2 / 3N )
----------------------------------------
   Max    0.631604    constrained

Stress tensor Voigt[x,y,z,yz,xz,xy] (kbar):        8.52        8.52      -14.98        0.00        0.00        0.00
(Free)E + p*V (eV/cell)    -2327.9270
Target enthalpy (eV/cell)    -2327.7449

mulliken: Atomic and Orbital Populations:

Species: Fe_nc               

Atom      Orb        Charge      Spin       Svec
----------------------------------------------------------------
    1  1 4s         1.48523   0.10507     -0.015   0.000   0.104
    1  2 3dxy       1.26345   0.73100      0.082   0.000   0.726
    1  3 3dyz       1.35278   0.53483      0.012   0.000   0.535
    1  4 3dz2       1.36886   0.51034      0.019   0.000   0.510
    1  5 3dxz       1.35278   0.53483      0.012   0.000   0.535
    1  6 3dx2-y2    1.26334   0.73112      0.082   0.000   0.727
    1     Total     8.08643   3.14217      0.191   0.000   3.136

    2  1 4s         1.03155   0.03990      0.040   0.000  -0.000
    2  2 3dxy       1.47341   0.40906      0.409   0.000  -0.000
    2  3 3dyz       1.29445   0.11798      0.118   0.000  -0.000
    2  4 3dz2       1.25969   0.11431      0.114   0.000   0.000
    2  5 3dxz       1.29445   0.11798      0.118   0.000  -0.000
    2  6 3dx2-y2    1.47361   0.40886      0.409   0.000  -0.000
    2     Total     7.82714   1.20809      1.208   0.000  -0.000

    3  1 4s         1.48523   0.10507     -0.015   0.000  -0.104
    3  2 3dxy       1.26345   0.73100      0.082   0.000  -0.726
    3  3 3dyz       1.35278   0.53483      0.012   0.000  -0.535
    3  4 3dz2       1.36886   0.51034      0.019   0.000  -0.510
    3  5 3dxz       1.35278   0.53483      0.012   0.000  -0.535
    3  6 3dx2-y2    1.26334   0.73112      0.082   0.000  -0.727
    3     Total     8.08643   3.14217      0.191   0.000  -3.136

----------------------------------------------------------------
Total              24.00000   1.59034      1.590   0.000  -0.000


siesta: Program's energy decomposition (eV):
siesta: Ebs     =      -152.173222
siesta: Eions   =      2102.576618
siesta: Ena     =        92.089899
siesta: Ekin    =      2339.338613
siesta: Enl     =     -1481.790769
siesta: Eso     =         0.000000
siesta: Edftu   =         0.000000
siesta: DEna    =       -33.774907
siesta: DUscf   =         3.942919
siesta: DUext   =         0.000000
siesta: Ex      =     -1050.579800
siesta: Ec      =       -94.393961
siesta: Exc     =     -1144.973761
siesta: EbV     =         0.000000
siesta: eta*DQ  =         0.000000
siesta: Emadel  =         0.000000
siesta: Emeta   =         0.000000
siesta: Emolmec =         0.000000
siesta: Ekinion =         0.000000
siesta: Eharris =     -2327.744623
siesta: Etot    =     -2327.744623
siesta: FreeEng =     -2327.744946

siesta: Final energy (eV):
siesta:  Band Struct. =    -152.173222
siesta:       Kinetic =    2339.338613
siesta:       Hartree =    1395.648400
siesta:         Edftu =       0.000000
siesta:       Eso     =       0.000000
siesta:    Ext. field =       0.000000
siesta:         Exch. =   -1050.579800
siesta:         Corr. =     -94.393961
siesta:     Bulk bias =       0.000000
siesta:   Exch.-corr. =   -1144.973761
siesta:  Ion-electron =   -4726.081026
siesta:       Ion-ion =    -191.676849
siesta:       Ekinion =       0.000000
siesta: D3 dispersion =       0.000000
siesta:         Total =   -2327.744623
siesta:         Fermi =      -4.353972

siesta: Atomic forces (eV/Ang):
siesta:      1    0.000000    0.000000    0.631604
siesta:      2    0.000000   -0.000000    0.000000
siesta:      3   -0.000000    0.000000   -0.631604
siesta: ----------------------------------------
siesta:    Tot    0.000000    0.000000   -0.000000

siesta: Stress tensor (static) (eV/Ang**3):
siesta:     0.005315    0.000000   -0.000000
siesta:     0.000000    0.005315    0.000000
siesta:     0.000000    0.000000   -0.009350

siesta: Cell volume =        426.771969 Ang**3

siesta: Pressure (static):
siesta:                Solid            Molecule  Units
siesta:          -0.00000465         -0.00002537  Ry/Bohr**3
siesta:          -0.00042661         -0.00232916  eV/Ang**3
siesta:          -0.68350203         -3.73173093  kBar
(Free)E+ p_basis*V_orbitals  =       -2326.595864
(Free)Eharris+ p_basis*V_orbitals  =       -2326.595864
     spin moment: {S} , |S| = {    1.59034    0.00000   -0.00000 }     1.59034

cite: Please see "broyden.bib" for an exhaustive BiBTeX file.
cite: Please clearly indicate Siesta version in published work: 5.0.0-alpha-123-gfb8fd7d02
cite: This calculation has made use of the following articles
cite: which are encouraged to be cited in a published work.
        Primary SIESTA paper
          DOI: www.doi.org/10.1088/0953-8984/14/11/302


timer: Elapsed wall time (sec) =       3.884
timer: CPU execution times (sec):

Routine            Calls   Time/call    Tot.time        %
siesta                 1       3.869       3.869   100.00
Setup                  1       0.034       0.034     0.88
bands                  1       0.000       0.000     0.00
KSV_init               1       0.000       0.000     0.00
IterGeom               1       3.835       3.835    99.11
geom_init              1       0.206       0.206     5.32
state_init             1       0.013       0.013     0.34
hsparse                1       0.000       0.000     0.00
overlap                1       0.013       0.013     0.33
Setup_H0               1       0.143       0.143     3.71
naefs                  2       0.000       0.000     0.00
MolMec                 2       0.000       0.000     0.00
kinefsm                2       0.006       0.012     0.31
nlefsm                 2       0.039       0.078     2.01
DHSCF_Init             1       0.054       0.054     1.40
DHSCF1                 1       0.009       0.009     0.24
INITMESH               1       0.000       0.000     0.00
DHSCF2                 1       0.045       0.045     1.16
REMESH                 1       0.003       0.003     0.08
REORD                612       0.000       0.108     2.78
PHION                  1       0.025       0.025     0.64
COMM_BSC            1190       0.000       0.161     4.17
POISON                75       0.005       0.376     9.73
fft                  150       0.002       0.305     7.87
setup_H               73       0.048       3.528    91.18
DHSCF                 74       0.049       3.634    93.91
DHSCF3                74       0.048       3.568    92.21
rhoofd                74       0.005       0.393    10.15
XC                    74       0.027       2.012    51.99
GXC-CellXC            74       0.025       1.814    46.88
gridxc@cellXC         74       0.025       1.814    46.87
vmat                  74       0.005       0.344     8.88
IterSCF               72       0.049       3.512    90.76
compute_dm            72       0.000       0.020     0.52
diagon                72       0.000       0.020     0.51
cdiag                 72       0.000       0.014     0.37
cdiag1                72       0.000       0.001     0.03
cdiag2                72       0.000       0.002     0.05
cdiag3                72       0.000       0.010     0.25
cdiag4                72       0.000       0.001     0.02
MIXER                 71       0.000       0.005     0.13
PostSCF                1       0.116       0.116     2.99
DHSCF4                 1       0.066       0.066     1.70
dfscf                  1       0.049       0.049     1.27
overfsm                1       0.000       0.000     0.00
state_analysis         1       0.000       0.000     0.01
siesta_move            1       0.000       0.000     0.00
Analysis               1       0.000       0.000     0.00
optical                1       0.000       0.000     0.00
  

>> End of run:  28-SEP-2023  15:35:44
Job completed
