Siesta Version  : 5.0.0-alpha-123-gfb8fd7d02
Architecture    : ----
Compiler version: GNU-11.4.0
Compiler flags  : -fallow-argument-mismatch;-O3 -march=native
PP flags        : ----
Libraries       : ----
Parallelisations: none
GEMM3M support
NetCDF support
NetCDF-4 support
Lua support

Runtime information:
* Directory : /home/fnpedron/Siesta/siesta-dev/Tests/04.SCFMixing/work/linear
* Running in serial mode.
>> Start of run:  28-SEP-2023  15:35:47

                           *********************** 
                           *  WELCOME TO SIESTA  * 
                           *********************** 

reinit: Reading from standard input
reinit: Dumping input in INPUT_TMP.40934
************************** Dump of input data file ****************************
%include ../../basejob.fdf
SystemLabel        linear
%block SCF.Mixers
  linear-1
  linear-2
  linear-3
%endblock
%block SCF.Mixer.linear-1
  method linear
  weight 0.01
  iterations 10
  next linear-2
%endblock
%block SCF.Mixer.linear-2
  method linear
  weight 0.02
  iterations 7
  next linear-3
%endblock
%block SCF.Mixer.linear-3
  method linear
  weight 0.03
%endblock
MaxSCFIterations 30
SCF.MustConverge false
************************** End of input data file *****************************

reinit: -----------------------------------------------------------------------
reinit: System Name: Linear Fe3 cluster.
reinit: -----------------------------------------------------------------------
reinit: System Label: linear
reinit: -----------------------------------------------------------------------

initatom: Reading input for the pseudopotentials and atomic orbitals ----------
Species number:   1 Atomic number:   26 Label: Fe_nc


---- Processing specs for species: Fe_nc
Ground state valence configuration:   4s02  3d06
Reading pseudopotential information in formatted form from:
  /home/fnpedron/Siesta/siesta-dev/Tests/Pseudos/Fe_nc.psf

---- Pseudopotential check for Fe

Pseudized shells:
4s( 1.00) rc: 2.00
4p( 0.00) rc: 2.00
3d( 7.00) rc: 2.00
4f( 0.00) rc: 2.00
Valence configuration for ps generation: (assumed as above)
For Fe_nc, standard SIESTA heuristics set lmxkb to 3
 (one more than the basis l, including polarization orbitals).
Use PS.lmax or PS.KBprojectors blocks to override.

<basis_specs>
===============================================================================
Fe_nc                Z=  26    Mass=  55.845        Charge= 0.17977+309
Lmxo=2 Lmxkb= 3    BasisType=split      Semic=F
L=0  Nsemic=0  Cnfigmx=4
          i=1  nzeta=1  polorb=0  (4s)
            splnorm:   0.15000    
               vcte:    40.000    
               rinn:  -0.90000    
               qcoe:    0.0000    
               qyuk:    0.0000    
               qwid:   0.10000E-01
                rcs:    0.0000    
            lambdas:    1.0000    
L=1  Nsemic=0  Cnfigmx=4
          i=1  nzeta=0  polorb=0  (4p)  (empty shell (??) )
L=2  Nsemic=0  Cnfigmx=3
          i=1  nzeta=1  polorb=0  (3d)
            splnorm:   0.15000    
               vcte:    40.000    
               rinn:  -0.90000    
               qcoe:    0.0000    
               qyuk:    0.0000    
               qwid:   0.10000E-01
                rcs:    0.0000    
            lambdas:    1.0000    
-------------------------------------------------------------------------------
L=0  Nkbl=1  erefs: 0.17977+309
L=1  Nkbl=1  erefs: 0.17977+309
L=2  Nkbl=1  erefs: 0.17977+309
L=3  Nkbl=1  erefs: 0.17977+309
===============================================================================
</basis_specs>

Using PAO.SplitTailNorm
atom: Called for Fe_nc                 (Z =  26)
Maximum radius (at nrval) set to   50.00000 8518

read_vps: Pseudopotential generation method:
read_vps: ATM3      Troullier-Martins                       
Valence charge in pseudo generation:    8.00000

read_vps: Pseudopotential includes a core correction:
read_vps: Pseudo-core for xc-correction

xc_check: Exchange-correlation functional:
xc_check: Ceperley-Alder
V l=0 = -2*Zval/r beyond r=  2.8472
V l=1 = -2*Zval/r beyond r=  2.8472
V l=2 = -2*Zval/r beyond r=  2.8472
V l=3 = -2*Zval/r beyond r=  2.8472
All V_l potentials equal beyond r=  1.9894
This should be close to max(r_c) in ps generation
All pots = -2*Zval/r beyond r=  2.8472
Using large-core scheme (fit) for Vlocal

atom: Estimated core radius    2.84716
Fit of Vlocal with continuous 2nd derivative
Fitting vlocal at       1.9954
Choosing vlocal chloc cutoff:***  3.100644
qtot up to nchloc:    8.00000259
atom: Maximum radius for chlocal:    3.10064
atom: Maximum radius for r*vlocal+2*Zval:    3.10064

KBgen: Kleinman-Bylander projectors: 
GHOST: No ghost state for L =  0
   l= 0   rc=  1.991366   el= -0.319855   Ekb=  3.826230   kbcos=  0.253712
GHOST: No ghost state for L =  1
   l= 1   rc=  2.019582   el= -0.070931   Ekb=  3.335986   kbcos=  0.155791
GHOST: No ghost state for L =  2
   l= 2   rc=  1.989365   el= -0.307264   Ekb=-12.632066   kbcos= -0.657060
GHOST: No ghost state for L =  3
   l= 3   rc=  2.015527   el=  0.019538   Ekb= -1.701666   kbcos= -0.006384

KBgen: Total number of Kleinman-Bylander projectors:  16
atom: -------------------------------------------------------------------------

atom: SANKEY-TYPE ORBITALS:

SPLIT: Orbitals with angular momentum L= 0

SPLIT: Basis orbitals for state 4s

SPLIT: PAO cut-off radius determined from an
SPLIT: energy shift=  0.010000 Ry
Split based on tail norm

   izeta = 1
                 lambda =    1.000000
                     rc =    7.355669
                 energy =   -0.308198
                kinetic =    0.284874
    potential(screened) =   -0.593072
       potential(ionic) =   -5.763042

SPLIT: Orbitals with angular momentum L= 2

SPLIT: Basis orbitals for state 3d

SPLIT: PAO cut-off radius determined from an
SPLIT: energy shift=  0.010000 Ry
Split based on tail norm

   izeta = 1
                 lambda =    1.000000
                     rc =    4.584362
                 energy =   -0.296412
                kinetic =    8.773647
    potential(screened) =   -9.070058
       potential(ionic) =  -18.006145
atom: Total number of Sankey-type orbitals:  6

atm_pop: Valence configuration (for local Pseudopot. screening):
 4s( 2.00)                                                            
 4p( 0.00)                                                            
 3d( 6.00)                                                            
Vna: chval, zval:    8.00000   8.00000

Vna:  Cut-off radius for the neutral-atom potential:   7.355669
comcore: Pseudo-core radius Rcore=  3.839063

atom: _________________________________________________________________________

prinput: Basis input 

PAO.BasisType split     

%block ChemicalSpeciesLabel
    1   26 Fe_nc                   # Species index, atomic number, species label
%endblock ChemicalSpeciesLabel

%block PAO.Basis                 # Define Basis set
# WARNING: This information might be incomplete!
Fe_nc                 2                    # Species label, number of l-shells
 n=4   0   1                         # n, l, Nzeta 
   7.356   
   1.000   
 n=3   2   1                         # n, l, Nzeta 
   4.584   
   1.000   
%endblock PAO.Basis

prinput: ----------------------------------------------------------------------

Dumping basis to NetCDF file Fe_nc.ion.nc
coor:   Atomic-coordinates input format  =     Cartesian coordinates
coor:                                            (in Bohr units)

siesta: Atomic coordinates (Bohr) and species
siesta:      0.00000   0.00000   3.64400  1        1
siesta:      0.00000   0.00000   0.00000  1        2
siesta:      0.00000   0.00000  -3.64400  1        3

siesta: System type = bulk      

initatomlists: Number of atoms, orbitals, and projectors:      3    18    48

siesta: ******************** Simulation parameters ****************************
siesta:
siesta: The following are some of the parameters of the simulation.
siesta: A complete list of the parameters used, including default values,
siesta: can be found in file out.fdf
siesta:
redata: Spin configuration                          = non-collinear
redata: Number of spin components                   = 4
redata: Time-Reversal Symmetry                      = F
redata: Spin spiral                                 = F
redata: Long output                                 =   F
redata: Number of Atomic Species                    =        1
redata: Charge density info will appear in .RHO file
redata: Write Mulliken Pop.                         = Atomic and Orbital charges
redata: Matel table size (NRTAB)                    =     1024
redata: Mesh Cutoff                                 =   150.0000 Ry
redata: Net charge of the system                    =     0.0000 |e|
redata: Min. number of SCF Iter                     =        0
redata: Max. number of SCF Iter                     =       30
redata: SCF mix quantity                            = Hamiltonian
redata: Mix DM or H after convergence               =   F
redata: Recompute H after scf cycle                 =   F
redata: Mix DM in first SCF step                    =   T
redata: Write Pulay info on disk                    =   F
redata: New DM Occupancy tolerance                  = 0.000000000001
redata: No kicks to SCF
redata: DM Mixing Weight for Kicks                  =     0.5000
redata: Require Harris convergence for SCF          =   F
redata: Harris energy tolerance for SCF             =     0.000100 eV
redata: Require DM convergence for SCF              =   T
redata: DM tolerance for SCF                        =     0.000100
redata: Require EDM convergence for SCF             =   F
redata: EDM tolerance for SCF                       =     0.001000 eV
redata: Require H convergence for SCF               =   T
redata: Hamiltonian tolerance for SCF               =     0.001000 eV
redata: Require (free) Energy convergence for SCF   =   F
redata: (free) Energy tolerance for SCF             =     0.000100 eV
redata: Using DFT-D3 dispersion                     =   F
redata: Using Saved Data (generic)                  =   F
redata: Use continuation files for DM               =   F
redata: Neglect nonoverlap interactions             =   F
redata: Method of Calculation                       = Diagonalization
redata: Electronic Temperature                      =   299.9863 K
redata: Fix the spin of the system                  =   F
redata: Max. number of TDED Iter                    =        1
redata: Number of TDED substeps                     =        3
redata: Dynamics option                             = Single-point calculation
mix.SCF: Linear mixing                           = linear-1
mix.SCF:    Mixing weight                        =     0.010000
mix.SCF:    Number of mixing iterations          = 10
mix.SCF:    Following mixer                      = linear-2
mix.SCF: Linear mixing                           = linear-2
mix.SCF:    Mixing weight                        =     0.020000
mix.SCF:    Number of mixing iterations          = 7
mix.SCF:    Following mixer                      = linear-3
mix.SCF: Linear mixing                           = linear-3
mix.SCF:    Mixing weight                        =     0.030000
mix.SCF: Spin-component mixing                   all
redata: Save all siesta data in one NC              =   F
redata: ***********************************************************************

%block SCF.Mixers
  linear-1
  linear-2
  linear-3
%endblock SCF.Mixers

%block SCF.Mixer.linear-1
  # Mixing method
  method linear

  # Mixing options
  weight 0.0100

  # Continuation options
  iterations 10
  next linear-2
%endblock SCF.Mixer.linear-1

%block SCF.Mixer.linear-2
  # Mixing method
  method linear

  # Mixing options
  weight 0.0200

  # Continuation options
  iterations 7
  next linear-3
%endblock SCF.Mixer.linear-2

%block SCF.Mixer.linear-3
  # Mixing method
  method linear

  # Mixing options
  weight 0.0300
%endblock SCF.Mixer.linear-3

DM_history_depth set to one: no extrapolation allowed by default for geometry relaxation
Size of DM history Fstack: 1
Total number of electrons:    24.000000
Total ionic charge:    24.000000

siesta: k-grid: Number of k-points = 1
siesta: k-point is Gamma-only

diag: Algorithm                                     = D&C
diag: Used triangular part                          = Lower
diag: Absolute tolerance                            =  0.100E-15
diag: Orthogonalization factor                      =  0.100E-05
diag: Memory factor                                 =  1.0000


ts: **************************************************************
ts: Save H and S matrices                           =    F
ts: Save DM and EDM matrices                        =    F
ts: Only save the overlap matrix S                  =    F
ts: **************************************************************

************************ Begin: TS CHECKS AND WARNINGS ************************
************************ End: TS CHECKS AND WARNINGS **************************


                     ====================================
                        Single-point calculation
                     ====================================

outcell: Unit cell vectors (Ang):
        6.350127    0.000000    0.000000
        0.000000    6.350127    0.000000
        0.000000    0.000000   10.583544

outcell: Cell vector modules (Ang)   :    6.350127    6.350127   10.583544
outcell: Cell angles (23,13,12) (deg):     90.0000     90.0000     90.0000
outcell: Cell volume (Ang**3)        :    426.7720
Gamma-point calculation with interaction between periodic images
Some features might not work optimally:
e.g. DM initialization from atomic data
<dSpData1D:S at geom step 0
  <sparsity:sparsity for geom step 0
    nrows_g=18 nrows=18 sparsity=1.0000 nnzs=324, refcount: 7>
  <dData1D:(new from dSpData1D) n=324, refcount: 1>
refcount: 1>
new_DM -- step:     1
Initializing Density Matrix...
DM filled with atomic data (user-defined):
<dSpData2D:DM initialized from atoms
  <sparsity:sparsity for geom step 0
    nrows_g=18 nrows=18 sparsity=1.0000 nnzs=324, refcount: 8>
  <dData2D:DM n=324 m=4, refcount: 1>
refcount: 1>
     spin moment: {S} , |S| = {    1.50000    0.00000    0.00000 }     1.50000
No. of atoms with KB's overlaping orbs in proc 0. Max # of overlaps:       3      18

InitMesh: MESH = 48 x 48 x 80 = 184320
InitMesh: Mesh cutoff (required, used) =   150.000   157.914 Ry
New grid distribution [1]: sub = 2

stepf: Fermi-Dirac step function

siesta: Program's energy decomposition (eV):
siesta: Ebs     =       233.382980
siesta: Eions   =      2102.576618
siesta: Ena     =        92.089899
siesta: Ekin    =      2830.136646
siesta: Enl     =     -1830.437030
siesta: Eso     =         0.000000
siesta: Edftu   =         0.000000
siesta: DEna    =      -119.241817
siesta: DUscf   =        55.250614
siesta: DUext   =         0.000000
siesta: Ex      =     -1119.237717
siesta: Ec      =       -98.052084
siesta: Exc     =     -1217.289801
siesta: EbV     =         0.000000
siesta: eta*DQ  =         0.000000
siesta: Emadel  =         0.000000
siesta: Emeta   =         0.000000
siesta: Emolmec =         0.000000
siesta: Ekinion =         0.000000
siesta: Eharris =     -2221.519245
siesta: Etot    =     -2292.068105
siesta: FreeEng =     -2292.162149

        iscf     Eharris(eV)        E_KS(eV)     FreeEng(eV)     dDmax    Ef(eV) dHmax(eV)
   scf:    1    -2221.519245    -2292.068105    -2292.162149  0.995856 -9.385094 33.781828
     spin moment: {S} , |S| = {    1.52849    0.00000   -0.00000 }     1.52849
timer: Routine,Calls,Time,% = IterSCF        1       0.050  17.28
   scf:    2    -2298.521583    -2295.456764    -2295.547618  0.093184 -9.233019 31.112265
     spin moment: {S} , |S| = {    1.40963    0.00000    0.00000 }     1.40963
   scf:    3    -2299.828079    -2297.728682    -2297.819957  0.067497 -9.074944 29.031723
     spin moment: {S} , |S| = {    1.35161    0.00000   -0.00000 }     1.35161
   scf:    4    -2301.233580    -2299.551510    -2299.642531  0.064807 -8.910790 27.124343
     spin moment: {S} , |S| = {    1.28883    0.00000    0.00000 }     1.28883
   scf:    5    -2302.246652    -2300.955216    -2301.043207  0.056771 -8.741980 25.399844
     spin moment: {S} , |S| = {    1.22346    0.00000   -0.00000 }     1.22346
   scf:    6    -2302.921835    -2301.978995    -2302.062687  0.044744 -8.570263 23.903582
     spin moment: {S} , |S| = {    1.16533    0.00000    0.00000 }     1.16533
   scf:    7    -2303.420461    -2302.726671    -2302.806500  0.033427 -8.397173 22.637489
     spin moment: {S} , |S| = {    1.11907    0.00000   -0.00000 }     1.11907
   scf:    8    -2304.049040    -2303.402240    -2303.480845  0.022545 -8.224397 21.612126
     spin moment: {S} , |S| = {    1.09883    0.00000    0.00000 }     1.09883
   scf:    9    -2306.497511    -2304.959492    -2305.043656  0.031775 -8.056803 20.970218
     spin moment: {S} , |S| = {    1.20788    0.00000   -0.00000 }     1.20788
   scf:   10    -2312.140807    -2308.656781    -2308.737605  0.085877 -7.903473 20.509063
     spin moment: {S} , |S| = {    1.59874    0.00000   -0.00000 }     1.59874
mix: switching mixer --> linear-2
   scf:   11    -2314.361138    -2311.551250    -2311.614535  0.053318 -7.759589 19.233960
     spin moment: {S} , |S| = {    1.88567    0.00000    0.00000 }     1.88567
   scf:   12    -2318.257089    -2315.086995    -2315.148056  0.043432 -7.478992 15.747501
     spin moment: {S} , |S| = {    1.86647    0.00000    0.00000 }     1.86647
   scf:   13    -2325.506529    -2320.563079    -2320.592389  0.103891 -7.261547 12.348829
     spin moment: {S} , |S| = {    1.43305    0.00000    0.00000 }     1.43305
   scf:   14    -2321.879162    -2321.247693    -2321.265461  0.016089 -7.055491 10.956258
     spin moment: {S} , |S| = {    1.41617    0.00000    0.00000 }     1.41617
   scf:   15    -2321.379800    -2321.316174    -2321.332766  0.004995 -6.846137 10.823799
     spin moment: {S} , |S| = {    1.42204    0.00000   -0.00000 }     1.42204
   scf:   16    -2321.397550    -2321.356923    -2321.373267  0.004222 -6.640886 10.605658
     spin moment: {S} , |S| = {    1.41669    0.00000    0.00000 }     1.41669
   scf:   17    -2321.423725    -2321.390316    -2321.406545  0.004157 -6.440113 10.377602
     spin moment: {S} , |S| = {    1.40979    0.00000   -0.00000 }     1.40979
mix: switching mixer --> linear-3
   scf:   18    -2321.447932    -2321.419118    -2321.435267  0.004132 -6.243733 10.153324
     spin moment: {S} , |S| = {    1.40317    0.00000    0.00000 }     1.40317
   scf:   19    -2321.494580    -2321.456841    -2321.472902  0.006166 -5.955575  9.825504
     spin moment: {S} , |S| = {    1.39417    0.00000   -0.00000 }     1.39417
   scf:   20    -2321.523268    -2321.490052    -2321.506052  0.006047 -5.676758  9.509442
     spin moment: {S} , |S| = {    1.38622    0.00000    0.00000 }     1.38622
   scf:   21    -2321.550588    -2321.520321    -2321.536288  0.005901 -5.406942  9.204055
     spin moment: {S} , |S| = {    1.37922    0.00000   -0.00000 }     1.37922
   scf:   22    -2321.580693    -2321.550514    -2321.566584  0.005723 -5.145922  8.906733
     spin moment: {S} , |S| = {    1.37312    0.00000    0.00000 }     1.37312
   scf:   23    -2322.355029    -2321.956231    -2321.981403  0.025981 -4.906890  8.306118
     spin moment: {S} , |S| = {    1.38312    0.00000   -0.00000 }     1.38312
   scf:   24    -2328.128638    -2325.703250    -2325.774915  0.274051 -4.743566  6.495054
     spin moment: {S} , |S| = {    1.47411    0.00000    0.00000 }     1.47411
   scf:   25    -2328.301605    -2327.266339    -2327.315725  0.173286 -4.668852  3.229721
     spin moment: {S} , |S| = {    1.49266    0.00000   -0.00000 }     1.49266
   scf:   26    -2327.731591    -2327.537827    -2327.572553  0.046921 -4.635083  1.734012
     spin moment: {S} , |S| = {    1.48360    0.00000    0.00000 }     1.48360
   scf:   27    -2327.692452    -2327.619716    -2327.644683  0.023405 -4.610279  1.385257
     spin moment: {S} , |S| = {    1.45388    0.00000   -0.00000 }     1.45388
   scf:   28    -2327.689531    -2327.656003    -2327.675197  0.012362 -4.592263  1.195871
     spin moment: {S} , |S| = {    1.44013    0.00000    0.00000 }     1.44013
   scf:   29    -2327.695374    -2327.676148    -2327.691380  0.007781 -4.577437  1.061820
     spin moment: {S} , |S| = {    1.42952    0.00000   -0.00000 }     1.42952
   scf:   30    -2327.701201    -2327.688881    -2327.701307  0.005275 -4.564892  0.965570
     spin moment: {S} , |S| = {    1.42271    0.00000    0.00000 }     1.42271
SCF_NOT_CONV: SCF did not converge  in maximum number of steps.
Geom step, scf iteration, dmax:    0    30     0.070968

Using DM_out to compute the final energy and forces
No. of atoms with KB's overlaping orbs in proc 0. Max # of overlaps:       3      18

siesta: E_KS(eV) =            -2327.6889

siesta: E_KS - E_eggbox =     -2327.6889
     spin moment: {S} , |S| = {    1.42271    0.00000    0.00000 }     1.42271

siesta: Atomic forces (eV/Ang):
----------------------------------------
   Tot   -0.000000   -0.000000    0.000000
----------------------------------------
   Max    0.731108
   Res    0.344648    sqrt( Sum f_i^2 / 3N )
----------------------------------------
   Max    0.731108    constrained

Stress tensor Voigt[x,y,z,yz,xz,xy] (kbar):        8.33        8.33      -16.35       -0.00       -0.00        0.00
(Free)E + p*V (eV/cell)    -2327.7288
Target enthalpy (eV/cell)    -2327.7013

mulliken: Atomic and Orbital Populations:

Species: Fe_nc               

Atom      Orb        Charge      Spin       Svec
----------------------------------------------------------------
    1  1 4s         1.45298   0.11058      0.001   0.000   0.111
    1  2 3dxy       1.26168   0.73047      0.049   0.000   0.729
    1  3 3dyz       1.35793   0.51910     -0.005   0.000   0.519
    1  4 3dz2       1.39567   0.46039     -0.004   0.000   0.460
    1  5 3dxz       1.35793   0.51910     -0.005   0.000   0.519
    1  6 3dx2-y2    1.26070   0.73146      0.049   0.000   0.730
    1     Total     8.08689   3.06893      0.086   0.000   3.068

    2  1 4s         1.01843   0.04629      0.046   0.000  -0.000
    2  2 3dxy       1.50378   0.37815      0.378   0.000  -0.000
    2  3 3dyz       1.28414   0.15313      0.153   0.000  -0.000
    2  4 3dz2       1.23156   0.14242      0.142   0.000  -0.000
    2  5 3dxz       1.28414   0.15313      0.153   0.000  -0.000
    2  6 3dx2-y2    1.50416   0.37769      0.378   0.000  -0.000
    2     Total     7.82622   1.25081      1.251   0.000  -0.000

    3  1 4s         1.45298   0.11058      0.001   0.000  -0.111
    3  2 3dxy       1.26168   0.73047      0.049   0.000  -0.729
    3  3 3dyz       1.35793   0.51910     -0.005   0.000  -0.519
    3  4 3dz2       1.39567   0.46039     -0.004   0.000  -0.460
    3  5 3dxz       1.35793   0.51910     -0.005   0.000  -0.519
    3  6 3dx2-y2    1.26070   0.73146      0.049   0.000  -0.730
    3     Total     8.08689   3.06893      0.086   0.000  -3.068

----------------------------------------------------------------
Total              24.00000   1.42271      1.423   0.000   0.000


siesta: Program's energy decomposition (eV):
siesta: Ebs     =      -145.984810
siesta: Eions   =      2102.576618
siesta: Ena     =        92.089899
siesta: Ekin    =      2347.764133
siesta: Enl     =     -1487.731421
siesta: Eso     =         0.000000
siesta: Edftu   =         0.000000
siesta: DEna    =       -35.433399
siesta: DUscf   =         4.353963
siesta: DUext   =         0.000000
siesta: Ex      =     -1051.666524
siesta: Ec      =       -94.488915
siesta: Exc     =     -1146.155439
siesta: EbV     =         0.000000
siesta: eta*DQ  =         0.000000
siesta: Emadel  =         0.000000
siesta: Emeta   =         0.000000
siesta: Emolmec =         0.000000
siesta: Ekinion =         0.000000
siesta: Eharris =     -2327.701201
siesta: Etot    =     -2327.688881
siesta: FreeEng =     -2327.701307

siesta: Final energy (eV):
siesta:  Band Struct. =    -145.984810
siesta:       Kinetic =    2347.764133
siesta:       Hartree =    1401.781971
siesta:         Edftu =       0.000000
siesta:       Eso     =       0.000000
siesta:    Ext. field =       0.000000
siesta:         Exch. =   -1051.666524
siesta:         Corr. =     -94.488915
siesta:     Bulk bias =       0.000000
siesta:   Exch.-corr. =   -1146.155439
siesta:  Ion-electron =   -4739.402697
siesta:       Ion-ion =    -191.676849
siesta:       Ekinion =       0.000000
siesta: D3 dispersion =       0.000000
siesta:         Total =   -2327.688881
siesta:         Fermi =      -4.564892

siesta: Atomic forces (eV/Ang):
siesta:      1    0.000000   -0.000000    0.731108
siesta:      2    0.000000   -0.000000    0.000000
siesta:      3   -0.000000   -0.000000   -0.731108
siesta: ----------------------------------------
siesta:    Tot   -0.000000   -0.000000    0.000000

siesta: Stress tensor (static) (eV/Ang**3):
siesta:     0.005200    0.000000   -0.000000
siesta:     0.000000    0.005200   -0.000000
siesta:    -0.000000   -0.000000   -0.010206

siesta: Cell volume =        426.771969 Ang**3

siesta: Pressure (static):
siesta:                Solid            Molecule  Units
siesta:          -0.00000070         -0.00002469  Ry/Bohr**3
siesta:          -0.00006431         -0.00226660  eV/Ang**3
siesta:          -0.10304030         -3.63149471  kBar
(Free)E+ p_basis*V_orbitals  =       -2326.552225
(Free)Eharris+ p_basis*V_orbitals  =       -2326.564544
     spin moment: {S} , |S| = {    1.42271    0.00000    0.00000 }     1.42271

cite: Please see "linear.bib" for an exhaustive BiBTeX file.
cite: Please clearly indicate Siesta version in published work: 5.0.0-alpha-123-gfb8fd7d02
cite: This calculation has made use of the following articles
cite: which are encouraged to be cited in a published work.
        Primary SIESTA paper
          DOI: www.doi.org/10.1088/0953-8984/14/11/302


timer: Elapsed wall time (sec) =       1.811
timer: CPU execution times (sec):

Routine            Calls   Time/call    Tot.time        %
siesta                 1       1.811       1.811   100.00
Setup                  1       0.034       0.034     1.87
bands                  1       0.000       0.000     0.00
KSV_init               1       0.000       0.000     0.00
IterGeom               1       1.777       1.777    98.10
geom_init              1       0.204       0.204    11.25
state_init             1       0.013       0.013     0.72
hsparse                1       0.000       0.000     0.00
overlap                1       0.013       0.013     0.70
Setup_H0               1       0.143       0.143     7.87
naefs                  2       0.000       0.000     0.01
MolMec                 2       0.000       0.000     0.00
kinefsm                2       0.006       0.012     0.66
nlefsm                 2       0.038       0.077     4.25
DHSCF_Init             1       0.054       0.054     2.98
DHSCF1                 1       0.009       0.009     0.52
INITMESH               1       0.000       0.000     0.00
DHSCF2                 1       0.045       0.045     2.46
REMESH                 1       0.003       0.003     0.17
REORD                276       0.000       0.044     2.44
PHION                  1       0.024       0.024     1.35
COMM_BSC             518       0.000       0.067     3.69
POISON                33       0.005       0.171     9.46
fft                   66       0.002       0.138     7.63
setup_H               31       0.048       1.488    82.16
DHSCF                 32       0.050       1.602    88.48
DHSCF3                32       0.048       1.538    84.91
rhoofd                32       0.005       0.160     8.86
XC                    32       0.027       0.867    47.89
GXC-CellXC            32       0.024       0.774    42.71
gridxc@cellXC         32       0.024       0.773    42.70
vmat                  32       0.005       0.151     8.36
IterSCF               30       0.048       1.452    80.17
compute_dm            30       0.000       0.009     0.48
diagon                30       0.000       0.008     0.47
cdiag                 30       0.000       0.006     0.33
cdiag1                30       0.000       0.000     0.03
cdiag2                30       0.000       0.001     0.04
cdiag3                30       0.000       0.004     0.22
cdiag4                30       0.000       0.000     0.02
MIXER                 30       0.000       0.000     0.01
PostSCF                1       0.121       0.121     6.65
DHSCF4                 1       0.065       0.065     3.56
dfscf                  1       0.047       0.047     2.62
overfsm                1       0.000       0.000     0.01
state_analysis         1       0.000       0.000     0.01
siesta_move            1       0.000       0.000     0.00
Analysis               1       0.000       0.000     0.01
optical                1       0.000       0.000     0.00
  

>> End of run:  28-SEP-2023  15:35:49
Job completed
