[
	{
		"category":"Samsung", 
		"model":"Galaxy S20 Ultra 5G", 
		"imgAdress":"https://fdn2.gsmarena.com/vv/pics/samsung/samsung-galaxy-s20-ultra-11.jpg", 
		"specs":{
				"AVAILABILITY":{"status":"Available", 
								"announced":"11.02.2020.", 
								"released":"06.03.2020."}, 

				"BODY":{
						"dimensions":{
									  "mm":{"height":"166.9", 
											"width":"76", 
											"thickness":"8.8"}, 
									  "in":{"height":"6.57", 
											"width":"2.99", 
											"thickness":"0.35"}
									 }, 
						"weight":{"g":"222", 
								  "oz":"7.83"}, 
						"build":{
								 "front":{"material":"Glass", 
										  "protection":"Gorilla Glass 6"}, 
								 "back":{"material":"Glass", 
										 "protection":"Gorilla Glass 6"}, 
								 "frame":{"material":"Aluminum"}
								}, 
						"protection":{"certificate":"IP68", 
									  "desc":"dust/water resistant (up to 1.5m for 30 mins)"}, 
						"colors":["Cosmic Grey", "Cosmic Black", "Cloud White"]
					   }, 

				"DISPLAY" :{
							"type":"Dynamic AMOLED 2X",
							"size":6.9, 
							"resolution":{"pixels":"1440 x 3200", 
							 			  "ratio":"20:9", 
							 			  "density":"511"},
							"refreshRate":["120Hz@FHD", "60Hz@QHD"],  
							"protection":"Corning Gorilla Glass 6", 
							"features":["HDR10+", "Always-on display"]
						   },

				"SOFTWARE":{
							"OS":{"name":"Android", "version":10.0}, 
							"UI":{"name":"One UI", "version":2}
						   }, 

				"CHIPSET":[
						   {
			   				"name":"Exynos 990", 
			   				"market":"Global", 
							"arhitecture":"7 nm+", 
							"CPU":{"type":"Octa-core", 
							  	   "cores":"(2x2.73 GHz Mongoose M5 & 2x2.50 GHz Cortex-A76 & 4x2.0 GHz Cortex-A55)"}, 
							"GPU":"Mali-G77 MP11"
										 
						   }, 
						   {
							"name":"Qualcomm SM8250 Snapdragon 865", 
							"market":"USA", 
							"arhitecture":"7 nm+", 
							"CPU":{"type":"Octa-core", 
								   "cores":"(1x2.84 GHz Kryo 585 & 3x2.42 GHz Kryo 585 & 4x1.8 GHz Kryo 585)"}, 
							"GPU":"Adreno 650"
						   }
						  ], 

				"MEMORY":{
						  "Card slot":"microSDXC (uses shared SIM slot)", 
						  "variants":[
						  			  {"RAM":12, "Internal storage":128}, 
						  			  {"RAM":12, "Internal storage":256}, 
									  {"RAM":16, "Internal storage":512}
									 ], 
						  "IS type":"UFS 3.0"
						 }, 

				"CAMERAS":{
						   "MAIN":{
						   		   "sensors":[
						   		   			  {
						   		   			   "wide":{"resolution":108, 
													   "specs":"f/1.8, 26mm (wide), 1/1.33\", 0.8µm", 
													   "AF":"PDAF", 
													   "IS":"OIS"}
											  }, 
											  {
											   "telephoto":{"resolution":48, 
															"specs":"f/3.5, 103mm (periscope telephoto), 1/2.0\", 0.8µm", 
															"AF":"PDAF", 
															"IS":"OIS", 
															"opticalZoom":4, 
															"hybridZoom":10}
											  }, 
											  {
											   "ultrawide":{"resolution":12, 
															"specs":"f/2.2, 13mm (ultrawide), 1.4µm, Super Steady video"}
											  }, 
											  {
											   "depth":{"resolution":0.3, 
														"specs":"TOF 3D, f/1.0, (depth)"}
											  } 
											 ], 
								   "features":["LED flash", "auto-HDR", "panorama"], 
								   "video":{
								   			"quality":[
								   					   {"res":4320, "fps":[24]}, 
													   {"res":2160, "fps":[30, 60]}, 
													   {"res":1080, "fps":[30, 60, 240]}, 
													   {"res":720, "fps":[960]}
													  ], 
											"features":["HDR10+", "dual-video rec.", "stereo sound rec.", "gyro-EIS & OIS"]
										   }
								  },

						   "SELFIE":{
						   			 "sensors":[
						   			 			{
						   			 			 "wide":{"resolution":40, 
														 "specs":"f/2.2, 26mm (wide), 0.7µm", 
														 "AF":"PDAF"}
												}
											   ], 
								   	 "features":["Dual video call", "Auto-HDR"], 
								   	 "video":{
								   	 		  "quality":[
								   	 		  			 {"res":2160, "fps":[30, 60]}, 
														 {"res":1080, "fps":[30]}
														]
								   	 		 }
								   	}
						  }, 

				"SOUND":{
						 "loudspeaker":"stereo speakers", 
						 "3.5mm jack":"No",
						 "features":["32-bit/384kHz audio", "Tuned by AKG"]
						}, 

				"NETWORK":{
						   "technologies":["GSM", "CDMA", "HSPA", "EVDO", "LTE", "5G"], 
						   "SIM":[
						   		  {"variant":"Single SIM", 
								   "desc":"Nano-SIM and/or eSIM"}, 
								  {"variant":"Hybrid Dual SIM", 
								   "desc":"Nano-SIM, dual stand-by"}
								 ]
						  },  

				"COMMUNICATIONS":{
								  "WLAN":{
								  		  "Wi-Fi Standards":{"802.11":["a", "b", "g", "n", "ac", "ax"]}, 
										  "features":["dual-band", "Wi-Fi Direct", "hotspot"]
										 }, 
								  "bluetooth":{
								  			   "version":5.0, 
								  			   "features":["A2DP", "LE"]
								  			  }, 
								  "GPS":{
								  		 "supported":"yes", 
								  		 "features":["A-GPS", "GLONASS", "BDS", "GALILEO"]
								  		}, 
								  "NFC":"yes", 
								  "radio":{"supported":"Snapdragon model only; market/operator dependent", 
								  		   "type":"FM radio"}, 
								  "USB":{
								  		 "version":3.2, 
										 "type":{"name":"Type-C", 
										 		 "version":1.0, 
										 		 "desc":"reversible connector"}, 
										 "features":["USB On-The-Go"]
										}
								 }, 

				"FEATURES":{
							"fingerprint":{"type":"ultrasonic", 
										   "position":"under display"}, 
							"sensors":["accelerometer", "gyro", "proximity", "compass", "barometer"], 
							"other":["ANT+", "Bixby natural language commands and dictation", "Samsung DeX (desktop experience support)", "Samsung Pay (Visa, MasterCard certified)"]
						   }, 

				"BATTERY":{
						   "type":"Li-Po", 
						   "capacity":5000, 
						   "removability":"Non-removable", 
						   "charging":[
						   			   {"type":"Fast charging", 
						   				"USB Power Delivery":3.0, 
						   				"power":45}, 
					   				   {"type":"Fast wireless charging", 
						   				"standards":["Qi", "PMA"], 
						   				"power":15},
						   			   {"type":"Power bank/Reverse wireless charging", 
						   				"power":9}
						   			  ]
						  } 
				}
	}, 
	{
		"category":"Samsung", 
		"model":"Galaxy Z Flip", 
		"imgAdress":"https://fdn2.gsmarena.com/vv/pics/samsung/samsung-galaxy-z-flip-10.jpg", 
		"specs":{
				"AVAILABILITY":{"status":"Available", 
								"announced":"11.02.2020.", 
								"released":"14.02.2020."}, 

				"BODY":{
						"dimensions":{
									  "mm":{"height":"Unfolded: 167.3 | Folded: 87.4", 
											"width":"Unfolded: 73.6 | Folded: 73.6", 
											"thickness":"Unfolded: 7.2 | Folded: 17.3"}
									 }, 
						"weight":{"g":"183", 
								  "oz":"6.46"}, 
						"build":{
								 "front":{"material":"Plastic"}, 
								 "back":{"material":"Glass", 
										 "protection":"Gorilla Glass 6"}, 
								 "frame":{"material":"Aluminum"}
								},  
						"colors":["Mirror Black", "Mirror Purple", "Mirror Gold", "Thom Browne Edition"]
					   }, 

				"DISPLAY" :{
							"type":"Foldable Dynamic AMOLED",
							"size":6.7, 
							"resolution":{"pixels":"1080 x 2636",  
							 			  "density":425},  
							"features":["HDR10+"], 
							"coverDisplay":{
											"type":"Super AMOLED",
											"size":1.1, 
											"resolution":{"pixels":"112 x 300"}
										   }
						   },

				"SOFTWARE":{
							"OS":{"name":"Android", "version":10}, 
							"UI":{"name":"One UI", "version":2}
						   }, 

				"CHIPSET":[
						   {
							"name":"Qualcomm SM8150 Snapdragon 855+", 
							"arhitecture":"7 nm", 
							"CPU":{"type":"Octa-core", 
								   "cores":"(1x2.95 GHz Kryo 485 & 3x2.41 GHz Kryo 485 & 4x1.78 GHz Kryo 485)"}, 
							"GPU":"Adreno 640 (700 MHz)"
						   }
						  ], 

				"MEMORY":{
						  "Card slot":"No", 
						  "variants":[
						  			  {"RAM":8, "Internal storage":256}
						  			 ], 
						  "IS type":"UFS 3.0"
						 }, 

				"CAMERAS":{
						   "MAIN":{
						   		   "sensors":[
						   		   			  {
						   		   			   "wide":{"resolution":12, 
													   "specs":"f/1.8, 27mm (wide), 1/2.55\", 1.4µm", 
													   "AF":"Dual Pixel PDAF", 
													   "IS":"OIS"}
											  },  
											  {
											   "ultrawide":{"resolution":12, 
															"specs":"f/2.2, 12mm (ultrawide), 1.12µm"}
											  }
											 ], 
								   "features":["LED flash", "HDR", "panorama"], 
								   "video":{
								   			"quality":[
								   					   {"res":2160, "fps":[30, 60]}, 
													   {"res":1080, "fps":[60, 240]}, 
													   {"res":720, "fps":[960]}
													  ], 
											"features":["HDR10+"]
										   }
								  },

						   "SELFIE":{
						   			 "sensors":[
						   			 			{
						   			 			 "wide":{"resolution":10, 
														 "specs":"f/2.4, 26mm (wide), 1.22µm"}
												}
											   ], 
								   	 "features":["HDR"], 
								   	 "video":{
								   	 		  "quality":[
								   	 		  			 {"res":2160, "fps":[30]}
								   	 		  			]
								   	 		 }
								   	}
						  }, 

				"SOUND":{
						 "loudspeaker":"Yes", 
						 "3.5mm jack":"No",
						 "features":["32-bit/384kHz audio", "Tuned by AKG"]
						}, 

				"NETWORK":{
						   "technologies":["GSM", "HSPA", "LTE"], 
						   "SIM":[
						   		  {"variant":"Nano-SIM"}, 
								  {"variant":"eSIM"}
								 ]
						  },  

				"COMMUNICATIONS":{
								  "WLAN":{
								  		  "Wi-Fi Standards":{"802.11":["a", "b", "g", "n", "ac"]}, 
										  "features":["dual-band", "Wi-Fi Direct", "hotspot"]
										 }, 
								  "bluetooth":{
								  			   "version":5.0, 
								  			   "features":["A2DP", "LE"]
								  			  }, 
								  "GPS":{
								  		 "supported":"yes", 
								  		 "features":["A-GPS", "GLONASS", "GALILEO", "BDS"]
								  		}, 
								  "NFC":"yes",  
								  "USB":{
								  		 "version":3.1, 
										 "type":{"name":"Type-C", 
										 		 "version":1.0, 
										 		 "desc":"reversible connector"}, 
										 "features":["USB On-The-Go"]
										}
								  }, 

				"FEATURES":{
							"fingerprint":{"position":"side-mounted"}, 
							"sensors":["accelerometer", "gyro", "proximity", "compass", "barometer"], 
							"other":["Samsung Pay (Visa, MasterCard certified)"]
						   }, 

				"BATTERY":{
						   "type":"Li-Po", 
						   "capacity":3300, 
						   "removability":"Non-removable", 
						   "charging":[
						   			   {"type":"Fast charging", 
						   				"power":15}, 
					   				   {"type":"Wireless charging"}
					   				  ]
						  } 
				}
	}, 
	{
		"category":"Samsung", 
		"model":"Galaxy Note10+ 5G", 
		"imgAdress":"https://fdn2.gsmarena.com/vv/pics/samsung/samsung-galaxy-note10-plus-aura-glow.jpg", 
		"specs":{
				"AVAILABILITY":{"status":"Available", 
								"announced":"08.2019.", 
								"released":"08.2019."}, 

				"BODY":{
						"dimensions":{
									  "mm":{"height":"162.3", 
											"width":"77.2", 
											"thickness":"7.9"}, 
									  "in":{"height":"6.39", 
											"width":"3.04", 
											"thickness":"0.31"}
									 }, 
						"weight":{"g":"198", 
								  "oz":"6.98"}, 
						"build":{
								 "front":{"material":"Glass", 
										  "protection":"Gorilla Glass 6"}, 
								 "back":{"material":"Glass", 
										 "protection":"Gorilla Glass 6"}, 
								 "frame":{"material":"Aluminum"}
								}, 
						"protection":{"certificate":"IP68", 
									  "desc":"dust/water resistant (up to 1.5m for 30 mins)"}, 
						"colors":["Aura Glow", "Aura White", "Aura Black"]
					   }, 

				"DISPLAY" :{
							"type":"Dynamic AMOLED",
							"size":6.8, 
							"resolution":{"pixels":"1440 x 3040", 
										  "ratio":"19:9", 
							 			  "density":498}, 
							"protection":"Corning Gorilla Glass 6", 
							"features":["HDR10+", "Always-on display"] 
						   },

				"SOFTWARE":{
							"OS":{
								  "name":"Android (Pie)", "version":9.0, 
								  "upgradable":{"name":"Android", "version":10}
								 }, 
							"UI":{"name":"One UI", "version":2}
						   }, 

				"CHIPSET":[
						   {
		   				    "name":"Exynos 9825", 
		   				    "market":"EMEA/LATAM", 
						    "arhitecture":"7 nm", 
						    "CPU":{"type":"Octa-core", 
						  		   "cores":"(2x2.73 GHz Mongoose M4 & 2x2.4 GHz Cortex-A75 & 4x1.9 GHz Cortex-A55)"}, 
						    "GPU":"Mali-G76 MP12"
						   }, 
						   {
							"name":"Qualcomm SM8150 Snapdragon 855", 
							"market":"USA/China", 
							"arhitecture":"7 nm", 
							"CPU":{"type":"Octa-core", 
								   "cores":"(1x2.84 GHz Kryo 485 & 3x2.42 GHz Kryo 485 & 4x1.78 GHz Kryo 485)"}, 
							"GPU":"Adreno 640"
						   }
						  ], 

				"MEMORY":{
						  "Card slot":"microSDXC (dedicated slot)", 
						  "variants":[
						  			  {"RAM":12, "Internal storage":256}, 
						  			  {"RAM":12, "Internal storage":512}
						  			 ], 
						  "IS type":"UFS 3.0"
						 }, 

				"CAMERAS":{
						   "MAIN":{
						   		   "sensors":[
						   		   			  {
						   		   			   "wide":{"resolution":12, 
													   "specs":"f/1.5-2.4, 27mm (wide), 1/2.55\", 1.4µm", 
													   "AF":"Dual Pixel PDAF", 
													   "IS":"OIS"}
											  }, 
											  {
											   "telephoto":{"resolution":12, 
															"specs":"f/2.1, 52mm (telephoto), 1/3.6\", 1.0µm", 
															"AF":"PDAF", 
															"IS":"OIS", 
															"opticalZoom":2} 
											  }, 
											  {
											   "ultrawide":{"resolution":16, 
															"specs":"f/2.2, 12mm (ultrawide), 1/3.1\", 1.0µm, Super Steady video"}
											  }, 
											  {
											   "depth":{"resolution":0.3, 
														"specs":"TOF 3D, (depth)"}
											  } 
											 ], 
								   "features":["LED flash", "auto-HDR", "panorama"], 
								   "video":{
								   			"quality":[
								   					   {"res":2160, "fps":[30, 60]}, 
													   {"res":1080, "fps":[30, 60, 240]}, 
													   {"res":720, "fps":[960]}
													  ], 
											"features":["HDR10+", "dual-video rec.", "stereo sound rec.", "gyro-EIS & OIS"]
										   }
								  },

						   "SELFIE":{
						   			 "sensors":[
						   			 			{
						   			 			 "wide":{"resolution":10, 
														 "specs":"f/2.2, 26mm (wide), 1/3\", 1.22µm", 
														 "AF":"Dual Pixel PDAF"}
												}
											   ], 
								   	 "features":["Dual video call", "Auto-HDR"], 
								   	 "video":{
								   	 		  "quality":[
								   	 		  			 {"res":2160, "fps":[30]}
								   	 		  			]
								   	 		 }
								   	}
						  }, 

				"SOUND":{
						 "loudspeaker":"stereo speakers", 
						 "3.5mm jack":"No",
						 "features":["32-bit/384kHz audio", "Tuned by AKG"]
						}, 

				"NETWORK":{
						   "technologies":["GSM", "CDMA", "HSPA", "EVDO", "LTE", "5G"], 
						   "SIM":[
						   		  {"variant":"Nano-SIM"}
								 ]
						  },  

				"COMMUNICATIONS":{
								  "WLAN":{
								  		  "Wi-Fi Standards":{"802.11":["a", "b", "g", "n", "ac", "ax"]}, 
										  "features":["dual-band", "Wi-Fi Direct", "hotspot"]
										 }, 
								  "bluetooth":{
								  			   "version":5.0, 
								  			   "features":["A2DP", "LE", "aptX"]
								  			  }, 
								  "GPS":{
								  		 "supported":"yes", 
								  		 "features":["A-GPS", "GLONASS", "BDS", "GALILEO"]
								  		}, 
								  "NFC":"yes", 
								  "radio":{"supported":"USA & Canada only", 
										   "type":"FM radio"},  
								  "USB":{
								  		 "version":3.1, 
										 "type":{"name":"Type-C", 
										 		 "version":1.0, 
										 		 "desc":"reversible connector"}
										}
								  }, 

				"FEATURES":{
							"fingerprint":{"type":"ultrasonic", 
										   "position":"under display"}, 
							"sensors":["accelerometer", "gyro", "proximity", "compass", "barometer"], 
							"other":["Stylus (Bluetooth integration, accelerometer, gyro)", "ANT+", "Bixby natural language commands and dictation", "Samsung DeX (desktop experience support)", "Samsung Pay (Visa, MasterCard certified)"]
						   }, 

				"BATTERY":{
						   "type":"Li-Ion", 
						   "capacity":4300, 
						   "removability":"Non-removable", 
						   "charging":[
						   			   {"type":"Fast charging", 
						   				"USB Power Delivery":3.0, 
						   				"power":45}, 
					   				   {"type":"Fast wireless charging", 
						   				"standards":["Qi", "PMA"], 
						   				"power":15},
						   			   {"type":"Power bank/Reverse wireless charging", 
						   				"power":9}
						   			  ]
						  } 
				}
	}, 
	{
		"category":"Apple", 
		"model":"iPhone 11 Pro Max", 
		"imgAdress":"https://fdn2.gsmarena.com/vv/pics/apple/apple-iphone-pro-10.jpg", 
		"specs":{
				"AVAILABILITY":{"status":"Available", 
								"announced":"10.09.2019.", 
								"released":"20.09.2019."}, 

				"BODY":{
						"dimensions":{
									  "mm":{"height":"158", 
											"width":"77.8", 
											"thickness":"8.1"}, 
									  "in":{"height":"6.22", 
											"width":"3.06", 
											"thickness":"0.32"}
									 }, 
						"weight":{"g":"226", 
								  "oz":"7.97"}, 
						"build":{
								 "front":{"material":"Glass", 
										  "protection":"Gorilla Glass"}, 
								 "back":{"material":"Glass", 
										 "protection":"Gorilla Glass"}, 
								 "frame":{"material":"Stainless steel"}
								}, 
						"protection":{"certificate":"IP68", 
									  "desc":"dust/water resistant (up to 4m for 30 mins)"}, 
						"colors":["Space Gray", "Silver", "Gold", "Midnight Green"]
					   }, 

				"DISPLAY" :{
							"type":"Super Retina XDR OLED",
							"size":6.5, 
							"resolution":{"pixels":"1242 x 2688", 
										  "ratio":"19.5:9", 
							 			  "density":458}, 
							"protection":"Scratch-resistant glass, oleophobic coating", 
							"features":["800 nits max brightness (advertised)", "Dolby Vision", "HDR10", "Wide color gamut", "True-tone", "120Hz touch-sensing"] 
						   },

				"SOFTWARE":{
							"OS":{
								  "name":"iOS", "version":13, 
								  "upgradable":{"name":"iOS", "version":13.4}
								 }
						   }, 

				"CHIPSET":[
						   {
	   						"name":"Apple A13 Bionic", 
		   				    "arhitecture":"7 nm+", 
						    "CPU":{"type":"Hexa-core", 
						  		   "cores":"(2x2.65 GHz Lightning + 4x1.8 GHz Thunder)"}, 
						    "GPU":"Apple GPU (4-core graphics)" 
						   }
						  ], 

				"MEMORY":{
						  "Card slot":"No", 
						  "variants":[
						  			  {"RAM":4, "Internal storage":64}, 
						  			  {"RAM":4, "Internal storage":256}, 
						  			  {"RAM":4, "Internal storage":512}
						  			 ], 
						  "IS type":"NVMe"
						 }, 

				"CAMERAS":{
						   "MAIN":{
						   		   "sensors":[
						   		   			  {
						   		   			   "wide":{"resolution":12, 
													   "specs":"f/1.8, 26mm (wide), 1/2.55\", 1.4µm", 
													   "AF":"dual pixel PDAF", 
													   "IS":"OIS"}
											  }, 
											  {
											   "telephoto":{"resolution":12, 
															"specs":"f/2.0, 52mm (telephoto), 1/3.4\", 1.0µm", 
															"AF":"PDAF", 
															"IS":"OIS", 
															"opticalZoom":2} 
											  }, 
											  {
											   "ultrawide":{"resolution":12, 
															"specs":"f/2.4, 13mm (ultrawide)"}
											  } 
											 ], 
								   "features":["Quad-LED dual-tone flash", "HDR (photo/panorama)"], 
								   "video":{
								   			"quality":[
								   					   {"res":2160, "fps":[24, 30, 60]}, 
													   {"res":1080, "fps":[30, 60, 120, 240]}
													  ], 
											"features":["HDR", "stereo sound rec."]
										   }
								  },

						   "SELFIE":{
						   			 "sensors":[
						   			 			{
						   			 			 "wide":{"resolution":12, 
														 "specs":"f/2.2, 23mm (wide)"}
												}, 
												{
												 "depth":{"specs":"SL 3D, (depth/biometrics sensor)"}
												}
											   ], 
								   	 "features":["HDR"], 
								   	 "video":{
								   	 		  "quality":[
								   					     {"res":2160, "fps":[24, 30, 60]}, 
													     {"res":1080, "fps":[30, 60, 120]} 
													    ], 
											  "features":["gyro-EIS"]
								   	 		 }
								   	}
						  }, 

				"SOUND":{
						 "loudspeaker":"stereo speakers", 
						 "3.5mm jack":"No" 
						}, 

				"NETWORK":{
						   "technologies":["GSM", "CDMA", "HSPA", "EVDO", "LTE"], 
						   "SIM":[
						   		  {"variant":"Single SIM", 
								   "desc":"Nano-SIM and/or eSIM"}, 
								  {"variant":"Dual SIM", 
								   "desc":"(Nano-SIM, dual stand-by) - for China"}
								 ]
						  },  

				"COMMUNICATIONS":{
								  "WLAN":{
								  		  "Wi-Fi Standards":{"802.11":["a", "b", "g", "n", "ac", "ax"]}, 
										  "features":["dual-band", "hotspot"]
										 }, 
								  "bluetooth":{
								  			   "version":5.0, 
								  			   "features":["A2DP", "LE"]
								  			  }, 
								  "GPS":{
								  		 "supported":"yes", 
								  		 "features":["A-GPS", "GLONASS", "GALILEO", "QZSS"]
								  		}, 
								  "NFC":"yes", 
								  "radio":{"supported":"No"},  
								  "USB":{
								  		 "version":2.0, 
										 "type":{"desc":"proprietary reversible connector"}
										}
								  }, 

				"FEATURES":{
							"fingerprint":"No", 
							"sensors":["Face ID", "accelerometer", "gyro", "proximity", "compass", "barometer"], 
							"other":["Siri natural language commands and dictation", "Apple Pay (Visa, MasterCard, AMEX certified)"]
						   }, 

				"BATTERY":{
						   "type":"Li-Ion", 
						   "capacity":3969, 
						   "removability":"Non-removable", 
						   "charging":[
						   			   {"type":"Fast charging", 
						   				"USB Power Delivery":2.0, 
						   				"power":18, 
						   				"desc":"50% in 30 min (advertised)"}, 
					   				   {"type":"Wireless charging", 
						   				"standards":["Qi"]}
						   			  ]
						  } 
				}
	}, 
	{
		"category":"Apple", 
		"model":"iPhone 11", 
		"imgAdress":"https://fdn2.gsmarena.com/vv/pics/apple/apple-iphone-11-2.jpg", 
		"specs":{
				"AVAILABILITY":{"status":"Available", 
								"announced":"10.09.2019.", 
								"released":"20.09.2019."}, 

				"BODY":{
						"dimensions":{
									  "mm":{"height":"150.9", 
											"width":"75.7", 
											"thickness":"8.3"}, 
									  "in":{"height":"5.94", 
											"width":"2.98", 
											"thickness":"0.33"}
									 }, 
						"weight":{"g":"194", 
								  "oz":"6.84"}, 
						"build":{
								 "front":{"material":"Glass", 
										  "protection":"Gorilla Glass"}, 
								 "back":{"material":"Glass", 
										 "protection":"Gorilla Glass"}, 
								 "frame":{"material":"Aluminum (7000 series)"}
								}, 
						"protection":{"certificate":"IP68", 
									  "desc":"dust/water resistant (up to 2m for 30 mins)"}, 
						"colors":["Black", "Green", "Yellow", "Purple", "Red", "White"]
					   }, 

				"DISPLAY" :{
							"type":"Liquid Retina IPS LCD",
							"size":6.1, 
							"resolution":{"pixels":"828 x 1792", 
										  "ratio":"19.5:9", 
							 			  "density":326}, 
							"protection":"Scratch-resistant glass, oleophobic coating", 
							"features":["625 nits max brightness (advertised)", "True-tone", "Wide color gamut", "120Hz touch-sensing"] 
						   },

				"SOFTWARE":{
							"OS":{
								  "name":"iOS", "version":13, 
								  "upgradable":{"name":"iOS", "version":13.4}
								 }
						   }, 

				"CHIPSET":[
						   {
	   						"name":"Apple A13 Bionic", 
		   				    "arhitecture":"7 nm+", 
						    "CPU":{"type":"Hexa-core", 
						  		   "cores":"(2x2.65 GHz Lightning + 4x1.8 GHz Thunder)"}, 
						    "GPU":"Apple GPU (4-core graphics)"
						   }
						  ], 

				"MEMORY":{
						  "Card slot":"No", 
						  "variants":[
						  			  {"RAM":4, "Internal storage":64},  
						  			  {"RAM":4, "Internal storage":128}, 
						  			  {"RAM":4, "Internal storage":256}
						  			 ], 
						  "IS type":"NVMe"
						 }, 

				"CAMERAS":{
						   "MAIN":{
						   		   "sensors":[
						   		   			  {
						   		   			   "wide":{"resolution":12, 
													   "specs":"f/1.8, 26mm (wide), 1/2.55\", 1.4µm", 
													   "AF":"dual pixel PDAF", 
													   "IS":"OIS"}
											  }, 
											  {
											   "ultrawide":{"resolution":12, 
															"specs":"f/2.4, 13mm (ultrawide)"}
											  } 
											 ], 
								   "features":["Quad-LED dual-tone flash", "HDR (photo/panorama)"], 
								   "video":{
								   			"quality":[
								   					   {"res":2160, "fps":[24, 30, 60]}, 
													   {"res":1080, "fps":[30, 60, 120, 240]}
													  ], 
											"features":["HDR", "stereo sound rec."]
										   }
								  },

						   "SELFIE":{
						   			 "sensors":[
						   			 			{
						   			 			 "wide":{"resolution":12, 
														 "specs":"f/2.2, 23mm (wide)"}
												}, 
												{
												 "depth":{"specs":"SL 3D, (depth/biometrics sensor)"}
												}
											   ], 
								   	 "features":["HDR"], 
								   	 "video":{
								   	 		  "quality":[
								   					     {"res":2160, "fps":[24, 30, 60]}, 
													     {"res":1080, "fps":[30, 60, 120]} 
													    ], 
											  "features":["gyro-EIS"]
								   	 		 }
								   	}
						  }, 

				"SOUND":{
						 "loudspeaker":"stereo speakers", 
						 "3.5mm jack":"No" 
						}, 

				"NETWORK":{
						   "technologies":["GSM", "CDMA", "HSPA", "EVDO", "LTE"], 
						   "SIM":[
						   		  {"variant":"Single SIM", 
								   "desc":"Nano-SIM and/or eSIM"}, 
								  {"variant":"Dual SIM", 
								   "desc":"(Nano-SIM, dual stand-by) - for China"}
								 ]
						  },  

				"COMMUNICATIONS":{
								  "WLAN":{
								  		  "Wi-Fi Standards":{"802.11":["a", "b", "g", "n", "ac", "ax"]}, 
										  "features":["dual-band", "hotspot"]
										 }, 
								  "bluetooth":{
								  			   "version":5.0, 
								  			   "features":["A2DP", "LE"]
								  			  }, 
								  "GPS":{
								  		 "supported":"yes", 
								  		 "features":["A-GPS", "GLONASS", "GALILEO", "QZSS"]
								  		}, 
								  "NFC":"yes", 
								  "radio":{"supported":"No"},  
								  "USB":{
								  		 "version":2.0, 
										 "type":{"desc":"proprietary reversible connector"}
										}
								  }, 

				"FEATURES":{
							"fingerprint":"No", 
							"sensors":["Face ID", "accelerometer", "gyro", "proximity", "compass", "barometer"], 
							"other":["Siri natural language commands and dictation", "Apple Pay (Visa, MasterCard, AMEX certified)"]
						   }, 

				"BATTERY":{
						   "type":"Li-Ion", 
						   "capacity":3110, 
						   "removability":"Non-removable", 
						   "charging":[
						   			   {"type":"Fast charging", 
						   				"USB Power Delivery":2.0, 
						   				"power":18, 
						   				"desc":"50% in 30 min (advertised)"}, 
					   				   {"type":"Wireless charging", 
						   				"standards":["Qi"]}
						   			  ]
						  } 
				}
	}, 
	{
		"category":"Apple", 
		"model":"iPhone SE (2020)", 
		"imgAdress":"https://fdn2.gsmarena.com/vv/pics/apple/apple-iphone-se-2020-1.jpg", 
		"specs":{
				"AVAILABILITY":{"status":"Available", 
								"announced":"15.04.2020.", 
								"released":"24.04.2020."}, 

				"BODY":{
						"dimensions":{
									  "mm":{"height":"138.4", 
											"width":"67.3", 
											"thickness":"7.3"}, 
									  "in":{"height":"5.45", 
											"width":"2.65", 
											"thickness":"0.29"}
									 }, 
						"weight":{"g":"148", 
								  "oz":"5.22"}, 
						"build":{
								 "front":{"material":"Glass"}, 
								 "back":{"material":"Glass"}, 
								 "frame":{"material":"Aluminum"}
								}, 
						"protection":{"certificate":"IP67", 
									  "desc":"dust/water resistant (up to 1m for 30 mins)"}, 
						"colors":["Black", "White", "Red"]
					   }, 

				"DISPLAY" :{
							"type":"Retina IPS LCD",
							"size":4.7, 
							"resolution":{"pixels":"750 x 1334", 
										  "ratio":"16:9", 
							 			  "density":326}, 
							"protection":"Ion-strengthened glass, oleophobic coating", 
							"features":["Wide color gamut", "True-tone", "625 nits max brightness (advertised)"] 
						   },

				"SOFTWARE":{
							"OS":{
								  "name":"iOS", "version":13
								 }
						   }, 

				"CHIPSET":[
						   {
	   						"name":"Apple A13 Bionic",
		   				    "arhitecture":"7 nm+", 
						    "CPU":{"type":"Hexa-core", 
						  		   "cores":"(2x2.65 GHz Lightning + 4x1.8 GHz Thunder)"}, 
						    "GPU":"Apple GPU (4-core graphics)"
						   }
						  ], 

				"MEMORY":{
						  "Card slot":"No", 
						  "variants":[
						  			  {"RAM":3, "Internal storage":64},  
						  			  {"RAM":3, "Internal storage":128}, 
						  			  {"RAM":3, "Internal storage":256}
						  			 ], 
						  "IS type":"NVMe"
						 }, 

				"CAMERAS":{
						   "MAIN":{
						   		   "sensors":[
						   		   			  {
						   		   			   "wide":{"resolution":12, 
													   "specs":"f/1.8 (wide)", 
													   "AF":"PDAF", 
													   "IS":"OIS"}
											  } 
											 ], 
								   "features":["Quad-LED dual-tone flash", "HDR", "panorama"], 
								   "video":{
								   			"quality":[
								   					   {"res":2160, "fps":[24, 30, 60]}, 
													   {"res":1080, "fps":[30, 60, 120, 240]}
													  ], 
											"features":["HDR", "OIS", "stereo sound rec."]
										   }
								  },

						   "SELFIE":{
						   			 "sensors":[
						   			 			{
						   			 			 "wide":{"resolution":7, 
														 "specs":"f/2.2"}
												}
											   ], 
								   	 "features":["Face detection", "HDR", "panorama"], 
								   	 "video":{
								   	 		  "quality":[
								   					     {"res":1080, "fps":[30]} 
													    ], 
											  "features":["gyro-EIS"]
								   	 		 }
								   	}
						  }, 

				"SOUND":{
						 "loudspeaker":"stereo speakers", 
						 "3.5mm jack":"No" 
						}, 

				"NETWORK":{
						   "technologies":["GSM", "CDMA", "HSPA", "EVDO", "LTE"], 
						   "SIM":[
						   		  {"desc":"Nano-SIM and/or eSIM"}
								 ]
						  },  

				"COMMUNICATIONS":{
								  "WLAN":{
								  		  "Wi-Fi Standards":{"802.11":["a", "b", "g", "n", "ac", "ax"]}, 
										  "features":["dual-band", "hotspot"]
										 }, 
								  "bluetooth":{
								  			   "version":5.0, 
								  			   "features":["A2DP", "LE"]
								  			  }, 
								  "GPS":{
								  		 "supported":"yes", 
								  		 "features":["A-GPS", "GLONASS"]
								  		}, 
								  "NFC":"yes", 
								  "radio":{"supported":"No"},  
								  "USB":{
								  		 "version":2.0, 
										 "type":{"desc":"proprietary reversible connector"}
										}
								  }, 

				"FEATURES":{
							"fingerprint":{"position":"front-mounted"}, 
							"sensors":["accelerometer", "proximity", "gyro", "compass", "barometer"], 
							"other":["Siri natural language commands and dictation", "Apple Pay (Visa, MasterCard, AMEX certified)"]
						   }, 

				"BATTERY":{
						   "type":"Li-Ion", 
						   "capacity":1821, 
						   "removability":"Non-removable", 
						   "charging":[
						   			   {"type":"Fast charging", 
						   				"power":18, 
						   				"desc":"50% in 30 min (advertised)"}, 
					   				   {"type":"Wireless charging", 
						   				"standards":["Qi"]}
						   			  ]
						  } 
				}
	}, 
	{
		"category":"Huawei", 
		"model":"P40 Pro+", 
		"imgAdress":"https://fdn2.gsmarena.com/vv/pics/huawei/huawei-p40-pro-plus-2.jpg", 
		"specs":{
				"AVAILABILITY":{"status":"Coming soon", 
								"announced":"26.03.2020.", 
								"released":"06.2020."}, 

				"BODY":{
						"dimensions":{
									  "mm":{"height":"158.2", 
											"width":"72.6", 
											"thickness":"9"}, 
									  "in":{"height":"6.23", 
											"width":"2.86", 
											"thickness":"0.35"}
									 }, 
						"weight":{"g":"226", 
								  "oz":"7.97"}, 
						"build":{
								 "front":{"material":"Glass"}, 
								 "back":{"material":"Cerramic"}, 
								 "frame":{"material":"Cerramic"}
								}, 
						"protection":{"certificate":"IP68", 
									  "desc":"dust/water resistant (up to 1.5m for 30 mins)"}, 
						"colors":["White Ceramic", "Black Ceramic"]
					   }, 

				"DISPLAY" :{
							"type":"OLED",
							"size":6.58, 
							"resolution":{"pixels":"1200 x 2640", 
							 			  "density":"441"},
							"refreshRate":["90Hz"],  
							"features":["HDR10"]
						   },

				"SOFTWARE":{
							"OS":{"name":"Android", "version":10, 
								  "desc":"(no Google Play Services)"}, 
							"UI":{"name":"EMUI", "version":10.1}
						   }, 

				"CHIPSET":[
						   {
		   					"name":"Kirin 990 5G", 
		   					"arhitecture":"7 nm+", 
							"CPU":{"type":"Octa-core", 
						  		   "cores":"(2x2.86 GHz Cortex-A76 & 2x2.36 GHz Cortex-A76 & 4x1.95 GHz Cortex-A55)"}, 
							"GPU":"Mali-G76 MP16"
										 
						   }
						  ], 

				"MEMORY":{
						  "Card slot":"NM (Nano Memory), up to 256GB (uses shared SIM slot)", 
						  "variants":[
						  			  {"RAM":8, "Internal storage":256}, 
									  {"RAM":8, "Internal storage":512}
									 ], 
						  "IS type":"UFS 3.0"
						 }, 

				"CAMERAS":{
						   "MAIN":{
						   		   "sensors":[
						   		   			  {
						   		   			   "wide":{"resolution":50, 
													   "specs":"f/1.9, 23mm (wide), 1/1.28\", 2.44µm", 
													   "AF":"omnidirectional PDAF", 
													   "IS":"OIS"}
											  }, 
											  {
											   "telephoto":{"resolution":8, 
															"specs":"f/4.4, 240mm (periscope telephoto)", 
															"AF":"PDAF", 
															"IS":"OIS", 
															"opticalZoom":10}
											  },
											  {
											   "telephoto":{"resolution":8, 
															"specs":"f/2.4, 80mm (telephoto)", 
															"AF":"PDAF", 
															"IS":"OIS", 
															"opticalZoom":3}
											  }, 
											  {
											   "ultrawide":{"resolution":40, 
															"specs":"f/1.8, 18mm (ultrawide), 1/1.54\"", 
															"AF":"PDAF"}
											  }, 
											  {
											   "depth":{"specs":"TOF 3D, (depth)"}
											  } 
											 ], 
								   "features":["Leica optics", "LED flash", "panorama", "HDR"], 
								   "video":{
								   			"quality":[
								   					   {"res":2160, "fps":[30, 60]}, 
													   {"res":1080, "fps":[30, 60, 960]}, 
													   {"res":720, "fps":[7680]}
													  ], 
											"features":["HDR", "gyro-EIS"]
										   }
								  },

						   "SELFIE":{
						   			 "sensors":[
						   			 			{
						   			 			 "wide":{"resolution":32, 
														 "specs":"f/2.2, 26mm (wide), 1/2.8\", 0.8µm", 
														 "AF":"AF"}
												}, 
												{
												 "depth":{"specs":"IR TOF 3D, (depth/biometrics sensor)"}
												}
											   ], 
								   	 "features":["HDR"], 
								   	 "video":{
								   	 		  "quality":[
								   	 		  			 {"res":2160, "fps":[30, 60]}, 
														 {"res":1080, "fps":[30, 60]}
														]
								   	 		 }
								   	}
						  }, 

				"SOUND":{
						 "loudspeaker":"Yes", 
						 "3.5mm jack":"No",
						 "features":["32-bit/384kHz audio"]
						}, 

				"NETWORK":{
						   "technologies":["GSM", "HSPA", "LTE", "5G"], 
						   "SIM":[
						   		  {"variant":"Single SIM", 
								   "desc":"Nano-SIM/eSIMs"}, 
								  {"variant":"Hybrid Dual SIM", 
								   "desc":"Nano-SIM, dual stand-by"}
								 ]
						  },  

				"COMMUNICATIONS":{
								  "WLAN":{
								  		  "Wi-Fi Standards":{"802.11":["a", "b", "g", "n", "ac", "ax"]}, 
										  "features":["dual-band", "Wi-Fi Direct", "hotspot"]
										 }, 
								  "bluetooth":{
								  			   "version":5.1, 
								  			   "features":["A2DP", "LE"]
								  			  }, 
								  "GPS":{
								  		 "supported":"yes", 
								  		 "features":["A-GPS", "GLONASS", "BDS", "GALILEO", "QZSS", "NavIC"]
								  		}, 
								  "NFC":"yes",
								  "Infrared port":"Yes", 
								  "radio":{"supported":"No"}, 
								  "USB":{
								  		 "version":3.1, 
										 "type":{"name":"Type-C", 
										 		 "version":1.0, 
										 		 "desc":"reversible connector"}, 
										 "features":["USB On-The-Go"]
										}
								 }, 

				"FEATURES":{
							"fingerprint":{"type":"optical", 
										   "position":"under display"}, 
							"sensors":["Infrared face recognition", "accelerometer", "gyro", "proximity", "compass", "color spectrum"]
						   }, 

				"BATTERY":{
						   "type":"Li-Po", 
						   "capacity":4200, 
						   "removability":"Non-removable", 
						   "charging":[
						   			   {"type":"Fast charging",  
						   				"power":40}, 
					   				   {"type":"Fast wireless charging",  
						   				"power":40},
						   			   {"type":"Fast reverse wireless charging", 
						   				"power":27}
						   			  ]
						  } 
				}
	}, 
	{
		"category":"Huawei", 
		"model":"Mate 30 Pro 5G", 
		"imgAdress":"https://fdn2.gsmarena.com/vv/pics/huawei/huawei-mate30-pro-1.jpg", 
		"specs":{
				"AVAILABILITY":{"status":"Available", 
								"announced":"19.09.2019.", 
								"released":"23.10.2019."}, 

				"BODY":{
						"dimensions":{
									  "mm":{"height":"158.1", 
											"width":"73.1", 
											"thickness":"8.8"}, 
									  "in":{"height":"6.22", 
											"width":"2.88", 
											"thickness":"0.35"}
									 }, 
						"weight":{"g":"198", 
								  "oz":"6.98"}, 
						"build":{
								 "front":{"material":"Glass", 
										  "protection":"Gorilla Glass 6"}, 
								 "back":{"material":"Glass", 
										 "protection":"Gorilla Glass 6"}, 
								 "frame":{"material":"Aluminum"}
								}, 
						"protection":{"certificate":"IP68", 
									  "desc":"dust/water resistant (up to 2m for 30 mins)"}, 
						"colors":["Black", "Space Silver", "Cosmic Purple", "Emerald Green", "Orange", "Forest Green"]
					   }, 

				"DISPLAY" :{
							"type":"OLED",
							"size":6.53, 
							"resolution":{"pixels":"1176 x 2400", 
										  "ratio":"18.5:9", 
							 			  "density":"409"},  
							"protection":"Corning Gorilla Glass 6",  
							"features":["HDR10"]
						   },

				"SOFTWARE":{
							"OS":{"name":"Android", "version":10}, 
							"UI":{"name":"EMUI", "version":10}
						   }, 

				"CHIPSET":[
						   {
		   					"name":"Kirin 990 5G", 
		   					"arhitecture":"7 nm+", 
							"CPU":{"type":"Octa-core", 
						  		   "cores":"(2x2.86 GHz Cortex-A76 & 2x2.36 GHz Cortex-A76 & 4x1.95 GHz Cortex-A55)"}, 
							"GPU":"Mali-G76 MP16"
										 
						   }
						  ], 

				"MEMORY":{
						  "Card slot":"NM (Nano Memory), up to 256GB (uses shared SIM slot)", 
						  "variants":[
						  			  {"RAM":8, "Internal storage":128}, 
						  			  {"RAM":8, "Internal storage":256}, 
									  {"RAM":8, "Internal storage":512}
									 ], 
						  "IS type":"UFS 3.0"
						 }, 

				"CAMERAS":{
						   "MAIN":{
						   		   "sensors":[
						   		   			  {
						   		   			   "wide":{"resolution":40, 
													   "specs":"f/1.6, 27mm (wide), 1/1.7\"", 
													   "AF":"PDAF", 
													   "IS":"OIS"}
											  },
											  {
											   "telephoto":{"resolution":8, 
															"specs":"f/2.4, 80mm (telephoto), 1/4.0\"", 
															"AF":"PDAF", 
															"IS":"OIS", 
															"opticalZoom":3}
											  }, 
											  {
											   "ultrawide":{"resolution":40, 
															"specs":"f/1.8, 18mm (ultrawide), 1/1.54\"", 
															"AF":"PDAF"}
											  }, 
											  {
											   "depth":{"specs":"TOF 3D, (depth)"}
											  } 
											 ], 
								   "features":["Leica optics", "dual-LED dual-tone flash", "panorama", "HDR"], 
								   "video":{
								   			"quality":[
								   					   {"res":2160, "fps":[30, 60]}, 
													   {"res":1080, "fps":[30, 60, 120, 960]}, 
													   {"res":720, "fps":[7680]}
													  ], 
											"features":["gyro-EIS"]
										   }
								  },

						   "SELFIE":{
						   			 "sensors":[
						   			 			{
						   			 			 "wide":{"resolution":32, 
														 "specs":"f/2.0, 26mm (wide), 1/2.8\", 0.8µm"}
												}, 
												{
												 "depth":{"specs":"TOF 3D, (depth/biometrics sensor)"}
												}
											   ], 
								   	 "features":["HDR", "panorama"], 
								   	 "video":{
								   	 		  "quality":[
								   	 		  			 {"res":1080, "fps":[30]}
														]
								   	 		 }
								   	}
						  }, 

				"SOUND":{
						 "loudspeaker":"Yes", 
						 "3.5mm jack":"No",
						 "features":["32-bit/384kHz audio"]
						}, 

				"NETWORK":{
						   "technologies":["GSM", "HSPA", "LTE", "5G"], 
						   "SIM":[
						   		  {"variant":"Hybrid Dual SIM", 
								   "desc":"Nano-SIM, dual stand-by"}
								 ]
						  },  

				"COMMUNICATIONS":{
								  "WLAN":{
								  		  "Wi-Fi Standards":{"802.11":["a", "b", "g", "n", "ac"]}, 
										  "features":["dual-band", "DLNA", "Wi-Fi Direct", "hotspot"]
										 }, 
								  "bluetooth":{
								  			   "version":5.1, 
								  			   "features":["A2DP", "aptX HD", "LE"]
								  			  }, 
								  "GPS":{
								  		 "supported":"yes", 
								  		 "features":["dual-band A-GPS", "GLONASS", "BDS", "GALILEO", "QZSS"]
								  		}, 
								  "NFC":"yes",
								  "Infrared port":"Yes", 
								  "radio":{"supported":"No"}, 
								  "USB":{
								  		 "version":3.1, 
										 "type":{"name":"Type-C", 
										 		 "version":1.0, 
										 		 "desc":"reversible connector"}, 
										 "features":["USB On-The-Go"]
										}
								 }, 

				"FEATURES":{
							"fingerprint":{"type":"optical", 
										   "position":"under display"}, 
							"sensors":["Face ID", "accelerometer", "gyro", "proximity", "barometer", "compass"]
						   }, 

				"BATTERY":{
						   "type":"Li-Po", 
						   "capacity":4500, 
						   "removability":"Non-removable", 
						   "charging":[
						   			   {"type":"Fast charging",  
						   				"power":40}, 
					   				   {"type":"Fast wireless charging",  
						   				"power":40},
						   			   {"type":"Power bank/Reverse wireless charging"}
						   			  ]
						  } 
				}
	}, 
	{
		"category":"Huawei", 
		"model":"Mate Xs", 
		"imgAdress":"https://fdn2.gsmarena.com/vv/pics/huawei/huawei-mate-xs.jpg", 
		"specs":{
				"AVAILABILITY":{"status":"Coming soon", 
								"announced":"24.02.2020.", 
								"released":"05.03.2020."}, 

				"BODY":{
						"dimensions":{
									  "mm":{"height":"Unfolded: 161.3 | Folded: 161.3", 
											"width":"Unfolded: 146.2 | Folded: 78.5", 
											"thickness":"Unfolded: 5.4 | Folded: 11"}
									 }, 
						"weight":{"g":"300", 
								  "oz":"10.58"}, 
						"build":{
								 "front":{"material":"Plastic"}, 
								 "back":{"material":"Aluminum"}, 
								 "frame":{"material":"Aluminum"}
								},  
						"colors":["Interstellar Blue"]
					   }, 

				"DISPLAY" :{
							"type":"Foldable OLED",
							"size":8.0, 
							"resolution":{"pixels":"2200 x 2480",  
							 			  "density":"414"},  
							"protection":"Corning Gorilla Glass 6",  
							"features":["HDR10"], 
							"coverDisplay":{
											"type":"AMOLED",
											"size":6.6, 
											"resolution":{"pixels":"1148 x 2480", 
														  "ratio":"19.5:9"}
										   }
						   },

				"SOFTWARE":{
							"OS":{"name":"Android", "version":10, 
								  "desc":"(no Google Play Services)"}, 
							"UI":{"name":"EMUI", "version":10}
						   }, 

				"CHIPSET":[
						   {
		   					"name":"Kirin 990 5G", 
		   					"arhitecture":"7 nm+", 
							"CPU":{"type":"Octa-core", 
						  		   "cores":"(2x2.86 GHz Cortex-A76 & 2x2.36 GHz Cortex-A76 & 4x1.95 GHz Cortex-A55)"}, 
							"GPU":"Mali-G76 MP16"
						   }
						  ], 

				"MEMORY":{
						  "Card slot":"NM (Nano Memory), up to 256GB (uses shared SIM slot)", 
						  "variants":[
						  			  {"RAM":8, "Internal storage":512}
									 ], 
						  "IS type":"UFS 2.1"
						 }, 

				"CAMERAS":{
						   "MAIN":{
						   		   "sensors":[
						   		   			  {
						   		   			   "wide":{"resolution":40, 
													   "specs":"f/1.8, 27mm (wide), 1/1.7\"", 
													   "AF":"PDAF"}
											  },
											  {
											   "telephoto":{"resolution":8, 
															"specs":"f/2.4, 81mm (telephoto)", 
															"AF":"PDAF", 
															"IS":"OIS", 
															"opticalZoom":3, 
															"hybridZoom":10}
											  }, 
											  {
											   "ultrawide":{"resolution":16, 
															"specs":"f/2.2, 17mm (ultrawide)", 
															"AF":"AF"}
											  }, 
											  {
											   "depth":{"specs":"TOF 3D, (depth)"}
											  } 
											 ], 
								   "features":["Leica optics", "dual-LED dual-tone flash", "panorama", "HDR"], 
								   "video":{
								   			"quality":[
								   					   {"res":2160, "fps":[30]}, 
													   {"res":1080, "fps":[30]}
													  ]
										   }
								  },

						   "SELFIE":{
						   			 "sensors":[
						   			 			{
						   			 			 "wide":{"desc":"No - uses main camera"}
												}
											   ], 
								   	 "features":["HDR"], 
								   	 "video":{
								   	 		  "quality":[
								   	 		  			 {"res":1080, "fps":[30]}
														]
								   	 		 }
								   	}
						  }, 

				"SOUND":{
						 "loudspeaker":"Yes", 
						 "3.5mm jack":"No"
						}, 

				"NETWORK":{
						   "technologies":["GSM", "HSPA", "LTE", "5G"], 
						   "SIM":[
						   		  {"variant":"Hybrid Dual SIM", 
								   "desc":"Nano-SIM, dual stand-by"}
								 ]
						  },  

				"COMMUNICATIONS":{
								  "WLAN":{
								  		  "Wi-Fi Standards":{"802.11":["a", "b", "g", "n", "ac"]}, 
										  "features":["dual-band", "Wi-Fi Direct", "hotspot"]
										 }, 
								  "bluetooth":{
								  			   "version":5.0, 
								  			   "features":["A2DP", "LE"]
								  			  }, 
								  "GPS":{
								  		 "supported":"yes", 
								  		 "features":["dual-band A-GPS", "GLONASS", "BDS", "GALILEO", "QZSS"]
								  		}, 
								  "NFC":"yes",
								  "Infrared port":"Yes", 
								  "radio":{"supported":"No"}, 
								  "USB":{
								  		 "version":3.1, 
										 "type":{"name":"Type-C", 
										 		 "version":1.0, 
										 		 "desc":"reversible connector"}
										}
								 }, 

				"FEATURES":{
							"fingerprint":{"position":"side-mounted"}, 
							"sensors":["accelerometer", "gyro", "proximity", "compass", "barometer"]
						   }, 

				"BATTERY":{
						   "type":"Li-Po", 
						   "capacity":4500, 
						   "removability":"Non-removable", 
						   "charging":[
						   			   {"type":"Fast charging",  
						   				"power":55, 
						   				"desc":"Huawei SuperCharge - 85% in 30 min (advertised)"}
						   			  ]
						  } 
				}
	}
]