1 1 1
1 10 20
100 200 125
201 210 89
900 1000 174
34 21788 279
95619 119148 354
27826 55522 340
57185 111117 354
4931 97586 351
68371 147945 375
9621 17114 276
4929 81482 351
142928 163500 383
72475 73794 294
9163 74208 340
70946 74887 325
89675 109608 354
91533 168059 383
59050 88066 351
28208 47426 324
75825 101287 351
1741 85835 351
80948 170180 383
3648 68604 340
23975 24491 251
6957 79010 351
130124 133309 331
14410 40392 324
91027 167663 383
38451 102992 351
56851 127577 354
225 95365 351
4258 50935 324
42503 83991 351
40841 79172 351
3419 56604 340
6147 13786 276
11835 95153 351
17147 81218 351
135392 211255 383
10379 27639 308
26122 124759 354
10685 13735 276
14216 87405 351
179364 223466 386
85183 119496 354
98298 191417 383
50845 84759 351
54445 56243 322
5649 66282 340
152514 196469 383
39603 120538 354
9106 30228 308
74888 162475 383
23488 43848 324
12250 64199 340
82776 111707 354
789 97629 351
117031 166604 383
25799 65639 340
84583 123539 354
101250 111917 354
56346 67873 335
3199 88303 351
23099 39172 324
11431 22494 279
77306 175429 383
8597 32355 308
24301 100686 351
150865 231600 443
49353 83086 351
128875 197245 383
209 20736 279
31069 88914 351
10672 15382 276
12895 62448 340
14853 74080 340
7711 48573 324
54493 88343 351
40858 45500 314
69081 135069 354
153496 203562 383
40460 136556 354
6856 100340 351
17737 22353 274
126319 207229 383
4035 5991 236
2572 32870 308
140566 163934 383
808 59599 340
14671 107899 354
11813 69170 340
106 59669 340
107361 158682 383
42362 71228 340
78258 124066 354
48060 124456 354
62775 95214 351
25335 122418 354
55793 118673 354
18856 85260 351
55672 148440 375
1144 14118 276
23097 44921 324
18375 33712 308
45837 86713 351
79041 88583 333
63582 120877 354
12130 22662 279
2265 64497 340
2348 56158 340
5402 53134 340
42121 78280 351
65932 71531 325
5422 38452 324
1920 18521 279
12497 57563 340
101662 191822 383
105196 134580 354
14026 43238 324
24174 94676 351
103382 123260 354
186564 198290 360
26527 109884 354
89899 139521 354
53157 59145 322
20071 89438 351
2921 14735 276
27877 57292 340
44492 64025 340
536 58828 340
42815 125200 354
54747 87854 351
1355 61452 340
21897 98792 351
70871 120979 354
2332 54979 340
22700 79655 351
118516 157757 383
20918 36229 324
11643 26839 308
6712 11168 268
16758 102017 351
44279 130312 354
13620 72803 340
394 76463 340
55396 76692 335
130817 171775 383
47494 134112 354
7446 44605 324
32727 52816 340
155561 247811 443
70539 107203 354
2241 5155 238
1257 46910 324
25174 77236 351
79682 115523 354
58971 125870 354
39346 101728 351
13979 87263 351
39696 64204 340
30704 111675 354
4339 91938 351
58404 119558 354
2246 64779 340
29453 103510 351
116073 171668 383
2419 15409 276
81446 176639 383
38264 85049 351
49541 72616 340
27865 110059 354
17448 96265 351
40874 137890 354
26388 107672 354
18910 62623 340
29736 84703 351
20898 104101 351
14911 87417 351
27580 52143 324
75056 94011 351
2968 70554 340
79700 115869 354
5640 62098 340
64587 99289 351
33073 61401 340
18245 78223 351
64303 94206 351
79545 119840 354
106990 115470 323
25302 48566 324
25790 89230 351
80100 146803 375
35055 62397 340
87461 186039 383
71797 121845 354
58856 63504 335
115644 213762 383
46310 70346 340
54508 69639 335
68851 95749 351
17392 69626 340
45160 66937 340
78544 169099 383
951132 627759 525
422197 808190 509
24855 88666 351
34209 38103 324
55622 10430 340
9769 24730 282
64220 69465 312
22449 13674 279
22308 21610 269
90576 24807 351
66973 85062 351
88429 17783 351
99853 89638 333
53370 91043 351
88555 52428 351
66369 52159 340
5134 29135 308
74549 13912 340
74052 68567 325
49374 22082 324
82857 35940 351
30176 15572 308
17185 34592 311
51322 70020 340
56691 1731 340
89609 20827 351
81195 62731 351
94339 3698 351
91858 36567 351
2686 27819 308
43898 45148 314
73362 55778 335
8894 7099 252
85159 80656 320
11477 45426 324
71577 22142 340
10406 83734 351
38811 55783 340
88073 24403 351
72308 63631 325
19655 4643 279
23474 91740 351
43100 43843 257
54682 30253 340
51732 27588 324
96853 20410 351
49038 96289 351
41951 51215 314
47092 55207 340
46362 78194 351
81989 29900 351
94565 6058 351
