1 10 20
100 200 125
201 210 89
900 1000 174
952082 362499 525
874482 315101 525
358909 516167 470
303363 815270 509
165821 924924 525
390323 138645 443
303894 250930 407
411635 158493 449
421848 700049 509
715604 662273 504
899696 794557 525
690756 907005 525
833229 615596 509
147391 188277 383
872639 650792 525
431882 462871 444
394821 123367 443
484102 288205 449
800951 588276 509
171744 635995 509
697218 295414 509
261823 240935 363
992923 233022 525
78393 164402 383
751435 167624 509
172356 996572 525
561904 810912 509
372595 296258 441
351818 642610 509
140940 685086 509
21597 899209 525
289839 150676 443
8894 352188 443
247116 258783 363
545634 841802 525
351311 292166 441
95996 584464 470
612500 441618 470
26865 711725 509
816652 920163 525
441874 304596 449
272484 54959 443
463795 316910 449
925482 893756 476
709729 799162 468
702943 136176 509
161533 113350 383
168214 228897 386
62181 756742 509
570493 277455 470
165223 890765 525
302869 780626 509
608496 185736 470
464262 468254 413
676048 455581 509
431343 255420 449
600411 393216 470
40182 641348 509
517015 572856 452
561786 467205 470
740257 404429 509
24190 908288 525
493437 37189 449
224965 736412 509
67447 166883 383
410113 562986 470
854556 46815 525
565212 25944 470
113474 48551 354
454570 655080 509
693197 853612 525
852497 911082 476
518702 912920 525
510439 456182 444
815690 308079 509
5626 54991 340
388899 344031 441
226478 792407 509
305005 425293 449
476718 864824 525
574169 578460 390
859197 504758 525
369365 489215 449
900903 920855 476
789580 99001 509
206480 893273 525
147624 450694 449
50493 270461 443
772570 137534 509
519260 462547 470
731708 585988 509
220066 627578 509
591951 468396 470
289854 480306 449
214341 715188 509
512126 660195 509
552476 869991 525
607025 427830 470
842984 209590 525
863706 41143 525
973550 727744 525
429232 885026 525
486077 353792 449
724595 961983 525
620065 443039 470
331864 543788 470
159126 895782 525
664683 665911 442
708636 718461 411
920207 114455 525
867708 153806 525
385799 41044 443
377065 315574 441
19244 626888 509
558307 975199 525
739880 150562 509
569399 60493 470
296656 813021 509
934352 842138 476
937139 858217 476
145148 271661 443
65842 145317 375
268424 138209 443
96235 383937 443
942090 186445 525
145581 769644 509
609842 717286 509
305803 50412 443
289453 869886 525
627909 387190 509
741399 390834 509
87825 397537 443
163313 446784 449
924077 438350 525
413772 572599 470
836112 373328 509
89684 745056 509
304031 598274 470
308803 178561 443
275877 165852 443
433856 705592 509
153111 654157 509
773804 192956 509
310714 306228 371
39743 466107 449
822495 724602 468
924059 371926 525
88265 226009 386
181923 751701 509
65028 334550 443
627313 330374 509
728487 42375 509
963201 404040 525
676750 314071 509
407447 304480 441
565837 262864 470
82102 621732 470
315230 816340 509
203473 353509 443
818634 127324 509
749926 81107 509
850517 284856 525
331401 404380 441
862451 57605 525
303148 51364 443
338464 769457 509
598034 581379 434
757389 134583 509
623192 648664 509
671211 26406 509
929662 461716 525
76881 792737 509
139342 754503 509
20015 40563 324
503804 693628 509
26431 971704 525
285395 598384 470
2244 374851 443
383248 623332 470
571153 246178 470
406143 158462 443
681771 761216 504
862135 182244 525
853406 661311 525
633143 477553 509
94468 798204 509
485092 741027 509
449733 177834 449
927462 403267 525
603910 867811 525
314418 743240 509
7583 200754 383
311078 586445 470
816644 204045 509
417298 826118 509
209230 488263 449
221518 764640 509
494639 969032 525
646128 91096 509
160246 914164 525