<?xml version="1.0" encoding="utf-8"?>
<!-- Generator: Adobe Illustrator 23.0.4, SVG Export Plug-In . SVG Version: 6.00 Build 0)  -->
<svg version="1.1" id="Calque_1" xmlns="http://www.w3.org/2000/svg" xmlns:xlink="http://www.w3.org/1999/xlink" x="0px" y="0px"
	 viewBox="0 0 24 24" style="enable-background:new 0 0 24 24;" xml:space="preserve">
<style type="text/css">
	.st0{fill:#4355F1;}
</style>
<path class="st0" d="M24,10.9v2.1L16,17v-2.2l5.6-2.8L16,9.2V7C16,7,24,10.9,24,10.9z M8,14.8L2.4,12L8,9.2V7l-8,3.9v2.1L8,17
	C8,17,8,14.8,8,14.8z M15,4H13L9,20H11C11,20,15,4,15,4z"/>
</svg>
