<?xml version="1.0" standalone="no"?>
<!DOCTYPE svg PUBLIC "-//W3C//DTD SVG 20010904//EN"
 "http://www.w3.org/TR/2001/REC-SVG-20010904/DTD/svg10.dtd">
<svg version="1.0" xmlns="http://www.w3.org/2000/svg"
 width="1920.000000pt" height="1920.000000pt" viewBox="0 0 1920.000000 1920.000000"
 preserveAspectRatio="xMidYMid meet">
<metadata>
Created by potrace 1.11, written by Peter Selinger 2001-2013
</metadata>
<g transform="translate(0.000000,1920.000000) scale(0.100000,-0.100000)"
fill="#000000" stroke="none">
<path d="M8618 16005 c-2 -2 -43 -6 -93 -9 -49 -4 -101 -8 -115 -11 -14 -2
-45 -7 -70 -10 -40 -4 -156 -24 -234 -40 -16 -3 -33 -8 -36 -10 -4 -2 -20 -6
-36 -9 -41 -8 -180 -50 -239 -74 -148 -59 -256 -118 -342 -188 l-42 -34 20
-58 c11 -31 23 -68 25 -81 3 -14 7 -27 9 -31 6 -10 55 -193 59 -220 1 -9 5
-21 10 -28 4 -6 5 -12 2 -12 -2 0 -1 -14 4 -32 5 -17 12 -50 15 -72 4 -23 10
-57 15 -76 4 -19 11 -57 15 -83 3 -27 8 -59 11 -70 6 -32 11 -70 24 -187 6
-58 13 -121 15 -140 19 -153 32 -408 40 -785 l5 -280 -169 -41 c-306 -76 -471
-161 -471 -244 0 -80 137 -140 385 -170 50 -6 106 -12 125 -15 19 -2 61 -6 92
-7 l57 -3 -1 -252 c0 -139 -4 -253 -7 -253 -13 0 -38 37 -57 83 -10 26 -22 47
-26 47 -12 0 -6 -259 8 -334 8 -39 28 -100 46 -136 l32 -65 1 -180 c1 -99 -1
-185 -3 -192 -2 -6 -14 -14 -26 -17 -17 -4 -33 -29 -63 -93 -39 -84 -113 -301
-113 -330 0 -7 -12 -13 -27 -14 -16 0 -35 -2 -44 -4 -8 -1 -42 -6 -75 -9 -83
-10 -114 -15 -244 -37 -63 -11 -126 -22 -140 -24 -14 -2 -36 -7 -50 -10 -14
-4 -38 -9 -55 -12 -43 -7 -301 -72 -355 -88 -215 -66 -331 -106 -525 -179
l-70 -27 51 53 c57 59 74 76 224 237 179 192 190 204 243 281 86 123 132 226
152 340 9 48 9 172 1 197 -4 12 -8 30 -10 40 -8 36 -40 109 -67 149 -132 195
-414 267 -675 171 -96 -35 -214 -106 -288 -172 -6 -6 -51 -44 -101 -85 -49
-41 -92 -77 -95 -80 -3 -3 -45 -39 -95 -80 -49 -41 -92 -77 -95 -80 -3 -3 -72
-61 -155 -130 -82 -69 -161 -135 -175 -146 -14 -12 -131 -110 -260 -219 -267
-223 -317 -265 -377 -317 -48 -41 -40 -41 -143 5 -95 42 -195 62 -310 61 -58
0 -121 -4 -140 -8 -53 -10 -167 -55 -192 -76 -25 -20 -23 -20 -166 46 -41 19
-75 34 -77 34 -2 0 -33 14 -69 30 -165 77 -834 333 -893 343 -10 2 -26 7 -35
13 -14 8 -1 22 82 87 250 197 483 412 655 602 50 56 159 222 177 270 33 90 14
188 -48 247 -106 100 -286 73 -480 -72 -88 -65 -244 -226 -323 -332 -34 -46
-65 -87 -69 -93 -7 -9 -54 -82 -107 -165 -53 -83 -136 -234 -190 -345 -32 -66
-60 -122 -61 -124 -2 -2 -24 -5 -51 -7 -248 -22 -500 -235 -588 -498 -29 -88
-38 -142 -37 -229 l1 -67 -97 -74 c-585 -443 -938 -830 -976 -1066 -6 -42 18
-132 42 -153 76 -69 285 -63 412 10 196 113 412 395 620 809 47 93 87 171 89
174 2 3 8 -3 15 -13 22 -37 289 -401 310 -424 6 -6 22 -26 36 -44 90 -119 256
-307 427 -488 40 -42 73 -78 73 -81 0 -3 -24 -21 -52 -40 -29 -19 -57 -39 -63
-43 -11 -9 -598 -422 -758 -534 -323 -225 -358 -254 -402 -334 -51 -94 -36
-203 39 -282 124 -132 331 -168 586 -103 8 2 139 57 290 121 151 64 349 149
440 187 213 90 215 91 283 122 32 14 60 26 62 26 3 0 24 9 48 19 23 11 113 50
200 86 l158 67 37 -29 c20 -15 46 -35 58 -43 12 -8 60 -44 105 -79 46 -35 85
-65 87 -66 1 -1 -47 -98 -106 -216 -60 -118 -125 -254 -147 -304 -21 -49 -44
-105 -52 -123 -45 -104 -147 -393 -173 -489 -6 -24 -16 -43 -23 -44 -7 0 -20
-2 -30 -4 -9 -2 -50 -6 -90 -10 -39 -4 -74 -8 -77 -10 -3 -2 -34 -6 -70 -10
-36 -3 -72 -8 -80 -10 -8 -2 -44 -7 -80 -10 -36 -4 -72 -8 -80 -10 -14 -3
-112 -14 -175 -20 -16 -2 -68 -8 -115 -14 -47 -7 -103 -14 -125 -17 -127 -15
-119 -12 -143 -62 -11 -26 -46 -100 -77 -165 -30 -65 -55 -120 -55 -122 0 -2
-20 -45 -44 -97 -24 -51 -53 -115 -66 -143 -12 -27 -38 -84 -57 -125 -20 -41
-72 -154 -116 -250 -133 -292 -193 -422 -220 -480 -71 -154 -102 -220 -124
-270 -27 -62 -40 -89 -112 -243 -28 -60 -51 -110 -51 -112 0 -1 -21 -47 -46
-101 -79 -170 -100 -216 -154 -334 -52 -114 -84 -183 -139 -302 -16 -35 -68
-148 -116 -253 -48 -104 -105 -228 -126 -274 -22 -46 -38 -85 -37 -87 2 -1 37
-9 78 -18 41 -9 176 -38 300 -66 124 -28 236 -52 250 -55 14 -2 54 -10 90 -19
36 -8 169 -37 295 -65 127 -27 237 -52 245 -55 8 -3 31 -8 50 -11 19 -3 121
-24 226 -48 106 -24 205 -43 220 -42 57 3 191 16 264 25 41 5 102 12 135 15
33 3 78 8 100 10 22 3 67 7 100 10 88 9 146 15 180 20 44 6 165 14 290 20 209
9 340 15 419 20 43 3 138 7 210 10 72 3 154 8 181 10 28 2 79 7 115 10 36 3
85 7 110 10 25 2 74 7 110 10 105 9 172 15 220 20 43 4 90 9 215 20 30 3 81 8
113 11 31 4 64 6 74 6 9 0 19 10 23 26 7 29 49 231 66 323 l11 57 87 -43 c47
-23 109 -53 136 -65 28 -12 94 -44 148 -71 54 -26 111 -50 125 -54 15 -3 38
-8 52 -11 43 -10 431 -13 505 -3 39 5 93 11 120 15 176 21 417 98 596 190 94
48 92 48 135 9 116 -106 202 -185 223 -205 l26 -25 597 0 598 0 1 30 c4 161 6
241 8 245 2 5 17 -23 76 -134 27 -52 32 -56 65 -57 19 0 42 -2 52 -4 9 -2 63
-6 120 -10 56 -4 119 -8 138 -10 19 -2 71 -6 115 -9 224 -17 315 -24 395 -31
30 -2 111 -13 180 -24 110 -17 183 -19 600 -20 l475 -1 43 70 c24 38 45 70 47
70 1 0 23 -36 48 -79 31 -54 52 -80 64 -79 10 0 81 -3 158 -7 77 -4 174 -8
215 -10 157 -6 407 -17 455 -20 28 -2 67 -4 88 -4 25 -1 37 -6 37 -15 0 -8 3
-17 8 -20 10 -6 71 -14 157 -21 97 -8 162 -14 215 -20 103 -11 165 -17 305
-29 44 -4 91 -9 105 -11 14 -2 61 -7 105 -11 44 -3 91 -8 105 -9 14 -2 59 -6
100 -10 41 -4 86 -8 99 -10 14 -3 63 -7 110 -10 47 -4 99 -8 114 -11 15 -2 58
-7 95 -9 37 -3 83 -8 102 -10 33 -4 113 -12 205 -20 115 -10 174 -16 213 -21
36 -4 95 13 359 101 173 58 318 104 320 101 5 -5 57 -207 67 -261 10 -50 19
-75 26 -70 4 2 22 0 41 -5 19 -5 57 -11 84 -15 55 -7 78 -10 145 -21 25 -4 54
-8 65 -9 23 -3 71 -10 210 -31 55 -8 116 -17 135 -20 19 -2 46 -6 60 -9 14 -2
43 -7 65 -10 22 -3 78 -11 125 -19 108 -17 207 -18 290 0 36 7 83 16 105 19
22 3 47 8 55 10 8 2 31 7 50 10 19 3 46 8 60 10 45 9 74 15 135 26 33 5 103
19 155 29 52 10 115 21 140 25 25 4 88 15 140 25 138 27 151 30 190 36 19 3
80 14 135 24 55 11 114 22 130 25 30 5 60 11 105 20 14 3 43 8 65 11 22 3 42
7 43 9 6 5 -16 72 -118 365 -50 146 -116 337 -147 425 -30 88 -79 232 -110
320 -30 88 -63 185 -73 215 -10 30 -51 147 -90 260 -39 113 -88 253 -107 312
l-36 107 82 308 c45 169 84 316 86 326 2 10 7 27 10 37 3 10 8 27 10 37 2 10
14 52 25 93 11 41 22 83 25 92 2 9 35 133 73 275 39 142 72 267 74 277 3 18
-6 21 -72 32 -41 7 -102 17 -135 23 -33 6 -75 13 -92 16 -65 10 -98 16 -113
20 -8 2 -42 7 -75 11 -33 3 -63 8 -67 10 -3 2 -30 7 -60 10 -29 3 -56 7 -59 9
-3 2 -28 7 -55 10 -27 4 -56 8 -65 11 -9 3 -32 7 -50 9 -19 2 -113 18 -209 34
-153 26 -219 37 -241 40 -3 1 -6 7 -6 14 0 6 -8 39 -17 72 -10 33 -19 67 -21
76 -5 23 -124 378 -139 414 -8 17 -20 48 -29 70 -9 22 -37 89 -63 150 l-47
109 24 16 c98 63 345 302 387 372 20 35 28 35 62 1 25 -26 317 -305 411 -394
24 -23 121 -114 214 -204 94 -90 198 -189 232 -221 33 -33 64 -70 68 -84 4
-14 19 -37 33 -52 19 -21 22 -29 11 -32 -71 -23 -95 -30 -101 -32 -5 -1 -9 -2
-10 -4 -2 -1 -10 -3 -18 -5 -48 -10 -450 -162 -488 -184 -38 -23 29 -2 113 34
67 29 520 165 549 165 9 0 16 -4 16 -9 0 -5 15 -19 34 -31 33 -20 38 -20 88
-7 29 8 63 12 75 11 12 -2 48 12 80 31 65 39 81 41 170 28 34 -5 104 -8 157
-6 84 3 107 8 193 44 108 45 183 86 183 100 0 5 11 9 25 9 28 0 75 20 75 32 0
4 -15 8 -32 8 -25 0 -29 3 -18 10 12 8 10 10 -8 10 -28 0 -25 24 4 28 84 13
254 89 254 114 0 4 17 12 38 17 21 6 46 18 57 26 19 15 17 15 -30 10 -72 -9
-88 -12 -108 -20 -10 -4 -20 -5 -23 -2 -3 2 -20 1 -39 -3 -25 -6 -38 -4 -46 7
-15 17 -7 24 51 48 130 52 189 93 204 142 8 26 -7 38 -24 18 -13 -16 -70 -21
-70 -6 0 9 96 71 111 71 14 0 11 12 -8 25 -14 11 -9 15 41 34 32 12 79 39 105
61 26 22 52 40 57 40 5 0 58 47 117 105 60 58 112 103 118 100 5 -4 33 16 61
43 29 27 71 55 93 62 39 13 85 51 85 71 0 5 7 9 16 9 8 0 75 60 147 133 137
137 146 147 215 237 23 30 47 61 53 68 5 6 23 42 39 78 32 71 39 136 17 175
-47 89 -108 155 -174 190 -17 10 -39 33 -48 53 -20 43 -90 107 -143 131 -20
10 -48 26 -61 36 -40 31 -79 25 -121 -21 -36 -39 -39 -40 -100 -40 -61 0 -65
-2 -111 -45 -26 -25 -56 -45 -66 -46 -21 -1 -15 1 -163 -33 -63 -14 -155 -37
-205 -51 -49 -14 -99 -28 -110 -30 -58 -13 -358 -114 -475 -160 -144 -57 -322
-136 -316 -142 1 -2 29 8 60 22 100 44 482 167 566 182 14 2 43 9 65 15 22 5
48 12 58 14 10 2 27 6 37 9 10 3 29 8 42 10 13 3 46 9 73 15 28 6 61 12 75 15
14 3 38 7 53 11 16 3 38 7 50 9 12 1 41 6 65 10 l42 8 -15 -42 c-12 -36 -12
-46 0 -82 8 -22 18 -87 21 -142 11 -181 10 -193 -19 -236 -80 -120 -350 -263
-524 -276 -27 -2 -61 -6 -77 -10 -26 -7 -27 -6 -17 13 7 14 28 24 66 32 30 6
55 13 55 15 0 2 -35 2 -77 1 -52 -2 -107 -12 -163 -30 -102 -33 -120 -37 -120
-27 0 4 25 18 55 31 30 13 53 26 50 28 -3 3 -77 -23 -165 -58 -88 -35 -163
-60 -167 -56 -4 3 20 33 52 66 75 76 42 82 -43 9 -53 -47 -69 -36 -26 16 20
25 34 48 31 51 -8 8 -38 -14 -100 -73 -76 -72 -124 -105 -144 -101 -33 7 -13
51 35 77 24 13 30 41 9 41 -22 0 -90 -41 -142 -86 -43 -38 -51 -42 -56 -27 -4
10 -5 21 -2 26 10 17 -10 27 -22 10 -13 -20 -95 -233 -95 -249 0 -5 -16 -34
-35 -64 -26 -40 -34 -62 -30 -80 l6 -24 -23 19 c-13 11 -43 39 -68 63 -24 24
-116 112 -204 195 -88 84 -240 231 -338 327 l-178 175 -1 110 c-2 148 -23 277
-66 403 -13 40 -13 45 8 79 42 67 189 184 260 207 178 58 239 85 309 139 l45
34 30 -23 c16 -12 66 -37 110 -54 44 -18 98 -40 120 -50 22 -10 70 -31 107
-48 58 -26 131 -72 148 -93 3 -3 39 -29 80 -56 112 -74 278 -151 362 -167 13
-2 45 -9 73 -16 145 -33 317 11 421 108 37 35 114 133 114 145 0 22 72 105
126 145 35 26 66 53 69 60 7 20 -19 64 -54 89 -25 19 -29 28 -26 55 6 44 7
168 1 193 -13 61 -21 83 -37 117 -21 41 -104 129 -164 173 -22 17 -42 32 -45
35 -3 3 -29 21 -59 40 -30 19 -62 43 -72 53 -17 19 -16 21 36 69 57 52 102
114 91 126 -4 4 -50 30 -104 57 l-97 50 2 54 c0 30 6 73 13 95 27 92 53 164
80 221 16 33 35 82 42 108 12 45 11 51 -11 93 -57 106 -211 287 -333 391 -72
60 -86 78 -79 91 9 17 39 124 48 171 2 14 6 27 8 31 10 16 20 137 20 240 -1
127 -18 210 -63 297 -50 101 -143 187 -247 230 -74 31 -87 32 -91 6 -3 -18 4
-26 30 -37 67 -28 85 -97 50 -187 -16 -39 -62 -119 -70 -119 -1 0 -25 11 -52
25 -90 45 -230 82 -438 115 -68 11 -125 20 -128 20 -2 0 2 -17 9 -37 42 -122
-35 -224 -213 -282 -62 -20 -87 -25 -192 -36 -104 -11 -231 -58 -333 -122 -21
-13 -86 -39 -145 -57 -287 -91 -685 -252 -987 -401 -115 -57 -219 -110 -230
-119 -11 -9 25 5 80 31 260 124 738 305 1000 378 28 8 61 17 75 21 22 7 20 4
-12 -24 -20 -18 -51 -55 -68 -82 -18 -28 -36 -50 -41 -50 -12 0 -74 -28 -227
-102 -131 -63 -221 -114 -262 -148 -21 -18 -18 -17 20 3 82 46 417 173 427
163 2 -2 -8 -23 -21 -47 -27 -50 -92 -221 -100 -264 -3 -16 -10 -53 -17 -83
-13 -63 -16 -214 -6 -290 10 -77 97 -333 145 -427 22 -44 61 -111 87 -149 25
-38 42 -72 38 -76 -4 -4 -59 -44 -120 -88 l-113 -81 -15 30 c-21 39 -90 105
-136 129 -74 39 -191 55 -394 55 -104 0 -204 -3 -220 -7 l-30 -7 -49 117 c-28
64 -62 144 -77 177 -15 33 -92 213 -172 400 -142 334 -144 341 -138 395 8 63
-4 120 -44 208 -15 34 -25 69 -21 78 4 9 9 14 12 11 3 -3 28 5 56 18 47 22 52
22 86 8 57 -24 172 -42 242 -38 316 18 552 269 551 590 0 253 -166 473 -415
550 -266 82 -563 -46 -682 -292 -38 -80 -40 -81 -102 -108 -34 -15 -64 -26
-66 -24 -1 2 -12 24 -24 49 -46 98 -150 169 -258 178 -87 7 -138 -7 -288 -79
-22 -11 -43 -19 -48 -19 -4 0 -42 -17 -84 -37 -97 -47 -153 -107 -181 -195
-26 -78 -23 -183 7 -239 17 -30 12 -36 -46 -59 l-56 -23 -66 23 c-82 29 -238
36 -322 14 -63 -17 -171 -67 -209 -98 -151 -122 -234 -290 -233 -471 1 -82 2
-89 22 -165 66 -245 319 -426 580 -414 108 4 156 17 250 65 116 58 205 153
261 276 21 46 31 56 77 78 29 14 56 25 60 25 4 0 24 -41 45 -90 33 -76 48 -98
108 -154 38 -35 69 -69 69 -75 0 -6 11 -34 24 -63 28 -59 296 -683 331 -768
12 -30 32 -76 43 -101 l20 -47 -78 -65 -79 -66 -141 35 c-131 33 -150 41 -234
96 -50 33 -94 65 -98 71 -4 7 -8 26 -8 42 0 49 -25 131 -51 169 -31 46 -87 81
-171 106 -71 23 -71 22 -228 -5 -96 -17 -94 -17 -183 25 -187 87 -557 225
-752 280 -153 43 -489 121 -580 134 -22 3 -49 7 -60 10 -54 11 -205 31 -305
42 -60 6 -206 19 -260 23 -12 1 -15 17 -13 89 4 163 -68 299 -202 380 -134 81
-293 84 -439 9 -41 -22 -30 -23 -168 14 -36 9 -36 9 -43 77 -4 37 -9 76 -11
87 -15 82 -20 402 -9 615 12 253 12 246 30 440 3 25 7 72 10 105 3 33 8 71 10
85 3 14 7 50 10 80 5 45 10 81 14 98 1 1 10 -2 20 -7 17 -9 20 -6 27 37 4 26
8 52 10 57 1 6 11 62 23 125 11 63 23 124 25 135 2 11 11 58 20 105 26 136 36
184 83 400 14 63 27 126 29 140 3 14 11 50 19 80 8 30 16 66 18 80 8 41 146
596 179 715 16 61 31 117 33 125 13 51 99 354 135 473 5 15 8 27 7 28 -1 0
-11 2 -22 5 -11 2 -54 11 -95 19 -41 9 -86 18 -100 20 -14 2 -60 11 -104 19
-43 9 -92 18 -110 20 -17 2 -60 9 -96 15 -92 14 -128 19 -185 26 -27 3 -63 8
-80 10 -16 2 -61 7 -100 10 -38 3 -92 8 -120 11 -53 6 -592 13 -597 9z m5709
-3242 c79 -51 100 -147 49 -224 -76 -114 -246 -93 -291 37 -49 144 114 270
242 187z m-1895 -830 c42 -39 60 -78 60 -128 0 -169 -231 -223 -308 -72 -39
75 -6 178 68 216 60 31 138 24 180 -16z m3072 -1969 c3 -8 2 -12 -4 -9 -6 3
-10 10 -10 16 0 14 7 11 14 -7z"/>
<path d="M15894 7174 c-18 -14 -18 -14 6 -3 31 14 36 19 24 19 -6 0 -19 -7
-30 -16z"/>
</g>
</svg>
