<?xml version="1.0" standalone="no"?>
<!DOCTYPE svg PUBLIC "-//W3C//DTD SVG 20010904//EN"
 "http://www.w3.org/TR/2001/REC-SVG-20010904/DTD/svg10.dtd">
<svg version="1.0" xmlns="http://www.w3.org/2000/svg"
 width="604.000000pt" height="580.000000pt" viewBox="0 0 604.000000 580.000000"
 preserveAspectRatio="xMidYMid meet">

<g transform="translate(0.000000,580.000000) scale(0.100000,-0.100000)"
fill="#000000" stroke="none">
<path d="M2930 5793 c-1074 -28 -1981 -507 -2495 -1318 -71 -112 -202 -379
-249 -506 -115 -312 -172 -617 -183 -979 -15 -521 77 -974 287 -1405 140 -286
284 -489 510 -716 385 -386 831 -631 1400 -768 269 -65 514 -92 840 -92 907 0
1672 301 2231 877 201 208 341 408 474 679 213 434 307 888 292 1415 -14 491
-107 878 -309 1282 -497 993 -1538 1563 -2798 1531z m352 -1038 c324 -38 636
-144 878 -300 333 -214 584 -537 703 -905 l34 -105 -626 -3 -626 -2 -80 79
c-63 61 -99 87 -165 119 -136 65 -191 77 -375 77 -137 0 -172 -3 -240 -23
-272 -78 -464 -298 -521 -598 -22 -121 -15 -346 15 -458 75 -280 260 -467 534
-539 115 -30 336 -29 452 2 195 52 343 160 416 303 l19 38 -435 0 -435 0 0
380 0 380 1059 0 1058 0 6 -82 c80 -1022 -474 -1823 -1405 -2032 -400 -90
-858 -71 -1233 51 -670 217 -1116 758 -1216 1473 -17 122 -17 458 0 580 27
195 83 389 161 555 260 555 790 926 1435 1004 50 6 101 13 115 15 68 10 360 4
472 -9z"/>
</g>
</svg>
