2008.12.20 10:22 B C:\estey\www\computing\web\html\chapter2\performance\100KB-1.gif --> ftp.cv64.com /web/html/chapter2/performance 100KB-1.gif
2008.12.20 10:22 B C:\estey\www\computing\web\html\chapter2\performance\100KB_File.html --> ftp.cv64.com /web/html/chapter2/performance 100KB_File.html
2008.12.20 10:22 B C:\estey\www\computing\web\html\chapter2\performance\10KB-0.gif --> ftp.cv64.com /web/html/chapter2/performance 10KB-0.gif
2008.12.20 10:22 B C:\estey\www\computing\web\html\chapter2\performance\10KB-1.gif --> ftp.cv64.com /web/html/chapter2/performance 10KB-1.gif
2008.12.20 10:22 B C:\estey\www\computing\web\html\chapter2\performance\10KB-10_Files.html --> ftp.cv64.com /web/html/chapter2/performance 10KB-10_Files.html
2008.12.20 10:22 B C:\estey\www\computing\web\html\chapter2\performance\10KB-2.gif --> ftp.cv64.com /web/html/chapter2/performance 10KB-2.gif
2008.12.20 10:22 B C:\estey\www\computing\web\html\chapter2\performance\10KB-3.gif --> ftp.cv64.com /web/html/chapter2/performance 10KB-3.gif
2008.12.20 10:22 B C:\estey\www\computing\web\html\chapter2\performance\10KB-4.gif --> ftp.cv64.com /web/html/chapter2/performance 10KB-4.gif
2008.12.20 10:22 B C:\estey\www\computing\web\html\chapter2\performance\10KB-5.gif --> ftp.cv64.com /web/html/chapter2/performance 10KB-5.gif
2008.12.20 10:22 B C:\estey\www\computing\web\html\chapter2\performance\10KB-6.gif --> ftp.cv64.com /web/html/chapter2/performance 10KB-6.gif
2008.12.20 10:22 B C:\estey\www\computing\web\html\chapter2\performance\10KB-7.gif --> ftp.cv64.com /web/html/chapter2/performance 10KB-7.gif
2008.12.20 10:22 B C:\estey\www\computing\web\html\chapter2\performance\10KB-8.gif --> ftp.cv64.com /web/html/chapter2/performance 10KB-8.gif
2008.12.20 10:22 B C:\estey\www\computing\web\html\chapter2\performance\10KB-9.gif --> ftp.cv64.com /web/html/chapter2/performance 10KB-9.gif
2008.12.20 10:22 B C:\estey\www\computing\web\html\chapter2\performance\performance.gif --> ftp.cv64.com /web/html/chapter2/performance performance.gif
2008.12.20 10:22 B C:\estey\www\computing\web\html\chapter2\performance\performance.html --> ftp.cv64.com /web/html/chapter2/performance performance.html
2008.12.20 10:22 B C:\estey\www\computing\web\html\chapter2\performance\performance.sxd --> ftp.cv64.com /web/html/chapter2/performance performance.sxd
2008.12.20 11:32 B C:\estey\www\computing\web\html\chapter2\performance\100KB-1.gif --> ftp.cv64.com /computing/web/html/chapter2/performance 100KB-1.gif
2008.12.20 11:33 B C:\estey\www\computing\web\html\chapter2\performance\100KB_File.html --> ftp.cv64.com /computing/web/html/chapter2/performance 100KB_File.html
2008.12.20 11:33 B C:\estey\www\computing\web\html\chapter2\performance\10KB-0.gif --> ftp.cv64.com /computing/web/html/chapter2/performance 10KB-0.gif
2008.12.20 11:33 B C:\estey\www\computing\web\html\chapter2\performance\10KB-1.gif --> ftp.cv64.com /computing/web/html/chapter2/performance 10KB-1.gif
2008.12.20 11:33 B C:\estey\www\computing\web\html\chapter2\performance\10KB-10_Files.html --> ftp.cv64.com /computing/web/html/chapter2/performance 10KB-10_Files.html
2008.12.20 11:33 B C:\estey\www\computing\web\html\chapter2\performance\10KB-2.gif --> ftp.cv64.com /computing/web/html/chapter2/performance 10KB-2.gif
2008.12.20 11:33 B C:\estey\www\computing\web\html\chapter2\performance\10KB-3.gif --> ftp.cv64.com /computing/web/html/chapter2/performance 10KB-3.gif
2008.12.20 11:33 B C:\estey\www\computing\web\html\chapter2\performance\10KB-4.gif --> ftp.cv64.com /computing/web/html/chapter2/performance 10KB-4.gif
2008.12.20 11:33 B C:\estey\www\computing\web\html\chapter2\performance\10KB-5.gif --> ftp.cv64.com /computing/web/html/chapter2/performance 10KB-5.gif
2008.12.20 11:33 B C:\estey\www\computing\web\html\chapter2\performance\10KB-6.gif --> ftp.cv64.com /computing/web/html/chapter2/performance 10KB-6.gif
2008.12.20 11:33 B C:\estey\www\computing\web\html\chapter2\performance\10KB-7.gif --> ftp.cv64.com /computing/web/html/chapter2/performance 10KB-7.gif
2008.12.20 11:33 B C:\estey\www\computing\web\html\chapter2\performance\10KB-8.gif --> ftp.cv64.com /computing/web/html/chapter2/performance 10KB-8.gif
2008.12.20 11:33 B C:\estey\www\computing\web\html\chapter2\performance\10KB-9.gif --> ftp.cv64.com /computing/web/html/chapter2/performance 10KB-9.gif
2008.12.20 11:33 B C:\estey\www\computing\web\html\chapter2\performance\performance.gif --> ftp.cv64.com /computing/web/html/chapter2/performance performance.gif
2008.12.20 11:33 B C:\estey\www\computing\web\html\chapter2\performance\performance.html --> ftp.cv64.com /computing/web/html/chapter2/performance performance.html
2008.12.20 11:33 B C:\estey\www\computing\web\html\chapter2\performance\performance.sxd --> ftp.cv64.com /computing/web/html/chapter2/performance performance.sxd
2008.12.20 11:33 B C:\estey\www\computing\web\html\chapter2\performance\WS_FTP.LOG --> ftp.cv64.com /computing/web/html/chapter2/performance WS_FTP.LOG
