{
  "version": "1.0.0.0",
  "statusCode": 200,
  "message": "Request successful.",
  "result": {
    "contentID": "00000000-0000-0000-0000-000000000000",
    "name": "About University",
    "contentImagePath": "",
    "description": "About University Description"
  }
}
