{
  "version": "1.0.0.0",
  "statusCode": 200,
  "message": "Request successful.",
  "result": {
    "UserID": "00000000-0000-0000-0000-000000000001",
    "CustomID": "00000000-0000-0000-0000-000000000001",
    "FirstName": "Mohamed",
    "LastName": "Hussien",
    "DisplayName": "Mohamed Hussien",
    "Gender": "male",
    "Title": "Student",
    "Imagepath": "",
    "Bio": "Student Bio",
    "UserContact": {
      "Email": "mhussien@ipmagix.com"
    }
  }
}
