[
{
        "name": "叉字蝠V",
        "image": "https://hkbgstor.blob.core.windows.net/ptcg-img/s4a_108.jpg",
        "category": "pokemon"
    },
{
        "name": "叉字蝠V",
        "image": "https://hkbgstor.blob.core.windows.net/ptcg-img/s4a_108.jpg",
        "category": "pokemon"
    },
{
        "name": "叉字蝠V",
        "image": "https://hkbgstor.blob.core.windows.net/ptcg-img/s4a_108.jpg",
        "category": "pokemon"
    },
{
        "name": "叉字蝠Vmax",
        "image": "https://hkbgstor.blob.core.windows.net/ptcg-img/s4a_109.jpg",
        "category": "pokemon"
    },
{
        "name": "叉字蝠Vmax",
        "image": "https://hkbgstor.blob.core.windows.net/ptcg-img/s4a_109.jpg",
        "category": "pokemon"
    },
{
        "name": "叉字蝠Vmax",
        "image": "https://hkbgstor.blob.core.windows.net/ptcg-img/s4a_109.jpg",
        "category": "pokemon"
    },
{
        "name": "伽勒爾雙彈瓦斯",
        "image": "https://hkbgstor.blob.core.windows.net/ptcg-img/s4a_276.jpg",
        "category": "pokemon"
    },
{
        "name": "伽勒爾雙彈瓦斯",
        "image": "https://hkbgstor.blob.core.windows.net/ptcg-img/s4a_276.jpg",
        "category": "pokemon"
    },
{
        "name": "伽勒爾雙彈瓦斯",
        "image": "https://hkbgstor.blob.core.windows.net/ptcg-img/s4a_276.jpg",
        "category": "pokemon"
    },
{
        "name": "瓦斯彈",
        "image": "https://hkbgstor.blob.core.windows.net/ptcg-img/s4a_275.jpg",
        "category": "pokemon"
    },
{
        "name": "瓦斯彈",
        "image": "https://hkbgstor.blob.core.windows.net/ptcg-img/s4a_275.jpg",
        "category": "pokemon"
    },
{
        "name": "瓦斯彈",
        "image": "https://hkbgstor.blob.core.windows.net/ptcg-img/s4a_275.jpg",
        "category": "pokemon"
    },
{
        "name": "瓦斯彈",
        "image": "https://hkbgstor.blob.core.windows.net/ptcg-img/s4a_275.jpg",
        "category": "pokemon"
    },
{
        "name": "達克萊伊V",
        "image": "https://hkbgstor.blob.core.windows.net/ptcg-img/sLD_7.jpg",
        "category": "pokemon"
    },
{
        "name": "達克萊伊Vstar",
        "image": "https://hkbgstor.blob.core.windows.net/ptcg-img/sLD_8.jpg",
        "category": "pokemon"
    },
{
        "name": "光輝洗翠大狃拉",
        "image": "https://hkbgstor.blob.core.windows.net/ptcg-img/s10a_46.jpg",
        "category": "pokemon"
    },
{
        "name": "先機球",
        "image": "https://hkbgstor.blob.core.windows.net/ptcg-img/sLD_11.jpg",
        "category": "trainer"
    },
{
        "name": "先機球",
        "image": "https://hkbgstor.blob.core.windows.net/ptcg-img/sLD_11.jpg",
        "category": "trainer"
    },
{
        "name": "先機球",
        "image": "https://hkbgstor.blob.core.windows.net/ptcg-img/sLD_11.jpg",
        "category": "trainer"
    },
{
        "name": "先機球",
        "image": "https://hkbgstor.blob.core.windows.net/ptcg-img/sLD_11.jpg",
        "category": "trainer"
    },
{
        "name": "暗黑修正檔",
        "image": "https://hkbgstor.blob.core.windows.net/ptcg-img/sLD_12.jpg",
        "category": "trainer"
    },
{
        "name": "暗黑修正檔",
        "image": "https://hkbgstor.blob.core.windows.net/ptcg-img/sLD_12.jpg",
        "category": "trainer"
    },
{
        "name": "高級球",
        "image": "https://hkbgstor.blob.core.windows.net/ptcg-img/sLD_13.jpg",
        "category": "trainer"
    },
{
        "name": "高級球",
        "image": "https://hkbgstor.blob.core.windows.net/ptcg-img/sLD_13.jpg",
        "category": "trainer"
    },
{
        "name": "高級球",
        "image": "https://hkbgstor.blob.core.windows.net/ptcg-img/sLD_13.jpg",
        "category": "trainer"
    },
{
        "name": "寶可夢交替",
        "image": "https://hkbgstor.blob.core.windows.net/ptcg-img/sLD_15.jpg",
        "category": "trainer"
    },
{
        "name": "寶可夢交替",
        "image": "https://hkbgstor.blob.core.windows.net/ptcg-img/sLD_15.jpg",
        "category": "trainer"
    },
{
        "name": "寶可夢交替",
        "image": "https://hkbgstor.blob.core.windows.net/ptcg-img/sLD_15.jpg",
        "category": "trainer"
    },
{
        "name": "健行鞋",
        "image": "https://hkbgstor.blob.core.windows.net/ptcg-img/s10D_61.jpg",
        "category": "trainer"
    },

{
        "name": "健行鞋",
        "image": "https://hkbgstor.blob.core.windows.net/ptcg-img/s10D_61.jpg",
        "category": "trainer"
    },
{
        "name": "健行鞋",
        "image": "https://hkbgstor.blob.core.windows.net/ptcg-img/s10D_61.jpg",
        "category": "trainer"
    },
{
        "name": "粉碎之錘",
        "image": "https://hkbgstor.blob.core.windows.net/ptcg-img/SMAC1D_135.jpg",
        "category": "trainer"
    },
{
        "name": "粉碎之錘",
        "image": "https://hkbgstor.blob.core.windows.net/ptcg-img/SMAC1D_135.jpg",
        "category": "trainer"
    },
{
        "name": "粉碎之錘",
        "image": "https://hkbgstor.blob.core.windows.net/ptcg-img/SMAC1D_135.jpg",
        "category": "trainer"
    },
{
        "name": "粉碎之錘",
        "image": "https://hkbgstor.blob.core.windows.net/ptcg-img/SMAC1D_135.jpg",
        "category": "trainer"
    },
{
        "name": "講究腰帶",
        "image": "https://hkbgstor.blob.core.windows.net/ptcg-img/sLL_15.jpg",
        "category": "tool"
    },
{
        "name": "講究腰帶",
        "image": "https://hkbgstor.blob.core.windows.net/ptcg-img/sLL_15.jpg",
        "category": "tool"
    },
{
        "name": "普通釣竿",
        "image": "https://hkbgstor.blob.core.windows.net/ptcg-img/s8b_139.jpg",
        "category": "trainer"
    },
{
        "name": "朋友手冊",
        "image": "https://hkbgstor.blob.core.windows.net/ptcg-img/SMAC2D_145.jpg",
        "category": "trainer"
    },
{
        "name": "博士的研究",
        "image": "https://hkbgstor.blob.core.windows.net/ptcg-img/sLD_19.jpg",
        "category": "trainer"
    },
{
        "name": "博士的研究",
        "image": "https://hkbgstor.blob.core.windows.net/ptcg-img/sLD_19.jpg",
        "category": "trainer"
    },

{
        "name": "博士的研究",
        "image": "https://hkbgstor.blob.core.windows.net/ptcg-img/sLD_19.jpg",
        "category": "trainer"
    },
{
        "name": "老大的指令",
        "image": "https://hkbgstor.blob.core.windows.net/ptcg-img/sLD_20.jpg",
        "category": "trainer"
    },
{
        "name": "老大的指令",
        "image": "https://hkbgstor.blob.core.windows.net/ptcg-img/sLD_20.jpg",
        "category": "trainer"
    },
{
        "name": "老大的指令",
        "image": "https://hkbgstor.blob.core.windows.net/ptcg-img/sLD_20.jpg",
        "category": "trainer"
    },
{
        "name": "瑪俐",
        "image": "https://hkbgstor.blob.core.windows.net/ptcg-img/sK_26.jpg",
        "category": "trainer"
    },
{
        "name": "瑪俐",
        "image": "https://hkbgstor.blob.core.windows.net/ptcg-img/sK_26.jpg",
        "category": "trainer"
    },
{
        "name": "杜娟",
        "image": "https://hkbgstor.blob.core.windows.net/ptcg-img/s9a_65.jpg",
        "category": "trainer"
    },
{
        "name": "伽勒爾礦山",
        "image": "https://hkbgstor.blob.core.windows.net/ptcg-img/SC1b_150.jpg",
        "category": "stadium"
    },
{
        "name": "伽勒爾礦山",
        "image": "https://hkbgstor.blob.core.windows.net/ptcg-img/SC1b_150.jpg",
        "category": "stadium"
    },

{
        "name": "伽勒爾礦山",
        "image": "https://hkbgstor.blob.core.windows.net/ptcg-img/SC1b_150.jpg",
        "category": "stadium"
    },
{
        "name": "潛行惡能量",
        "image": "https://hkbgstor.blob.core.windows.net/ptcg-img/s4a_186.jpg",
        "category": "energy"
    },
{
        "name": "潛行惡能量",
        "image": "https://hkbgstor.blob.core.windows.net/ptcg-img/s4a_186.jpg",
        "category": "energy"
    },
{
        "name": "潛行惡能量",
        "image": "https://hkbgstor.blob.core.windows.net/ptcg-img/s4a_186.jpg",
        "category": "energy"
    },
{
        "name": "潛行惡能量",
        "image": "https://hkbgstor.blob.core.windows.net/ptcg-img/s4a_186.jpg",
        "category": "energy"
    },
{
        "name": "基本惡能量",
        "image": "https://hkbgstor.blob.core.windows.net/ptcg-img/sLD_21.jpg",
        "category": "energy"
    },
{
        "name": "基本惡能量",
        "image": "https://hkbgstor.blob.core.windows.net/ptcg-img/sLD_21.jpg",
        "category": "energy"
    },
{
        "name": "基本惡能量",
        "image": "https://hkbgstor.blob.core.windows.net/ptcg-img/sLD_21.jpg",
        "category": "energy"
    },
{
        "name": "基本惡能量",
        "image": "https://hkbgstor.blob.core.windows.net/ptcg-img/sLD_21.jpg",
        "category": "energy"
    },
{
        "name": "基本惡能量",
        "image": "https://hkbgstor.blob.core.windows.net/ptcg-img/sLD_21.jpg",
        "category": "energy"
    }
]




