[
    {
        "name": "耿鬼V",
        "image": "https://hkbgstor.blob.core.windows.net/ptcg-img/scD_90.jpg",
        "category": "pokemon"
    },
	{
        "name": "耿鬼V",
        "image": "https://hkbgstor.blob.core.windows.net/ptcg-img/scD_90.jpg",
        "category": "pokemon"
    },
	{
        "name": "耿鬼V",
        "image": "https://hkbgstor.blob.core.windows.net/ptcg-img/scD_90.jpg",
        "category": "pokemon"
    },
	{
        "name": "耿鬼VMAX",
        "image": "https://hkbgstor.blob.core.windows.net/ptcg-img/scD_91.jpg",
        "category": "pokemon"
    },
	{
        "name": "耿鬼VMAX",
        "image": "https://hkbgstor.blob.core.windows.net/ptcg-img/scD_91.jpg",
        "category": "pokemon"
    },
	{
        "name": "耿鬼VMAX",
        "image": "https://hkbgstor.blob.core.windows.net/ptcg-img/scD_91.jpg",
        "category": "pokemon"
    },
	{
        "name": "阿爾宙斯V",
        "image": "https://hkbgstor.blob.core.windows.net/ptcg-img/s9_83.jpg",
        "category": "pokemon"
    },
	{
        "name": "阿爾宙斯V",
        "image": "https://hkbgstor.blob.core.windows.net/ptcg-img/s9_83.jpg",
        "category": "pokemon"
    },
	{
        "name": "阿爾宙斯VSTAR",
        "image": "https://hkbgstor.blob.core.windows.net/ptcg-img/s9_84.jpg",
        "category": "pokemon"
    },
	{
        "name": "阿爾宙斯VSTAR",
        "image": "https://hkbgstor.blob.core.windows.net/ptcg-img/s9_84.jpg",
        "category": "pokemon"
    },
	{
        "name": "百變怪V",
        "image": "https://hkbgstor.blob.core.windows.net/ptcg-img/s4a_140.jpg",
        "category": "pokemon"
    },
	{
        "name": "叉字蝠V",
        "image": "https://hkbgstor.blob.core.windows.net/ptcg-img/s4a_108.jpg",
        "category": "pokemon"
    },
	{
        "name": "霓虹魚V",
        "image": "https://hkbgstor.blob.core.windows.net/ptcg-img/s9_30.jpg",
        "category": "pokemon"
    },
	{
        "name": "霓虹魚V",
        "image": "https://hkbgstor.blob.core.windows.net/ptcg-img/s9_30.jpg",
        "category": "pokemon"
    },
	{
        "name": "黑魯加",
        "image": "https://hkbgstor.blob.core.windows.net/ptcg-img/s8b_103.jpg",
        "category": "pokemon"
    },
	{
        "name": "黑魯加",
        "image": "https://hkbgstor.blob.core.windows.net/ptcg-img/s8b_103.jpg",
        "category": "pokemon"
    },
	{
        "name": "戴魯比",
        "image": "https://hkbgstor.blob.core.windows.net/ptcg-img/s8b_102.jpg",
        "category": "pokemon"
    },
	{
        "name": "戴魯比",
        "image": "https://hkbgstor.blob.core.windows.net/ptcg-img/s8b_102.jpg",
        "category": "pokemon"
    },
	{
        "name": "高級球",
        "image": "https://hkbgstor.blob.core.windows.net/ptcg-img/sLD_13.jpg",
        "category": "trainer"
    },
	{
        "name": "高級球",
        "image": "https://hkbgstor.blob.core.windows.net/ptcg-img/sLD_13.jpg",
        "category": "trainer"
    },
	{
        "name": "高級球",
        "image": "https://hkbgstor.blob.core.windows.net/ptcg-img/sLD_13.jpg",
        "category": "trainer"
    },
	{
        "name": "高級球",
        "image": "https://hkbgstor.blob.core.windows.net/ptcg-img/sLD_13.jpg",
        "category": "trainer"
    },
	{
        "name": "先機球",
        "image": "https://hkbgstor.blob.core.windows.net/ptcg-img/sLD_11.jpg",
        "category": "trainer"
    },
	{
        "name": "先機球",
        "image": "https://hkbgstor.blob.core.windows.net/ptcg-img/sLD_11.jpg",
        "category": "trainer"
    },
	{
        "name": "先機球",
        "image": "https://hkbgstor.blob.core.windows.net/ptcg-img/sLD_11.jpg",
        "category": "trainer"
    },
	{
        "name": "先機球",
        "image": "https://hkbgstor.blob.core.windows.net/ptcg-img/sLD_11.jpg",
        "category": "trainer"
    },
	{
        "name": "活力之壺",
        "image": "https://hkbgstor.blob.core.windows.net/ptcg-img/s8b_134.jpg",
        "category": "trainer"
    },
	{
        "name": "活力之壺",
        "image": "https://hkbgstor.blob.core.windows.net/ptcg-img/s8b_134.jpg",
        "category": "trainer"
    },
	{
        "name": "惡之塔",
        "image": "https://hkbgstor.blob.core.windows.net/ptcg-img/s8b_166.jpg",
        "category": "stadium"
    },
	{
        "name": "惡之塔",
        "image": "https://hkbgstor.blob.core.windows.net/ptcg-img/s8b_166.jpg",
        "category": "stadium"
    },
	{
        "name": "惡之塔",
        "image": "https://hkbgstor.blob.core.windows.net/ptcg-img/s8b_166.jpg",
        "category": "stadium"
    },
	{
        "name": "寶可夢交替",
        "image": "https://hkbgstor.blob.core.windows.net/ptcg-img/sLD_15.jpg",
        "category": "trainer"
    },
{
        "name": "氣球",
        "image": "https://hkbgstor.blob.core.windows.net/ptcg-img/sK_21.jpg",
        "category": "tool"
    },
{
        "name": "氣球",
        "image": "https://hkbgstor.blob.core.windows.net/ptcg-img/sK_21.jpg",
        "category": "tool"
    },
	{
        "name": "講究腰帶",
        "image": "https://hkbgstor.blob.core.windows.net/ptcg-img/sLL_15.jpg",
        "category": "tool"
    },
	{
        "name": "講究腰帶",
        "image": "https://hkbgstor.blob.core.windows.net/ptcg-img/sLL_15.jpg",
        "category": "tool"
    },
	{
        "name": "博士的研究",
        "image": "https://hkbgstor.blob.core.windows.net/ptcg-img/sLD_19.jpg",
        "category": "trainer"
    },
	{
        "name": "博士的研究",
        "image": "https://hkbgstor.blob.core.windows.net/ptcg-img/sLD_19.jpg",
        "category": "trainer"
    },
	{
        "name": "博士的研究",
        "image": "https://hkbgstor.blob.core.windows.net/ptcg-img/sLD_19.jpg",
        "category": "trainer"
    },
	{
        "name": "博士的研究",
        "image": "https://hkbgstor.blob.core.windows.net/ptcg-img/sLD_19.jpg",
        "category": "trainer"
    },
	{
        "name": "希嘉娜的決心",
        "image": "https://hkbgstor.blob.core.windows.net/ptcg-img/s7R_65.jpg",
        "category": "trainer"
    },
	{
        "name": "冒險家的發現",
        "image": "https://hkbgstor.blob.core.windows.net/ptcg-img/s8b_157.jpg",
        "category": "trainer"
    },
	{
        "name": "老大的指令",
        "image": "https://hkbgstor.blob.core.windows.net/ptcg-img/sLD_20.jpg",
        "category": "trainer"
    },
	{
        "name": "老大的指令",
        "image": "https://hkbgstor.blob.core.windows.net/ptcg-img/sLD_20.jpg",
        "category": "trainer"
    },
	{
        "name": "老大的指令",
        "image": "https://hkbgstor.blob.core.windows.net/ptcg-img/sLD_20.jpg",
        "category": "trainer"
    },
	{
        "name": "聶梓",
        "image": "https://hkbgstor.blob.core.windows.net/ptcg-img/s4a_173.jpg",
        "category": "trainer"
    },
	{
        "name": "聶梓",
        "image": "https://hkbgstor.blob.core.windows.net/ptcg-img/s4a_173.jpg",
        "category": "trainer"
    },
	{
        "name": "一擊能量",
        "image": "https://hkbgstor.blob.core.windows.net/ptcg-img/s5I_70.jpg",
        "category": "energy"
    },
	{
        "name": "一擊能量",
        "image": "https://hkbgstor.blob.core.windows.net/ptcg-img/s5I_70.jpg",
        "category": "energy"
    },
	{
        "name": "一擊能量",
        "image": "https://hkbgstor.blob.core.windows.net/ptcg-img/s5I_70.jpg",
        "category": "energy"
    },
	{
        "name": "一擊能量",
        "image": "https://hkbgstor.blob.core.windows.net/ptcg-img/s5I_70.jpg",
        "category": "energy"
    },
	{
        "name": "雙重渦輪能量",
        "image": "https://hkbgstor.blob.core.windows.net/ptcg-img/s9_100.jpg",
        "category": "energy"
    },
	{
        "name": "雙重渦輪能量",
        "image": "https://hkbgstor.blob.core.windows.net/ptcg-img/s9_100.jpg",
        "category": "energy"
    },
	{
        "name": "雙重渦輪能量",
        "image": "https://hkbgstor.blob.core.windows.net/ptcg-img/s9_100.jpg",
        "category": "energy"
    },
	{
        "name": "基本惡能量",
        "image": "https://hkbgstor.blob.core.windows.net/ptcg-img/sLD_21.jpg",
        "category": "energy"
    },
	{
        "name": "基本惡能量",
        "image": "https://hkbgstor.blob.core.windows.net/ptcg-img/sLD_21.jpg",
        "category": "energy"
    },
	{
        "name": "基本惡能量",
        "image": "https://hkbgstor.blob.core.windows.net/ptcg-img/sLD_21.jpg",
        "category": "energy"
    },
	{
        "name": "基本惡能量",
        "image": "https://hkbgstor.blob.core.windows.net/ptcg-img/sLD_21.jpg",
        "category": "energy"
    },
	{
        "name": "基本惡能量",
        "image": "https://hkbgstor.blob.core.windows.net/ptcg-img/sLD_21.jpg",
        "category": "energy"
    },
	{
        "name": "基本惡能量",
        "image": "https://hkbgstor.blob.core.windows.net/ptcg-img/sLD_21.jpg",
        "category": "energy"
    }
]