{
  "token": "MTAwNzUzMjY0NzA2MjQ1MDE4OA.GobZI0.IL8KWkFrYT2smGM3VSKS2KPnvgrUYoJITmjwXM",
  "clientId": "1007532647062450188",
  "clientSecret": "n9P47VBV-_GL3ap3V1uwllis2H4CHsQ8",
  "ptcgwordDiscordId": "973487476389847101",
  "battleRoomCategoryId": "1011622213897691146",
  "battleStandByRoomId": "1011641232616865813"
}