\relax 
\providecommand\babel@aux[2]{}
\@nameuse{bbl@beforestart}
\catcode `"\active 
\providecommand\hyper@newdestlabel[2]{}
\providecommand\HyperFirstAtBeginDocument{\AtBeginDocument}
\HyperFirstAtBeginDocument{\ifx\hyper@anchor\@undefined
\global\let\oldnewlabel\newlabel
\gdef\newlabel#1#2{\newlabelxx{#1}#2}
\gdef\newlabelxx#1#2#3#4#5#6{\oldnewlabel{#1}{{#2}{#3}}}
\AtEndDocument{\ifx\hyper@anchor\@undefined
\let\newlabel\oldnewlabel
\fi}
\fi}
\global\let\hyper@last\relax 
\gdef\HyperFirstAtBeginDocument#1{#1}
\providecommand\HyField@AuxAddToFields[1]{}
\providecommand\HyField@AuxAddToCoFields[2]{}
\babel@aux{russian}{}
\@writefile{toc}{\contentsline {section}{\numberline {1}Введение}{3}{section.1}\protected@file@percent }
\@writefile{toc}{\contentsline {section}{\numberline {2}Матрица}{3}{section.2}\protected@file@percent }
\@writefile{toc}{\contentsline {section}{\numberline {3}Разреженная матрица}{3}{section.3}\protected@file@percent }
\@writefile{toc}{\contentsline {section}{\numberline {4}Схема Дженнингса}{3}{section.4}\protected@file@percent }
\@writefile{toc}{\contentsline {subsection}{\numberline {4.1}Описание}{3}{subsection.4.1}\protected@file@percent }
\@writefile{toc}{\contentsline {subsection}{\numberline {4.2}Алгоритм сжатия матрицы по схеме Дженнингса}{4}{subsection.4.2}\protected@file@percent }
\@writefile{toc}{\contentsline {subsection}{\numberline {4.3}Алгоритм суммы без распаковки двух матриц, упакованных по схеме Дженнингса}{4}{subsection.4.3}\protected@file@percent }
\@writefile{toc}{\contentsline {subsection}{\numberline {4.4}Алгоритм распаковки матрицы, упакованной по схеме Дженнингса}{5}{subsection.4.4}\protected@file@percent }
\@writefile{toc}{\contentsline {section}{\numberline {5}Кольцевая схема Рейнбольдта-Местеньи}{5}{section.5}\protected@file@percent }
\@writefile{toc}{\contentsline {subsection}{\numberline {5.1}Описание}{5}{subsection.5.1}\protected@file@percent }
\@writefile{toc}{\contentsline {subsection}{\numberline {5.2}Алгоритм добавления элемента в массив $an$}{5}{subsection.5.2}\protected@file@percent }
\@writefile{toc}{\contentsline {subsection}{\numberline {5.3}Алгоритм сжатия матриц по кольцевой схеме Рейнбольдта-Местеньи}{6}{subsection.5.3}\protected@file@percent }
\@writefile{toc}{\contentsline {subsection}{\numberline {5.4}Алгоритм определения столбцовой координаты элемента}{6}{subsection.5.4}\protected@file@percent }
\@writefile{toc}{\contentsline {subsection}{\numberline {5.5}Алгоритм определения строчной координаты элемента}{6}{subsection.5.5}\protected@file@percent }
\@writefile{toc}{\contentsline {subsection}{\numberline {5.6}Алгоритм распаковки матрицы, упакованной по кольцевой схеме Рейнбольдта-Местеньи}{6}{subsection.5.6}\protected@file@percent }
\@writefile{toc}{\contentsline {subsection}{\numberline {5.7}Алгоритм суммы без распаковки двух матриц, упакованных по кольцевой схеме Рейнбольдта-Местеньи}{6}{subsection.5.7}\protected@file@percent }
\@writefile{toc}{\contentsline {subsection}{\numberline {5.8}Алгоритм умножения без распаковки двух матриц, упакованных по кольцевой схеме Рейнбольдта-Местеньи}{7}{subsection.5.8}\protected@file@percent }
\@writefile{toc}{\contentsline {section}{\numberline {6}Реализация алгоритмов}{7}{section.6}\protected@file@percent }
\newlabel{lst:label1}{{1}{8}{Исходный код}{lstlisting.1}{}}
\@writefile{lol}{\contentsline {lstlisting}{\numberline {1}{\ignorespaces Исходный код}}{8}{lstlisting.1}\protected@file@percent }
\@writefile{toc}{\contentsline {section}{\numberline {7}Анализ эффективности}{24}{section.7}\protected@file@percent }
\@writefile{toc}{\contentsline {section}{\numberline {8}Тесты}{25}{section.8}\protected@file@percent }
\@writefile{toc}{\contentsline {subsection}{\numberline {8.1}Схема Дженнингса}{25}{subsection.8.1}\protected@file@percent }
\@writefile{lof}{\contentsline {figure}{\numberline {1}{\ignorespaces Вывод теста 1\relax }}{25}{figure.caption.3}\protected@file@percent }
\@writefile{lof}{\contentsline {figure}{\numberline {2}{\ignorespaces Вывод теста 2\relax }}{26}{figure.caption.4}\protected@file@percent }
\@writefile{lof}{\contentsline {figure}{\numberline {3}{\ignorespaces Вывод теста 3\relax }}{27}{figure.caption.5}\protected@file@percent }
\@writefile{lof}{\contentsline {figure}{\numberline {4}{\ignorespaces Вывод теста 4\relax }}{28}{figure.caption.6}\protected@file@percent }
\@writefile{lof}{\contentsline {figure}{\numberline {5}{\ignorespaces Вывод теста 5\relax }}{29}{figure.caption.7}\protected@file@percent }
\@writefile{lof}{\contentsline {figure}{\numberline {6}{\ignorespaces Вывод теста 6\relax }}{30}{figure.caption.8}\protected@file@percent }
\@writefile{toc}{\contentsline {subsection}{\numberline {8.2}Кольцевая схема Рейнбольдта-Местеньи, сложение матриц}{31}{subsection.8.2}\protected@file@percent }
\@writefile{lof}{\contentsline {figure}{\numberline {7}{\ignorespaces Вывод теста 7\relax }}{31}{figure.caption.9}\protected@file@percent }
\@writefile{lof}{\contentsline {figure}{\numberline {8}{\ignorespaces Вывод теста 8\relax }}{32}{figure.caption.10}\protected@file@percent }
\@writefile{lof}{\contentsline {figure}{\numberline {9}{\ignorespaces Вывод теста 9\relax }}{33}{figure.caption.11}\protected@file@percent }
\@writefile{lof}{\contentsline {figure}{\numberline {10}{\ignorespaces Вывод теста 10\relax }}{34}{figure.caption.12}\protected@file@percent }
\@writefile{lof}{\contentsline {figure}{\numberline {11}{\ignorespaces Вывод теста 11\relax }}{35}{figure.caption.13}\protected@file@percent }
\@writefile{lof}{\contentsline {figure}{\numberline {12}{\ignorespaces Вывод теста 12\relax }}{36}{figure.caption.14}\protected@file@percent }
\@writefile{toc}{\contentsline {subsection}{\numberline {8.3}Кольцевая схема Рейнбольдта-Местеньи, умножение матриц}{37}{subsection.8.3}\protected@file@percent }
\@writefile{lof}{\contentsline {figure}{\numberline {13}{\ignorespaces Вывод теста 13\relax }}{37}{figure.caption.15}\protected@file@percent }
\@writefile{lof}{\contentsline {figure}{\numberline {14}{\ignorespaces Вывод теста 14\relax }}{38}{figure.caption.16}\protected@file@percent }
\@writefile{lof}{\contentsline {figure}{\numberline {15}{\ignorespaces Вывод теста 15\relax }}{39}{figure.caption.17}\protected@file@percent }
\@writefile{lof}{\contentsline {figure}{\numberline {16}{\ignorespaces Вывод теста 16\relax }}{40}{figure.caption.18}\protected@file@percent }
\@writefile{lof}{\contentsline {figure}{\numberline {17}{\ignorespaces Вывод теста 17\relax }}{41}{figure.caption.19}\protected@file@percent }
\@writefile{lof}{\contentsline {figure}{\numberline {18}{\ignorespaces Вывод теста 18\relax }}{42}{figure.caption.20}\protected@file@percent }
\@writefile{toc}{\contentsline {section}{\numberline {9}Примеры работы}{43}{section.9}\protected@file@percent }
\@writefile{toc}{\contentsline {subsection}{\numberline {9.1}Схема Дженнингса}{43}{subsection.9.1}\protected@file@percent }
\@writefile{lof}{\contentsline {figure}{\numberline {19}{\ignorespaces Пример работы 1\relax }}{43}{figure.caption.21}\protected@file@percent }
\@writefile{lof}{\contentsline {figure}{\numberline {20}{\ignorespaces Пример работы 2\relax }}{44}{figure.caption.22}\protected@file@percent }
\@writefile{toc}{\contentsline {subsection}{\numberline {9.2}Кольцевая схема Рейнбольдта-Местеньи}{45}{subsection.9.2}\protected@file@percent }
\@writefile{lof}{\contentsline {figure}{\numberline {21}{\ignorespaces Пример работы 3\relax }}{45}{figure.caption.23}\protected@file@percent }
\@writefile{lof}{\contentsline {figure}{\numberline {22}{\ignorespaces Пример работы 3\relax }}{46}{figure.caption.24}\protected@file@percent }
\@writefile{lof}{\contentsline {figure}{\numberline {23}{\ignorespaces Пример работы 4\relax }}{47}{figure.caption.25}\protected@file@percent }
\@writefile{lof}{\contentsline {figure}{\numberline {24}{\ignorespaces Пример работы 4\relax }}{48}{figure.caption.26}\protected@file@percent }
\@writefile{toc}{\contentsline {section}{\numberline {10}Заключение}{49}{section.10}\protected@file@percent }
\bibcite{book}{1}
\@writefile{toc}{\contentsline {section}{Список используемых источников}{50}{section*.27}\protected@file@percent }
\gdef \@abspage@last{51}
