<?xml version="1.0" encoding="UTF-8" standalone="no"?>
<svg
   width="109.99984mm"
   height="119.99998mm"
   viewBox="0 0 17690.64 19298.871"
   version="1.1"
   id="svg3"
   sodipodi:docname="blurtkey.svg"
   inkscape:version="1.1 (c68e22c387, 2021-05-23)"
   xmlns:inkscape="http://www.inkscape.org/namespaces/inkscape"
   xmlns:sodipodi="http://sodipodi.sourceforge.net/DTD/sodipodi-0.dtd"
   xmlns="http://www.w3.org/2000/svg"
   xmlns:svg="http://www.w3.org/2000/svg">
  <defs
     id="defs7" />
  <sodipodi:namedview
     id="namedview5"
     pagecolor="#ffffff"
     bordercolor="#666666"
     borderopacity="1.0"
     inkscape:pageshadow="2"
     inkscape:pageopacity="0.0"
     inkscape:pagecheckerboard="true"
     inkscape:document-units="mm"
     showgrid="false"
     inkscape:zoom="0.897584"
     inkscape:cx="27.295495"
     inkscape:cy="241.20305"
     inkscape:window-width="1600"
     inkscape:window-height="837"
     inkscape:window-x="-8"
     inkscape:window-y="-8"
     inkscape:window-maximized="1"
     inkscape:current-layer="svg3"
     fit-margin-top="0"
     fit-margin-left="0"
     fit-margin-right="0"
     fit-margin-bottom="0" />
  <path
     id="Selection"
     fill="none"
     stroke="#000000"
     stroke-width="3.84618"
     d="m 7673.9027,1.9039186 c 0,0 2141.0427,0 2141.0427,0 0,0 794.2586,45.8231084 794.2586,45.8231084 1750.129,138.883613 3261.292,383.273543 4903.678,921.271153 569.448,186.68602 1129.572,400.24452 1657.583,656.23192 124.318,60.5318 444.783,196.3041 497.274,299.2648 24.863,48.9347 20.718,138.8837 20.718,192.9097 0,0 0,8231.1884 0,8231.1884 -1.38,710.542 -403.69,1495.76 -785.623,2121.443 -909.254,1488.97 -2890.753,3274.932 -4394.317,4389.113 0,0 -2555.4393,1799.832 -2555.4393,1799.832 0,0 -725.1923,461.343 -725.1923,461.343 -74.2455,45.54 -260.7237,162.643 -345.3294,175.089 -148.4915,21.497 -436.1513,-188.1 -552.5273,-263.058 0,0 -1381.3183,-902.886 -1381.3183,-902.886 C 5142.2918,16894.79 3170.1153,15369.896 1803.3011,13799.474 1110.57,13003.507 388.8313,12018.027 125.69021,11055.741 -37.305331,10459.192 7.587504,10043.673 7.587504,9443.4451 c 0,0 0,-2178.0128 0,-2178.0128 0,0 0,-5148.0277 0,-5148.0277 0.6906588,-303.7905 128.807896,-301.2447 448.928386,-458.2315 0,0 1208.65341,-509.7117 1208.65341,-509.7117 1156.5085,-444.37079 2842.0619,-823.11856 4109.4211,-976.14509 0,0 1105.0543,-115.972086 1105.0543,-115.972086 0,0 794.258,-55.4403054 794.258,-55.4403054 z M 11886.923,7293.7183 c 0,0 0,-1103.1492 0,-1103.1492 0,-814.35 12.087,-1307.9376 -601.911,-2008.2965 -186.822,-212.9918 -383.66,-365.1701 -641.275,-519.3284 -1526.7022,-913.3506 -3686.3932,-467.5659 -4530.3783,915.3306 -309.4154,506.6006 -304.2354,953.2339 -304.2354,1499.1518 0,0 0,1216.2917 0,1216.2917 0,0 1105.0545,0 1105.0545,0 0,0 0,-1442.5789 0,-1442.5789 0.6905,-389.2137 92.203,-754.6668 377.4452,-1074.8632 733.1345,-823.1185 2072.6675,-901.7534 2936.336,-169.7154 570.14,483.4062 553.909,990.0057 553.909,1612.2942 0,0 0,1074.8633 0,1074.8633 0,0 1105.055,0 1105.055,0 z m -6354.0631,539.978 c -234.1336,33.0941 -542.5126,-9.6172 -717.9399,121.6293 -160.5785,120.2151 -177.1542,410.4272 -179.917,582.9711 0,0 0,1810.2963 0,1810.2963 0,0 0,2489.159 0,2489.159 0.6905,402.509 215.831,536.867 690.659,537.434 0,0 5939.668,0 5939.668,0 0,0 966.923,0 966.923,0 135.716,0 362.94,11.597 483.459,-28.57 290.081,-96.171 344.988,-280.878 345.33,-508.864 0,0 0,-4384.3127 0,-4384.3127 -0.341,-134.9239 -6.215,-305.7706 -98.418,-423.156 -157.123,-199.9812 -601.563,-198.8499 -868.504,-196.587 0,0 -4316.6184,0 -4316.6184,0 0,0 -2244.6417,0 -2244.6417,0 z" />
  <path
     style="fill:#ef3b19;fill-opacity:1;stroke-width:32.7399"
     d="M 8507.8432,19099.628 C 7970.5383,18768.542 6599.5904,17849.109 5995.0536,17414.413 5243.1053,16873.721 3907.6686,15804.896 3330.062,15281.473 1520.6959,13641.848 397.55754,12092.461 107.62878,10836.087 48.435029,10579.578 43.762434,10244.59 43.762434,6257.4029 V 1955.4793 L 144.36737,1869.4627 C 262.79087,1768.2112 1728.8583,1148.5891 2250.4324,979.3513 3412.8193,602.18364 4804.9401,312.32712 6175.4114,162.12262 7318.0463,36.888991 7770.8304,17.102819 9110.7195,33.852912 11720.742,66.481079 13787.663,398.1442 15826.694,1111.516 c 681.982,238.5964 1621.639,653.8495 1757.191,776.5372 56.173,50.851 59.82,376.9178 50.109,4496.3892 l -10.436,4441.5646 -97.893,273.266 c -392.242,1094.91 -1069.495,2095.031 -2208.342,3261.128 -1087.101,1113.109 -2240.971,2062.602 -4059.298,3340.301 -1687.4675,1185.745 -2262.4227,1555.267 -2419.9106,1555.267 -42.0875,0 -190.6963,-70.351 -330.2432,-156.341 z m 4327.4488,-5777.814 c 265.421,-145.239 251.393,14.863 240.869,-2748.988 -10.491,-2754.1511 6.884,-2570.3131 -253.949,-2687.0612 -109.647,-49.077 -359.388,-53.064 -3861.3321,-61.648 -2680.151,-6.5694 -3797.8709,0.3132 -3933.313,24.2184 -214.261,37.8171 -308.618,114.0515 -380.4237,307.3578 -34.7281,93.4924 -45.3405,680.3552 -45.3405,2507.344 0,2277.537 3.0857,2390.363 68.2123,2497.75 40.5825,66.91 121.1735,135.397 198.962,169.069 126.2777,54.668 262.6597,56.643 3987.0729,57.905 l 3856.3211,1.326 z M 6944.9974,6403.6078 c 14.2227,-737.6367 29.3251,-945.0026 79.3079,-1088.9321 156.9849,-452.0515 524.5609,-812.2892 1043.9312,-1023.0911 289.4339,-117.4752 337.9911,-127.6647 670.9475,-140.7973 433.7629,-17.1085 738.4652,46.599 1073.3084,224.409 273.0066,144.9734 596.9416,431.1544 718.6226,634.8708 172.429,288.6763 201.023,492.52 201.708,1437.9867 l 0.628,866.7009 h 601.012 601.018 l -18.058,-1014.8548 c -19.346,-1087.6304 -45.564,-1262.5288 -245.396,-1637.1016 -306.248,-574.0568 -957.927,-1089.2999 -1682.9504,-1330.6096 -601.6184,-200.2358 -1443.678,-221.1836 -2077.2698,-51.6769 -826.0081,220.9857 -1505.1075,712.0445 -1863.5842,1347.5622 -230.765,409.1077 -243.2334,487.5599 -260.9969,1642.1949 l -16.0677,1044.4858 h 578.1362 578.136 z"
     id="path58" />
  <path
     style="fill:#ffffff;fill-opacity:1;stroke-width:32.7399"
     d="m 5112.6704,13328.646 c -238.7629,-33.335 -369.663,-139.28 -420.6515,-340.46 -26.8648,-105.997 -35.903,-880.059 -28.5792,-2447.543 l 10.7125,-2292.518 90.437,-148.1532 c 152.9224,-250.5172 -100.3735,-234.4453 3870.7161,-245.599 3541.9037,-9.9538 3928.2267,-0.7783 4163.3697,98.8231 220.08,93.2205 213.81,14.7815 213.663,2671.8511 -0.147,2349.678 -2.278,2426.149 -70.628,2517.963 -38.767,52.08 -115.304,118.748 -170.082,148.153 -94.22,50.577 -299.027,53.694 -3791.0518,57.786 -2030.2981,2.407 -3770.8566,-6.74 -3867.9067,-20.305 z"
     id="path3410" />
  <path
     style="fill:#ffffff;fill-opacity:1;stroke-width:32.7399"
     d="m 5858.5472,6255.4536 c 16.1614,-1109.5746 39.2811,-1243.9084 282.4892,-1641.3543 418.8609,-684.4934 1142.5851,-1155.1108 2049.2686,-1332.5802 424.2077,-83.0322 1126.2441,-67.6916 1512.1606,33.0431 1158.9834,302.5267 1980.9264,1103.0211 2114.5514,2059.3752 20.496,146.6727 37.395,630.0257 37.557,1074.1164 l 0.3,807.4392 h -524.537 -524.536 l -0.289,-822.2545 c -0.136,-452.2394 -16.676,-908.9247 -36.744,-1014.8549 -110.284,-582.1544 -729.822,-1133.1424 -1450.8757,-1290.3392 -258.8264,-56.4267 -730.873,-54.3795 -974.4634,4.2257 -507.4707,122.0926 -1008.3768,455.928 -1221.0128,813.759 -209.3792,352.3501 -228.912,463.9369 -249.9591,1427.9478 l -19.2459,881.5161 h -504.6147 -504.6145 z"
     id="path5280" />
</svg>
