<?xml version="1.0" encoding="UTF-8" standalone="no"?>
<svg
   width="260.36847mm"
   height="61.121998mm"
   viewBox="0 0 41873.5 9829.8777"
   version="1.1"
   id="svg5764"
   sodipodi:docname="bk_blurt.svg"
   inkscape:version="1.1 (c68e22c387, 2021-05-23)"
   xmlns:inkscape="http://www.inkscape.org/namespaces/inkscape"
   xmlns:sodipodi="http://sodipodi.sourceforge.net/DTD/sodipodi-0.dtd"
   xmlns="http://www.w3.org/2000/svg"
   xmlns:svg="http://www.w3.org/2000/svg">
  <defs
     id="defs5768" />
  <sodipodi:namedview
     id="namedview5766"
     pagecolor="#ffffff"
     bordercolor="#666666"
     borderopacity="1.0"
     inkscape:pageshadow="2"
     inkscape:pageopacity="0.0"
     inkscape:pagecheckerboard="true"
     inkscape:document-units="mm"
     showgrid="false"
     inkscape:zoom="0.67030021"
     inkscape:cx="434.87977"
     inkscape:cy="60.420688"
     inkscape:window-width="1600"
     inkscape:window-height="837"
     inkscape:window-x="-8"
     inkscape:window-y="-8"
     inkscape:window-maximized="1"
     inkscape:current-layer="svg5764"
     fit-margin-top="0"
     fit-margin-left="0"
     fit-margin-right="0"
     fit-margin-bottom="0" />
  <path
     style="display:inline;fill:#ffffff;fill-opacity:1;stroke-width:34.9296"
     d="M 10782.675,4285.0625 V 2466.492 h 1028.715 c 1099.188,0 1292.947,20.5403 1563.374,165.7347 232.257,124.6954 341.699,298.4456 387.292,614.8805 48.504,336.6883 -11.372,507.7158 -258.799,739.1385 -96.401,90.1744 -170.322,166.2914 -164.247,169.1486 322.097,151.8983 457.577,310.3586 519.217,607.3004 104.21,501.9697 -187.012,1048.9144 -659.304,1238.281 -189.074,75.8103 -249.237,80.0016 -1307.223,91.0615 l -1109.025,11.5951 z m 1956.762,1027.8511 c 131.532,-68.0154 179.776,-161.6577 179.776,-348.9371 0,-321.6993 -92.631,-375.9898 -674.221,-395.1578 -420.185,-13.8458 -445.08,-10.8039 -519.452,63.5616 -70.816,70.822 -76.63,103.5978 -62.292,351.3619 8.706,150.2896 36.12,297.7058 60.928,327.591 64.144,77.2935 866.44,78.5419 1015.26,1.574 z m 19.89,-1564.6969 c 111.321,-129.5641 111.323,-303.1618 0,-432.7273 -83.178,-96.7897 -89.773,-98.1253 -532.697,-107.7135 -255.609,-5.5292 -470.989,5.186 -500.852,24.9249 -38.414,25.3942 -52.389,100.9302 -52.389,283.229 0,344.7426 17.593,355.2668 570.72,341.23 423.052,-10.7295 432.551,-12.7378 515.216,-108.9431 z"
     id="path37962" />
  <path
     style="display:inline;fill:#ffffff;fill-opacity:1;stroke-width:34.9296"
     d="M 14590.036,4282.8444 V 2466.492 h 471.554 471.552 v 1397.1943 1397.194 h 838.304 838.33 v 419.1583 419.1579 h -1309.884 -1309.856 z"
     id="path43186" />
  <path
     style="display:inline;fill:#ffffff;fill-opacity:1;stroke-width:34.9296"
     d="m 18582.019,6083.452 c -486.747,-152.1231 -814.767,-541.1665 -915.441,-1085.7942 -22.082,-119.5011 -37.656,-684.7105 -37.656,-1367.4306 V 2466.492 h 487.297 487.297 l 10.476,1178.8831 c 9.899,1116.1558 14.393,1187.4168 84.649,1339.2851 105.482,228.0453 260.459,328.896 503.321,327.5191 261.71,-1.4824 411.06,-91.1487 522.778,-313.8587 87.256,-173.9358 87.329,-174.9282 97.802,-1352.9455 l 10.479,-1178.8831 h 487.289 487.295 l -0.508,1178.8831 c -0.561,1275.5244 -19.335,1450.1911 -192.551,1792.0165 -167.812,331.1627 -440.525,539.5089 -843.645,644.5061 -251.622,65.5414 -981.01,66.4943 -1188.812,1.5568 z"
     id="path43225" />
  <path
     style="display:inline;fill:#ffffff;fill-opacity:1;stroke-width:34.9296"
     d="M 21645.858,4282.8444 V 2466.492 h 941.389 c 996.358,0 1190.307,21.096 1491.87,162.26 467.19,218.6953 689.708,821.5248 517.415,1401.7022 -84.582,284.8604 -330.873,555.2019 -588.75,646.2657 -16.918,5.9789 124.542,316.6894 314.367,690.4737 189.833,373.7846 350.379,691.3969 356.778,705.8054 6.446,14.4153 -225.897,26.1975 -516.227,26.1975 h -527.89 l -280.177,-573.5301 c -154.1,-315.4414 -304.293,-593.5364 -333.755,-617.9885 -29.455,-24.4518 -146.541,-51.1845 -260.211,-59.4049 l -206.637,-14.9397 v 632.9357 632.9352 h -454.084 -454.088 z m 1923.093,-300.1656 c 138.381,-138.4276 170.692,-335.9544 84.612,-517.3605 -93.215,-196.43 -193.197,-230.3693 -678.64,-230.3693 h -420.893 v 440.131 440.1313 l 453.45,-12.2432 453.449,-12.2424 z"
     id="path43264" />
  <path
     style="display:inline;fill:#ffffff;fill-opacity:1;stroke-width:34.9296"
     d="M 26186.739,4702.0029 V 3304.8086 h -523.951 -523.951 V 2885.6513 2466.492 h 1519.454 1519.447 v 419.1593 419.1573 h -523.944 -523.95 v 1397.1943 1397.1936 h -471.553 -471.552 z"
     id="path43303" />
  <path
     style="display:inline;fill:#ffffff;fill-opacity:1;stroke-width:34.9296"
     d="M 28841.405,4282.8444 V 2466.492 h 492.233 492.231 l -11.986,681.1556 c -6.594,374.635 -4.047,680.5551 5.54,679.8227 9.592,-0.7325 221.809,-277.2252 471.553,-614.4282 249.752,-337.2027 491.576,-643.1229 537.394,-679.823 74.188,-59.426 144.408,-66.7269 641.678,-66.7269 h 558.375 l -133.845,165.9177 c -73.604,91.2543 -268.669,323.1005 -433.469,515.2155 -454.849,530.2385 -460.229,538.448 -433.612,661.3741 12.737,58.894 272.718,588.9614 577.707,1177.9254 304.978,588.9638 554.514,1080.1649 554.514,1091.5576 0,34.3717 -966.856,23.2363 -1060.082,-12.2127 -68.005,-25.851 -162.268,-187.005 -438.898,-750.3036 -193.765,-394.5593 -352.302,-733.4082 -352.302,-752.9981 0,-83.5782 -79.134,-20.2713 -263.527,210.8333 l -196.634,246.4506 -19.693,539.4706 -19.685,539.4706 h -483.762 -483.753 z"
     id="path43342" />
  <path
     style="display:inline;fill:#ffffff;fill-opacity:1;stroke-width:34.9296"
     d="M 32753.547,4282.8444 V 2466.492 h 1379.729 1379.729 v 401.6947 401.6918 h -908.174 -908.179 v 279.4389 279.439 h 558.878 558.878 v 384.2285 384.2282 h -558.878 -558.878 v 349.2986 349.2981 h 925.643 925.641 v 401.6936 401.6931 H 34150.74 32753.547 Z"
     id="path43381" />
  <path
     style="display:inline;fill:#ffffff;fill-opacity:1;stroke-width:34.9296"
     d="m 37253.436,5426.7972 -11.387,-672.3997 -125.123,-227.0439 c -68.824,-124.8742 -361.88,-635.7233 -651.244,-1135.2198 l -526.122,-908.1771 524.28,-9.6651 c 330.842,-6.0974 540.671,3.9413 568.705,27.2053 24.44,20.2792 189.836,354.7145 367.559,743.1915 177.724,388.4765 334.298,718.8696 347.941,734.208 13.636,15.3386 60.597,-70.2737 104.338,-190.2477 115.263,-316.1268 536.524,-1189.3797 608.32,-1261.0307 52.672,-52.5615 131.879,-61.1274 565.239,-61.1274 277.194,0 503.989,8.2271 503.989,18.2963 0,22.874 -938.726,1663.8596 -1093.875,1912.1988 -203.837,326.2719 -208.678,348.7217 -225.805,1047.2741 l -16.064,654.9344 h -464.681 -464.677 z"
     id="path43420" />
  <path
     id="Selection"
     fill="none"
     stroke="#000000"
     stroke-width="1.4999"
     d="m 5129.5106,1235.4393 c 0,0 834.9444,0 834.9444,0 0,0 309.7376,17.8697 309.7376,17.8697 682.4991,54.1605 1271.8088,149.4655 1912.2908,359.2689 222.069,72.8021 440.501,156.0837 646.41,255.9113 48.48,23.6056 173.452,76.5529 193.922,116.7046 9.696,19.0831 8.079,54.1606 8.079,75.2291 0,0 0,3209.9237 0,3209.9237 -0.538,277.0907 -157.427,583.3028 -306.369,827.301 -354.583,580.6549 -1127.31,1277.1281 -1713.6562,1711.6259 0,0 -996.5467,701.882 -996.5467,701.882 0,0 -282.8039,179.911 -282.8039,179.911 -28.9538,17.759 -101.6749,63.426 -134.6685,68.279 -57.9073,8.383 -170.0865,-73.353 -215.4694,-102.585 0,0 -538.674,-352.099 -538.674,-352.099 -704.4506,-481.489 -1473.5421,-1076.153 -2006.5598,-1688.5718 -270.145,-310.4039 -551.602,-694.7125 -654.2194,-1069.976 -63.5635,-232.6367 -46.0566,-394.677 -46.0566,-628.7484 0,0 0,-849.3615 0,-849.3615 0,0 0,-2007.5809 0,-2007.5809 0.2693,-118.4694 50.2313,-117.4766 175.069,-178.6969 0,0 471.3396,-198.7727 471.3396,-198.7727 451.0046,-173.2917 1108.3214,-320.9923 1602.5545,-380.6682 0,0 430.9389,-45.2257 430.9389,-45.2257 0,0 309.7377,-21.6201 309.7377,-21.6201 z m 1642.955,2843.5952 c 0,0 0,-430.1961 0,-430.1961 0,-317.5727 4.7136,-510.0575 -234.7278,-783.1771 -72.8549,-83.0606 -149.6161,-142.4057 -250.0783,-202.523 -595.3696,-356.1801 -1437.5862,-182.337 -1766.7156,356.9523 -120.6631,197.5595 -118.643,371.7335 -118.643,584.6256 0,0 0,474.3183 0,474.3183 0,0 430.9389,0 430.9389,0 0,0 0,-562.5638 0,-562.5638 0.2694,-151.782 35.9565,-294.298 147.1928,-419.1653 285.901,-320.9922 808.2797,-351.6576 1145.0853,-66.1841 222.338,188.5144 216.0084,386.0734 216.0084,628.7478 0,0 0,419.1654 0,419.1654 0,0 430.9393,0 430.9393,0 z m -2477.8995,210.5757 c -91.3052,12.9057 -211.564,-3.7505 -279.9756,47.4319 -62.6209,46.8803 -69.0849,160.0546 -70.1623,227.3417 0,0 0,705.9628 0,705.9628 0,0 0,970.6995 0,970.6995 0.2692,156.9668 84.1678,209.3625 269.337,209.5836 0,0 2316.2972,0 2316.2972,0 0,0 377.0721,0 377.0721,0 52.925,0 141.5359,4.5225 188.5349,-11.1414 113.123,-37.5039 134.535,-109.5343 134.668,-198.4422 0,0 0,-1709.7542 0,-1709.7542 -0.133,-52.6164 -2.423,-119.2416 -38.38,-165.0185 -61.2729,-77.9869 -234.5918,-77.5457 -338.6909,-76.6632 0,0 -1683.3553,0 -1683.3553,0 0,0 -875.3451,0 -875.3451,0 z" />
  <path
     style="fill:#ef3b19;fill-opacity:1;stroke-width:12.7676"
     d="m 5454.7231,8682.9955 c -209.5333,-129.114 -744.1629,-487.666 -979.9148,-657.185 -293.238,-210.854 -814.0194,-627.6647 -1039.2691,-831.7844 -705.6001,-639.4059 -1143.5913,-1243.6217 -1256.6551,-1733.571 -23.0839,-100.0311 -24.906,-230.6666 -24.906,-1785.5534 V 1997.2768 l 39.233,-33.544 c 46.1817,-39.4851 617.9053,-281.1197 821.304,-347.1175 453.297,-147.0844 996.1836,-260.12 1530.6273,-318.6954 445.5944,-48.8375 622.1669,-56.5535 1144.6848,-50.0214 1017.8329,12.724 1823.8722,142.063 2619.0342,420.2572 265.953,93.0456 632.392,254.9822 685.254,302.8269 21.905,19.8304 23.327,146.9869 19.54,1753.4608 l -4.069,1732.0808 -38.175,106.5657 c -152.964,426.9831 -417.072,817.0011 -861.19,1271.745 -423.937,434.0801 -873.913,804.3546 -1583.0078,1302.6196 -658.063,462.406 -882.2788,606.509 -943.6946,606.509 -16.4127,0 -74.366,-27.434 -128.785,-60.968 z M 7142.3018,6429.8162 c 103.5066,-56.639 98.0366,5.7961 93.9316,-1072.0252 -4.091,-1074.0387 2.685,-1002.3473 -99.0324,-1047.8756 -42.7589,-19.1386 -140.1508,-20.6934 -1505.8067,-24.041 -1045.1809,-2.5618 -1481.0592,0.1222 -1533.8777,9.4445 -83.5555,14.7476 -120.352,44.4768 -148.3541,119.8606 -13.543,36.4593 -17.6815,265.3187 -17.6815,977.7911 0,888.1731 1.2033,932.172 26.6008,974.0498 15.826,26.0929 47.2541,52.8008 77.5894,65.9319 49.2446,21.319 102.4298,22.0892 1554.8423,22.5813 l 1503.853,0.5171 z M 4845.2587,3731.9173 c 5.5466,-287.6568 11.4359,-368.5235 30.9279,-424.6518 61.2193,-176.2869 204.5635,-316.7691 407.1026,-398.9757 112.8707,-45.8119 131.8065,-49.7855 261.6499,-54.9069 169.1549,-6.6718 287.98,18.1723 418.5593,87.513 106.4645,56.5354 232.7896,168.1377 280.2417,247.5811 67.2421,112.5754 78.3929,192.0685 78.66,560.773 l 0.2449,337.9881 h 234.3773 234.3795 l -7.0421,-395.7638 c -7.5444,-424.1442 -17.7686,-492.3495 -95.6971,-638.422 -119.428,-223.8654 -373.5639,-424.7952 -656.3019,-518.899 -234.6135,-78.0861 -562.9922,-86.2551 -810.0743,-20.1525 -322.1193,86.178 -586.9483,277.6767 -726.7437,525.5101 -89.9918,159.54 -94.854,190.1341 -101.7814,640.4081 l -6.2657,407.3191 h 225.4562 225.4563 z"
     id="path58" />
  <path
     style="fill:#ffffff;fill-opacity:1;stroke-width:12.7676"
     d="m 4130.7044,6432.4805 c -93.1105,-12.9997 -144.1577,-54.3152 -164.0417,-132.7695 -10.4765,-41.3357 -14.0012,-343.1974 -11.1451,-954.4705 l 4.1776,-894.0152 35.2678,-57.7754 c 59.6353,-97.6945 -39.1428,-91.4269 1509.4666,-95.7765 1381.2393,-3.8817 1531.8939,-0.3035 1623.593,38.5381 85.8248,36.3533 83.3798,5.7644 83.3218,1041.9441 -0.06,916.306 -0.888,946.1275 -27.543,981.9322 -15.118,20.3097 -44.9649,46.3083 -66.3264,57.7754 -36.7431,19.7236 -116.612,20.9391 -1478.3999,22.5349 -791.757,0.9386 -1470.5244,-2.6285 -1508.3711,-7.9184 z"
     id="path3410" />
  <path
     style="fill:#ffffff;fill-opacity:1;stroke-width:12.7676"
     d="m 4421.5748,3674.1415 c 6.3024,-432.7018 15.3185,-485.088 110.1623,-640.0804 163.3439,-266.9325 445.5749,-450.4595 799.1552,-519.6674 165.4287,-32.3802 439.2024,-26.3978 589.6987,12.8858 451.9696,117.9766 772.5037,430.1461 824.6132,803.0964 7.9929,57.198 14.583,245.6916 14.6462,418.8741 l 0.117,314.8777 h -204.5542 -204.5537 l -0.1127,-320.6553 c -0.053,-176.3601 -6.5032,-354.4541 -14.3291,-395.7638 -43.0073,-227.0233 -284.6091,-441.8926 -565.7993,-503.1947 -100.9348,-22.0048 -285.0189,-21.2065 -380.0121,1.6479 -197.8989,47.6125 -393.2376,177.7986 -476.1596,317.3423 -81.6515,137.4062 -89.2688,180.9218 -97.4765,556.858 l -7.5054,343.7656 h -196.7852 -196.7847 z"
     id="path5280" />
</svg>
