<svg width="34" height="42" viewBox="0 0 34 42" fill="none" xmlns="http://www.w3.org/2000/svg">
<path d="M17 0.833344L0.5 8.16668V19.1667C0.5 29.3417 7.54 38.8567 17 41.1667C26.46 38.8567 33.5 29.3417 33.5 19.1667V8.16668L17 0.833344ZM22.6467 28.3333L17 24.9417L11.3717 28.3333L12.8567 21.9167L7.88833 17.6267L14.4517 17.0583L17 11.0083L19.5483 17.04L26.1117 17.6083L21.1433 21.9167L22.6467 28.3333Z" fill="#7454A9"/>
</svg>
