<svg width="104" height="104" viewBox="0 0 104 104" fill="none" xmlns="http://www.w3.org/2000/svg">
<g clip-path="url(#clip0_36_90)">
<path d="M34.7969 54C29.7344 54.1562 25.5938 56.1562 22.375 60H16.0938C13.5312 60 11.375 59.3672 9.625 58.1016C7.875 56.8359 7 54.9844 7 52.5469C7 41.5156 8.9375 36 12.8125 36C13 36 13.6797 36.3281 14.8516 36.9844C16.0234 37.6406 17.5469 38.3047 19.4219 38.9766C21.2969 39.6484 23.1562 39.9844 25 39.9844C27.0938 39.9844 29.1719 39.625 31.2344 38.9062C31.0781 40.0625 31 41.0938 31 42C31 46.3438 32.2656 50.3438 34.7969 54ZM85 83.8594C85 87.6094 83.8594 90.5703 81.5781 92.7422C79.2969 94.9141 76.2656 96 72.4844 96H31.5156C27.7344 96 24.7031 94.9141 22.4219 92.7422C20.1406 90.5703 19 87.6094 19 83.8594C19 82.2031 19.0547 80.5859 19.1641 79.0078C19.2734 77.4297 19.4922 75.7266 19.8203 73.8984C20.1484 72.0703 20.5625 70.375 21.0625 68.8125C21.5625 67.25 22.2344 65.7266 23.0781 64.2422C23.9219 62.7578 24.8906 61.4922 25.9844 60.4453C27.0781 59.3984 28.4141 58.5625 29.9922 57.9375C31.5703 57.3125 33.3125 57 35.2188 57C35.5312 57 36.2031 57.3359 37.2344 58.0078C38.2656 58.6797 39.4062 59.4297 40.6562 60.2578C41.9062 61.0859 43.5781 61.8359 45.6719 62.5078C47.7656 63.1797 49.875 63.5156 52 63.5156C54.125 63.5156 56.2344 63.1797 58.3281 62.5078C60.4219 61.8359 62.0938 61.0859 63.3438 60.2578C64.5938 59.4297 65.7344 58.6797 66.7656 58.0078C67.7969 57.3359 68.4688 57 68.7812 57C70.6875 57 72.4297 57.3125 74.0078 57.9375C75.5859 58.5625 76.9219 59.3984 78.0156 60.4453C79.1094 61.4922 80.0781 62.7578 80.9219 64.2422C81.7656 65.7266 82.4375 67.25 82.9375 68.8125C83.4375 70.375 83.8516 72.0703 84.1797 73.8984C84.5078 75.7266 84.7266 77.4297 84.8359 79.0078C84.9453 80.5859 85 82.2031 85 83.8594ZM37 24C37 27.3125 35.8281 30.1406 33.4844 32.4844C31.1406 34.8281 28.3125 36 25 36C21.6875 36 18.8594 34.8281 16.5156 32.4844C14.1719 30.1406 13 27.3125 13 24C13 20.6875 14.1719 17.8594 16.5156 15.5156C18.8594 13.1719 21.6875 12 25 12C28.3125 12 31.1406 13.1719 33.4844 15.5156C35.8281 17.8594 37 20.6875 37 24ZM70 42C70 46.9688 68.2422 51.2109 64.7266 54.7266C61.2109 58.2422 56.9688 60 52 60C47.0312 60 42.7891 58.2422 39.2734 54.7266C35.7578 51.2109 34 46.9688 34 42C34 37.0312 35.7578 32.7891 39.2734 29.2734C42.7891 25.7578 47.0312 24 52 24C56.9688 24 61.2109 25.7578 64.7266 29.2734C68.2422 32.7891 70 37.0312 70 42ZM97 52.5469C97 54.9844 96.125 56.8359 94.375 58.1016C92.625 59.3672 90.4688 60 87.9062 60H81.625C78.4062 56.1562 74.2656 54.1562 69.2031 54C71.7344 50.3438 73 46.3438 73 42C73 41.0938 72.9219 40.0625 72.7656 38.9062C74.8281 39.625 76.9062 39.9844 79 39.9844C80.8438 39.9844 82.7031 39.6484 84.5781 38.9766C86.4531 38.3047 87.9766 37.6406 89.1484 36.9844C90.3203 36.3281 91 36 91.1875 36C95.0625 36 97 41.5156 97 52.5469ZM91 24C91 27.3125 89.8281 30.1406 87.4844 32.4844C85.1406 34.8281 82.3125 36 79 36C75.6875 36 72.8594 34.8281 70.5156 32.4844C68.1719 30.1406 67 27.3125 67 24C67 20.6875 68.1719 17.8594 70.5156 15.5156C72.8594 13.1719 75.6875 12 79 12C82.3125 12 85.1406 13.1719 87.4844 15.5156C89.8281 17.8594 91 20.6875 91 24Z" fill="#EC3237"/>
</g>
<defs>
<clipPath id="clip0_36_90">
<rect width="104" height="104" fill="white"/>
</clipPath>
</defs>
</svg>
