<svg width="88" height="62" viewBox="0 0 88 62" fill="none" xmlns="http://www.w3.org/2000/svg">
<path d="M80.7273 0H6.72727C4.94309 0 3.23198 0.591647 1.97037 1.64479C0.708764 2.69792 0 4.12629 0 5.61565V56.1565C0 57.6459 0.708764 59.0742 1.97037 60.1274C3.23198 61.1805 4.94309 61.7721 6.72727 61.7721H80.7273C82.5115 61.7721 84.2226 61.1805 85.4842 60.1274C86.7458 59.0742 87.4545 57.6459 87.4545 56.1565V5.61565C87.4545 4.12629 86.7458 2.69792 85.4842 1.64479C84.2226 0.591647 82.5115 0 80.7273 0ZM28.9273 37.0633C29.6409 37.5101 30.1128 38.1753 30.2389 38.9125C30.3651 39.6497 30.1353 40.3985 29.6 40.9942C29.0647 41.59 28.2679 41.9838 27.3848 42.0891C26.5017 42.1945 25.6046 42.0026 24.8909 41.5558L11.4364 33.1323C11.0186 32.8708 10.6795 32.5317 10.446 32.1418C10.2125 31.7519 10.0909 31.322 10.0909 30.8861C10.0909 30.4502 10.2125 30.0203 10.446 29.6304C10.6795 29.2405 11.0186 28.9014 11.4364 28.6398L24.8909 20.2163C25.6046 19.7695 26.5017 19.5777 27.3848 19.683C28.2679 19.7883 29.0647 20.1822 29.6 20.7779C30.1353 21.3736 30.3651 22.1225 30.2389 22.8597C30.1128 23.5969 29.6409 24.262 28.9273 24.7089L19.0592 30.8861L28.9273 37.0633ZM53.6878 12.0034L40.2333 51.313C40.1186 51.6738 39.9189 52.0119 39.6459 52.3075C39.3728 52.6032 39.0318 52.8504 38.643 53.0347C38.2541 53.219 37.8251 53.3367 37.3811 53.381C36.937 53.4253 36.4869 53.3952 36.0569 53.2925C35.627 53.1899 35.2259 53.0166 34.8771 52.783C34.5283 52.5494 34.2388 52.2601 34.0256 51.932C33.8123 51.6039 33.6796 51.2435 33.6351 50.8721C33.5907 50.5007 33.6354 50.1255 33.7667 49.7687L47.2212 10.4591C47.4798 9.75626 48.0584 9.1661 48.8326 8.81546C49.6069 8.46483 50.515 8.3817 51.3618 8.58394C52.2087 8.78618 52.9267 9.25765 53.3617 9.89705C53.7966 10.5364 53.9137 11.2927 53.6878 12.0034ZM76.0182 33.1323L62.5636 41.5558C61.85 42.0026 60.9529 42.1945 60.0698 42.0891C59.1866 41.9838 58.3898 41.59 57.8545 40.9942C57.3193 40.3985 57.0895 39.6497 57.2156 38.9125C57.3418 38.1753 57.8136 37.5101 58.5273 37.0633L68.3953 30.8861L58.5273 24.7089C58.1739 24.4876 57.8762 24.2104 57.6511 23.8932C57.4261 23.5759 57.2781 23.2247 57.2156 22.8597C57.1532 22.4947 57.1774 22.1229 57.2871 21.7657C57.3967 21.4086 57.5895 21.0729 57.8545 20.7779C58.1196 20.4829 58.4516 20.2344 58.8317 20.0465C59.2118 19.8587 59.6325 19.7351 60.0698 19.683C60.507 19.6308 60.9523 19.6511 61.3802 19.7426C61.8081 19.8341 62.2103 19.9951 62.5636 20.2163L76.0182 28.6398C76.4359 28.9014 76.775 29.2405 77.0085 29.6304C77.2421 30.0203 77.3636 30.4502 77.3636 30.8861C77.3636 31.322 77.2421 31.7519 77.0085 32.1418C76.775 32.5317 76.4359 32.8708 76.0182 33.1323Z" fill="#1D1C28"/>
</svg>
