<svg xmlns="http://www.w3.org/2000/svg" width="62.826" height="64.038" viewBox="0 0 62.826 64.038">
  <g id="Group_297" data-name="Group 297" transform="translate(-4141.621 -3070.188)">
    <path id="Subtraction_18" data-name="Subtraction 18" d="M38.687,52.092H13.406A13.395,13.395,0,0,1,0,38.687V15.5a20.127,20.127,0,0,0,4.114,7.785v13.4A11.3,11.3,0,0,0,15.4,47.979H36.69A11.3,11.3,0,0,0,47.979,36.69V26.085a11.579,11.579,0,0,1,.879.947,44.927,44.927,0,0,1,3.235,4.893v6.762A13.4,13.4,0,0,1,38.687,52.092Zm13.406-31.3h0c-.284-.3-.575-.578-.866-.839.2-.078.4-.148.579-.211.093-.032.189-.063.288-.093v1.145ZM49.462,14.9h0l.021-.018c.048-.041.1-.087.15-.126a8.605,8.605,0,0,1,1.86-1.091,6.252,6.252,0,0,0-2.874-1.521,3.935,3.935,0,0,0-.639-.1V4.114h-5.75a11.74,11.74,0,0,0-3.064-2.859C38.5.829,37.785.406,37.05,0H52.093V14.536c-.153-.011-.309-.017-.464-.017a6.434,6.434,0,0,0-2.167.377ZM1.1,8.083h0A13.419,13.419,0,0,1,9.561.559,24.337,24.337,0,0,0,5.243,3.312,15.32,15.32,0,0,0,1.371,7.683L1.2,7.944l-.052.069L1.1,8.082Z" transform="translate(4146.988 3082.134)" fill="#28dbef"/>
    <g id="Group_285" data-name="Group 285" transform="translate(4141.621 3070.188)">
      <path id="Path_352" data-name="Path 352" d="M547.673,1085.4c-6.841,3.269-11.535,8-13.909,14.919-4.105-5.683-.871-12.059,9.091-17.987-3.683-2.208-11.977-2.943-18.4-1.632,1.313-3.367,6.523-6.381,10.33-6.023a20.148,20.148,0,0,1,9.2,3.654,11.915,11.915,0,0,0,2.265,1.3c-2.751-3.245-3.434-8.109-8.25-9.863a10.745,10.745,0,0,1,11.624,9.13c4.167-2.863,8.09-6.185,13.6-5.364a23.532,23.532,0,0,1,13.286,6.8c-6.479-.512-12.568-.46-18.658,1.167.675.125,1.349.255,2.024.376.691.125,1.385.233,2.075.365,6.476,1.241,11.09,6.606,10.949,12.73-.005.219-.052.437-.113.92-5.724-6.574-12.92-9.583-21.528-10.212,5.662,13.123,10.9,26.114,14.124,39.682,2.036-7.227,4.107-14.579,6.168-21.895-3.467-.484-7.2,1.9-9.628,6.37-1.151-2.816.576-6.039,5.291-9.4l-7.977-.777c3.866-3.233,8.337-3.444,13.67-.63,1.035-3.2,2.239-4.016,5.972-4.016l-3.369,3.876.172.42c4-2.785,7.859-2.761,11.6.469-3.54-.661-6.971-.693-10.058,1.483,6,4.049,7.375,6.744,5.4,10.568-2.851-5.187-4.958-7.346-8.5-8.569-4.477,8.186-5.588,16.888-5.22,26.118,0,0,.111.241-3.02.259s-9.411,0-9.411,0C557.2,1114.24,555.129,1099.4,547.673,1085.4Z" transform="translate(-524.454 -1069.695)" fill="#07193a"/>
    </g>
  </g>
</svg>
