<svg xmlns="http://www.w3.org/2000/svg" width="37.582" height="37.583" viewBox="0 0 37.582 37.583">
  <g id="Group_305" data-name="Group 305" transform="translate(1314.348 108.874)">
    <path id="Path_396" data-name="Path 396" d="M-1282.263-103.377a18.822,18.822,0,0,0-26.588,0,18.824,18.824,0,0,0,0,26.588,18.742,18.742,0,0,0,13.294,5.5,18.741,18.741,0,0,0,13.294-5.5A18.824,18.824,0,0,0-1282.263-103.377Zm-1.768,24.82a16.32,16.32,0,0,1-23.052,0,16.321,16.321,0,0,1,0-23.053,16.25,16.25,0,0,1,11.526-4.765,16.254,16.254,0,0,1,11.526,4.765A16.321,16.321,0,0,1-1284.031-78.557Z" fill="#28dbef"/>
    <path id="Path_397" data-name="Path 397" d="M-1303.557-90.431v2.273a2.5,2.5,0,0,0,.818,1.849l5.394,4.9,9.294-12.5a2.5,2.5,0,0,0,.494-1.492v-3.362l-10.147,13.65Z" fill="#28dbef"/>
  </g>
</svg>
