[
    {
        "id": 0,
        "title": "Sortir le chien",
        "done": false
    },
    {
        "id": 1,
        "title": "Faire la vaisselle",
        "done": false
    },
    {
        "id": 2,
        "title": "Lire un livre",
        "done": false
    }
]