jam_tanggal,id_transaksi,nama,nominal,fee,status
2023-08-22 08:23:00,2023082210121420010100166259219248208,UJANG DAHLAN,Rp51.900,Rp100,Berhasil diterima
2023-08-22 08:20:00,2023082210121420010100166948018800191,YAYU LESTARI,Rp450.000,Rp100,Berhasil diterima
2023-08-22 08:20:00,2023082210121420010100166783919757517,YULIE ROSSANA,Rp50.000,Rp100,Berhasil diterima
2023-08-22 08:20:00,2023082210121420010100166554520489914,NENG LILIS,Rp20.000,Rp100,Berhasil diterima
2023-08-22 08:20:00,2023082210121420010100166641818877215,SANDI RIKI SAPUTRA,Rp400.000,Rp100,Berhasil diterima
2023-08-22 08:20:00,2023082210121420010100166982519308524,DESI SUGIARTI,Rp23.500,Rp100,Berhasil diterima
2023-08-22 08:20:00,2023082210121420010100166081019262016,FERY ANGRIAWAN,Rp20.000,Rp100,Berhasil diterima
2023-08-22 08:19:00,2023082210121420010100166544218765570,FERDIAN DWI KURNIAWAN,Rp25.000,Rp100,Berhasil diterima
2023-08-22 08:19:00,2023082210121420010100166378318795325,ADHITYA SENTYKA SALEH,Rp50.000,Rp100,Berhasil diterima
2023-08-22 08:19:00,2023082210121420010100166881320010430,PURNAMA DIPA,Rp50.000,Rp100,Berhasil diterima
2023-08-22 08:19:00,2023082210121420010100166888919967604,MARDIANSYAH,Rp19.500,Rp100,Berhasil diterima
2023-08-22 08:19:00,2023082210121420010100166718818962931,SUGIANTO,Rp50.000,Rp100,Berhasil diterima
2023-08-22 08:19:00,2023082210121420010100166611819361046,WARDIMAN,Rp25.000,Rp100,Berhasil diterima
2023-08-22 08:19:00,2023082210121420010100166846119352104,IVAN ADI PAMBUKO,Rp40.000,Rp100,Berhasil diterima
2023-08-22 08:19:00,2023082210121420010100166867719594470,ANDRIAN,Rp100.000,Rp100,Berhasil diterima
2023-08-22 08:18:00,2023082210121420010100166512719659956,ARIF SUPRAPTO,Rp150.000,Rp100,Berhasil diterima
2023-08-22 08:18:00,2023082210121420010100166316518631141,IKA RAFIKA,Rp100.000,Rp100,Berhasil diterima
2023-08-22 08:17:00,2023082210121420010100166623719454433,WAHYU HIURAH,Rp20.000,Rp100,Berhasil diterima
2023-08-22 08:17:00,2023082210121420010100166635319380277,AISTI TRI SUSILAWATI,Rp15.500,Rp100,Berhasil diterima
2023-08-22 08:17:00,2023082210121420010100166502319285480,SUGENG,Rp50.000,Rp100,Berhasil diterima
2023-08-22 08:17:00,2023082210121420010100166578618989910,DOAN RAMLAN,Rp50.000,Rp100,Berhasil diterima
2023-08-22 08:17:00,2023082210121420010100166635019371353,PIKI ANDRIYANSYAH,Rp45.000,Rp100,Berhasil diterima
2023-08-22 08:17:00,2023082210121420010100166443819147455,FATHUS SOBIR,Rp100.000,Rp100,Berhasil diterima
2023-08-22 08:16:00,2023082210121420010100166541218733590,TUSIYEM,Rp37.500,Rp100,Berhasil diterima
2023-08-22 08:16:00,2023082210121420010100166325618952593,WIDODO,Rp25.000,Rp100,Berhasil diterima
2023-08-22 08:16:00,2023082210121420010100166128419211558,DANDI AKBAR RESFATY,Rp20.000,Rp100,Berhasil diterima
2023-08-22 08:16:00,2023082210121420010100166000418928470,OLFIN PETIUNAUNG,Rp100.000,Rp100,Berhasil diterima
2023-08-22 08:15:00,2023082210121420010100166362519313821,AAS,Rp40.000,Rp100,Berhasil diterima
2023-08-22 08:15:00,2023082210121420010100166974819155846,RIDIK ARDIANSYAH,Rp47.000,Rp100,Berhasil diterima
2023-08-22 08:15:00,2023082210121420010100166612919391864,KHOLIK SETIAWAN,Rp100.000,Rp100,Berhasil diterima
2023-08-22 08:15:00,2023082210121420010100166574619053705,DUDI IRAWAN,Rp28.300,Rp100,Berhasil diterima
2023-08-22 08:15:00,2023082210121420010100166161419717883,AJI SETIAWAN,Rp100.000,Rp100,Berhasil diterima
2023-08-22 08:15:00,2023082210121420010100166866019650085,PITRIYADI,Rp59.000,Rp100,Berhasil diterima
2023-08-22 08:15:00,2023082210121420010100166062018356566,MUHAMMAD RAFI AL HAFIZH,Rp57.600,Rp100,Berhasil diterima
2023-08-22 08:15:00,2023082210121420010100166425618461309,NUR ROKIMAN,Rp50.155,Rp100,Berhasil diterima
2023-08-22 08:15:00,2023082210121420010100166602019707988,DANI ARDI,Rp99.000,Rp100,Berhasil diterima
2023-08-22 08:14:00,2023082210121420010100166028918728730,MUHAMMAD RISKY,Rp50.000,Rp100,Berhasil diterima
2023-08-22 08:13:00,2023082210121420010100166889920006849,TEDY FIRMANSYAH,Rp25.000,Rp100,Berhasil diterima
2023-08-22 06:01:00,2023082210121420010100166459319672126,POPON,Rp95.000,Rp100,Berhasil diterima
2023-08-22 06:01:00,2023082210121420010100166478419396504,MUHAMMAD RIDHO HIDAYAT,Rp50.000,Rp100,Berhasil diterima
2023-08-22 06:01:00,2023082210121420010100166874619298736,SITI ATIYAH,Rp58.000,Rp100,Berhasil diterima
2023-08-22 06:00:00,2023082210121420010100166250119228882,RIDWAN,Rp100.000,Rp100,Berhasil diterima
2023-08-22 06:00:00,2023082210121420010100166856518358777,AGHIL WISNU PAMUNGKAS,Rp53.000,Rp100,Berhasil diterima
2023-08-22 06:00:00,2023082210121420010100166761619050804,RACHMAT ISMAIL,Rp50.000,Rp100,Berhasil diterima
2023-08-22 06:00:00,2023082210121420010100166560020184235,RUMINIH,Rp15.000,Rp100,Berhasil diterima
2023-08-22 05:59:00,2023082210121420010100166094420050471,DEWI NURYATI,Rp25.000,Rp100,Berhasil diterima
2023-08-22 05:59:00,2023082210121420010100166264419199963,NURHAYATI,Rp20.000,Rp100,Berhasil diterima
2023-08-22 05:59:00,2023082210121420010100166548718711558,HAMDI FIRDAUS,Rp50.000,Rp100,Berhasil diterima
2023-08-22 05:59:00,2023082210121420010100166383119196430,SAIFUL ROHMAN,Rp200.000,Rp100,Berhasil diterima
2023-08-22 05:58:00,2023082210121420010100166983019300877,ABDURRASYID,Rp50.000,Rp100,Berhasil diterima
2023-08-22 05:57:00,2023082210121420010100166795819319192,RISTA FITRIANI,Rp140.000,Rp100,Berhasil diterima
2023-08-22 05:56:00,2023082210121420010100166759218783010,DENKI AZIS,Rp10.000,Rp100,Berhasil diterima
2023-08-22 05:56:00,2023082210121420010100166519319648222,DEWI,Rp25.000,Rp100,Berhasil diterima
2023-08-22 05:55:00,2023082210121420010100166810719203046,CECE SUPARDI,Rp100.000,Rp100,Berhasil diterima
2023-08-22 05:55:00,2023082210121420010100166146719156824,LILIS YULI YUNIAR,Rp25.000,Rp100,Berhasil diterima
2023-08-22 05:54:00,2023082210121420010100166264419160541,NURHAYATI,Rp20.000,Rp100,Berhasil diterima
2023-08-22 05:54:00,2023082210121420010100166723718157489,PANDU ADNAN AULIA,Rp50.000,Rp100,Berhasil diterima
2023-08-22 05:53:00,2023082210121420010100166468019313570,LUKMANUL HAKIM,Rp20.000,Rp100,Berhasil diterima
2023-08-22 05:52:00,2023082210121420010100166291719484721,INDRA KOSWARA,Rp16.500,Rp100,Berhasil diterima
