BGD: 6cebf871e936d15b6540dc714dcff176839f73359d30ae49ae8ec1d44bd276db
BKHN: 6fd04410d4fe5cf4d67e2c3c5f1565aab576199bfc8c4011dc5b3054375d8953
KTQD: 6342c8682a84c9503c56294631fda268db12e084998cca5d0b5367bf47b14e3d
DHXD: b77c57b097787b91faac4eb875fd6ab3a0e11257d7b722edfb010cd3cba42b2c
GVU1234 - Nguyễn Văn B: 1c84984dcaef77eb4e6b5e0d68662cc569118334a807e722e94b1e34cd21ca72
GVU1235 - Lý Thị C: 7b1ec199c4827b0f46674fec95ba1a337f0042b285755ad5acdeeb64c0f8cf7d
GV1234 - Nguyễn Văn B: 1c2c728f6673a42630833f22790903275e79cf0702280018428d0f9e0a7584df
GV1235 - Lý Thị C: 33259d9aa290dcc5e29371a909c3dac88827474ca298b99584a015301e717873
SV - Phải tự import, vì mỗi lần chạy ra 1 private key riêng