{
  "name": "blixt_circuit_breaker",
  "title": "Blixt Circuit Breaker",
  "description": "Platform for the Bl!xt Circuit Breaker",
  "url": "http://blixt.tech",
  "homepage": "http://blixt.tech",
  "license": "Apache-2.0",
  "engines": {
    "platformio": "^3.0.0"
  },
  "repository": {
    "type": "git",
    "url": "https://gitlab.com/blixt/circuit-breaker/pio-platform"
  },
  "version": "0.5.0",
  "packageRepositories": [
    "https://dl.bintray.com/platformio/dl-packages/manifest.json",
    "http://dl.platformio.org/packages/manifest.json",
    "https://gitlab.com/blixt/circuit-breaker/pio-packages/raw/master/manifest.json"
  ],
  "frameworks": {
    "arduino": {
      "package": "framework-arduinosam",
      "script": "builder/frameworks/arduino.py"
    }
  },
  "packages": {
    "framework-arduinosam-variant-bcb": {
      "type": "framework-variant",
      "version": "https://gitlab.com/blixt/circuit-breaker/pio-package-arduinosam-variant.git"
    },
    "toolchain-gccarmnoneeabi": {
      "type": "toolchain",
      "version": ">=1.40803.0,<1.40805.0"
    },
    "framework-arduinosam": {
      "type": "framework",
      "version": "~3.10619.0"
    },
    "tool-bossac-bcb": {
      "type": "uploader",
      "version": "~1.9.1-0.5.0"
    },
    "tool-openocd": {
      "type": "uploader",
      "optional": true,
      "version": "~1.1000.0"
    }
  }
}
