{
    "buf_size_fv": 1000000,
    "buf_size_lv": 1000,
    "data_batch_size": 100,
    "adc_time_stamp_clock": 2000000,
    "dataviews": {
        "background_color": "#19232D",
        "voltage": {
            "label": "V",
            "color": "#00FFFF"
        },
        "current": {            
            "label": "A",
            "color": "#FF8040"
        }
    }
}