<svg viewBox="0 0 34 34" fill="none" xmlns="http://www.w3.org/2000/svg">
<path fill-rule="evenodd" clip-rule="evenodd" d="M19.0451 21.6667C19.3951 21.6667 19.6667 21.3931 19.6667 21.0458C19.6667 20.8722 19.5988 20.7144 19.4787 20.5934L15.8221 16.9947L19.4787 13.4066C19.5988 13.2856 19.6667 13.1225 19.6667 12.9541C19.6667 12.6069 19.3951 12.3333 19.0451 12.3333C18.8779 12.3333 18.7317 12.3965 18.6168 12.5122L14.5528 16.5107C14.4065 16.6475 14.3334 16.8159 14.3334 17C14.3334 17.1841 14.4065 17.342 14.5475 17.484L18.6115 21.4878C18.7317 21.6035 18.8779 21.6667 19.0451 21.6667Z" fill="#1A1A1A"/>
<rect x="0.5" y="0.5" width="33" height="33" rx="16.5" stroke="#CFD8DC" stroke-linejoin="round"/>
</svg>
