com/upstreampay/app/domains/order/OrderDto$OrderDtoBuilder.class
com/upstreampay/app/persistence/order/OrderRepository.class
com/upstreampay/app/persistence/transaction/Transaction.class
com/upstreampay/app/persistence/order/Order.class
com/upstreampay/app/persistence/transaction/TransactionService.class
com/upstreampay/app/commons/UseCase.class
com/upstreampay/app/commons/UseCaseError$UseCaseErrorBuilder.class
com/upstreampay/app/AppApplication.class
com/upstreampay/app/config/GlobalConfig.class
com/upstreampay/app/commons/UseCaseHttpError.class
com/upstreampay/app/domains/transaction/TransactionDto.class
com/upstreampay/app/commons/UseCaseHttpError$UseCaseHttpErrorBuilder.class
com/upstreampay/app/commons/UseCaseException.class
com/upstreampay/app/api/TransactionApi.class
com/upstreampay/app/commons/UseCaseResponse.class
com/upstreampay/app/persistence/transaction/TransactionStatus.class
com/upstreampay/app/domains/transaction/UpdateTransactionStatusDto$UpdateTransactionStatusDtoBuilder.class
com/upstreampay/app/persistence/order/Order$OrderBuilder.class
com/upstreampay/app/persistence/order/OrderService.class
com/upstreampay/app/domains/transaction/UpdateTransactionStatusUseCase.class
com/upstreampay/app/domains/transaction/TransactionDto$TransactionDtoBuilder.class
com/upstreampay/app/config/ControllerExceptionHandler.class
com/upstreampay/app/commons/UseCaseResponse$UseCaseResponseBuilder.class
com/upstreampay/app/domains/transaction/GetAllTransactionUseCase.class
com/upstreampay/app/domains/transaction/UpdateTransactionStatusDto.class
com/upstreampay/app/domains/transaction/CreationTransactionUseCase.class
com/upstreampay/app/domains/order/OrderDto.class
com/upstreampay/app/persistence/transaction/Transaction$TransactionBuilder.class
com/upstreampay/app/persistence/transaction/TransactionRepository.class
com/upstreampay/app/persistence/transaction/PaymentMethod.class
com/upstreampay/app/commons/UseCaseError.class
