,split0_test_auc,split1_test_auc,split2_test_auc,split3_test_auc,split4_test_auc,mean_test_auc,std_test_auc,rank_test_auc,split0_test_f1,split1_test_f1,split2_test_f1,split3_test_f1,split4_test_f1,mean_test_f1,std_test_f1,rank_test_f1,split0_test_prec,split1_test_prec,split2_test_prec,split3_test_prec,split4_test_prec,mean_test_prec,std_test_prec,rank_test_prec,split0_test_rec,split1_test_rec,split2_test_rec,split3_test_rec,split4_test_rec,mean_test_rec,std_test_rec,rank_test_rec
0,0.8329733621310296,0.8077753779697624,0.8192944564434845,0.8387329013678906,0.8264938804895609,0.8250539956803455,0.010803934619037638,28,0.6258064516129033,0.5082872928176796,0.544464609800363,0.5942028985507245,0.5734513274336284,0.5692425160430599,0.04042201744502003,27,0.7461538461538462,0.7540983606557377,0.78125,0.8497409326424871,0.7864077669902912,0.7835301812884724,0.036498125472128384,21,0.5388888888888889,0.38333333333333336,0.4178272980501393,0.4568245125348189,0.45125348189415043,0.4496255029402662,0.05182317186560151,26
1,0.8336933045356372,0.8070554355651548,0.8228941684665226,0.8401727861771058,0.827933765298776,0.8263498920086393,0.011240327753073416,24,0.6292134831460674,0.5091575091575092,0.5575539568345323,0.6007194244604316,0.5784832451499118,0.5750255237496905,0.040625898910288775,25,0.7452471482889734,0.7473118279569892,0.7868020304568528,0.8477157360406091,0.7884615384615384,0.7831076562409927,0.03723244771968307,22,0.5444444444444444,0.3861111111111111,0.43175487465181056,0.46518105849582175,0.4568245125348189,0.4568632002476013,0.05172223647338882,24
2,0.8243340532757379,0.8200143988480921,0.816414686825054,0.8452123830093593,0.8408927285817135,0.8293736501079915,0.011528074241179624,15,0.672922252010724,0.5941558441558441,0.5933014354066984,0.6446280991735537,0.6584234930448223,0.6326862247583286,0.033044530845814886,3,0.6502590673575129,0.71484375,0.6940298507462687,0.7926829268292683,0.7395833333333334,0.7182797856532767,0.04736317633370329,43,0.6972222222222222,0.5083333333333333,0.5181058495821727,0.5431754874651811,0.5933147632311978,0.5720303311668214,0.06917195369013224,3
3,0.822174226061915,0.8178545716342692,0.8192944564434845,0.8466522678185745,0.843772498200144,0.8299496040316775,0.012572429058570528,10,0.6711051930758988,0.5899513776337114,0.6009538950715422,0.6490939044481054,0.6646058732612056,0.6351420486980927,0.03336808532096413,1,0.6445012787723785,0.708171206225681,0.7,0.7943548387096774,0.7465277777777778,0.718711020297103,0.04992801810438377,42,0.7,0.5055555555555555,0.5264623955431755,0.5487465181058496,0.5988857938718662,0.5759300526152893,0.06936696819340514,2
4,0.8286537077033838,0.7890568754499641,0.80849532037437,0.8243340532757379,0.8228941684665226,0.8146868250539956,0.014496429602480296,39,0.5780141843971631,0.4056795131845841,0.4722222222222222,0.5215686274509804,0.5232558139534883,0.5001480722416877,0.057896633899282735,39,0.7990196078431373,0.7518796992481203,0.8206896551724138,0.8807947019867549,0.8598726114649682,0.8224512551430788,0.04546824282870723,6,0.4527777777777778,0.2777777777777778,0.33147632311977715,0.37047353760445684,0.37604456824512533,0.36170999690498296,0.057505326244374565,39
5,0.8401727861771058,0.8120950323974082,0.8250539956803455,0.8401727861771058,0.8293736501079914,0.8293736501079912,0.010492404148156453,16,0.6498422712933755,0.5175600739371534,0.5605786618444846,0.6007194244604316,0.5790408525754884,0.5815482568221867,0.0437540960818946,23,0.7518248175182481,0.7734806629834254,0.7989690721649485,0.8477157360406091,0.7990196078431373,0.7942019793100735,0.032046384102497716,20,0.5722222222222222,0.3888888888888889,0.43175487465181056,0.46518105849582175,0.45403899721448465,0.46241720829464555,0.06079731380831406,23
6,0.8344132469402448,0.8048956083513319,0.8135349172066235,0.8358531317494601,0.8293736501079914,0.8236141108711303,0.012260177369277463,30,0.6627565982404693,0.5117117117117117,0.5542168674698795,0.594306049822064,0.5934819897084048,0.5832946433905059,0.05001773390588675,21,0.7018633540372671,0.7282051282051282,0.7252252252252253,0.8226600985221675,0.7723214285714286,0.7500550469122433,0.042857119656236675,32,0.6277777777777778,0.39444444444444443,0.44846796657381616,0.46518105849582175,0.4818941504178273,0.48355307954193744,0.0778618787151979,19
7,0.8243340532757379,0.8185745140388769,0.8185745140388769,0.8430525557955364,0.8401727861771058,0.8289416846652268,0.010596613098905151,20,0.6781002638522428,0.5948553054662379,0.6012658227848101,0.6390728476821192,0.6563467492260061,0.6339281978022833,0.03185514698359571,2,0.6457286432160804,0.7061068702290076,0.6959706959706959,0.7877551020408163,0.7386759581881533,0.7148474539289508,0.04710299896445301,44,0.7138888888888889,0.5138888888888888,0.5292479108635098,0.5376044568245125,0.5905292479108635,0.5770318786753327,0.07312576365917622,1
8,0.8336933045356372,0.8005759539236861,0.8178545716342692,0.8416126709863211,0.8365730741540677,0.8260619150467962,0.01501627971142831,26,0.6156405990016639,0.4763705103969754,0.532347504621072,0.5985401459854014,0.5953654188948306,0.5636528357799887,0.05200724555139035,28,0.7676348547717843,0.7455621301775148,0.7912087912087912,0.8677248677248677,0.8267326732673267,0.7997726634300568,0.043334293042006033,18,0.5138888888888888,0.35,0.4011142061281337,0.4568245125348189,0.46518105849582175,0.4374017332095327,0.05648905707074935,28
9,0.8344132469402448,0.8048956083513319,0.8207343412526998,0.8408927285817135,0.8351331893448524,0.8272138228941686,0.012974952139460105,22,0.6204620462046205,0.4934579439252337,0.5431192660550459,0.600361663652803,0.5946902654867257,0.5704182370648857,0.04616978131004748,26,0.7642276422764228,0.7542857142857143,0.7956989247311828,0.8556701030927835,0.8155339805825242,0.7970832729937255,0.03656743139158853,19,0.5222222222222223,0.36666666666666664,0.41225626740947074,0.4623955431754875,0.467966573816156,0.44630145465800064,0.05290204958997054,27
10,0.8286537077033838,0.8171346292296616,0.8120950323974082,0.8538516918646508,0.8329733621310296,0.8289416846652269,0.014560646024716604,19,0.6775067750677507,0.5808580858085808,0.5756097560975609,0.6622296173044925,0.6293929712460065,0.6251194411048783,0.04135247871496928,9,0.6613756613756614,0.7154471544715447,0.69140625,0.8223140495867769,0.7378277153558053,0.7256741661579577,0.05458966090812818,40,0.6944444444444444,0.4888888888888889,0.49303621169916434,0.5543175487465181,0.5487465181058496,0.5558867223769731,0.0744185239735389,6
11,0.8272138228941684,0.8200143988480921,0.816414686825054,0.8524118070554355,0.8336933045356372,0.8299496040316775,0.012711826323595798,10,0.6756756756756757,0.5901639344262295,0.5867098865478121,0.6611570247933884,0.6315789473684211,0.6290570937623053,0.03609992049695734,4,0.6578947368421053,0.72,0.7015503875968992,0.8130081300813008,0.7388059701492538,0.7262518449339119,0.05100235457078898,39,0.6944444444444444,0.5,0.5041782729805014,0.5571030640668524,0.5515320334261838,0.5614515629835964,0.07051373961099214,4
12,0.8250539956803455,0.7897768178545717,0.8128149748020158,0.8243340532757379,0.8207343412526998,0.8145428365730742,0.013122715496114549,40,0.5605786618444847,0.4016393442622951,0.48412698412698413,0.512,0.5202312138728323,0.4957152408213193,0.05302462014875087,40,0.8031088082901554,0.765625,0.8413793103448276,0.9078014184397163,0.84375,0.8323329074149399,0.0473533028345393,3,0.4305555555555556,0.2722222222222222,0.3398328690807799,0.3565459610027855,0.37604456824512533,0.3550402352212937,0.0514511420342392,40
13,0.8452123830093593,0.8063354931605472,0.8228941684665226,0.8401727861771058,0.8336933045356372,0.8296616270698344,0.013845374089267806,13,0.6537842190016103,0.49340866290018826,0.5477941176470589,0.5963636363636364,0.5837837837837838,0.5750268839392556,0.05317483557198441,24,0.7777777777777778,0.7660818713450293,0.8054054054054054,0.8586387434554974,0.826530612244898,0.8068868820457216,0.033402739163476164,17,0.5638888888888889,0.3638888888888889,0.415041782729805,0.4568245125348189,0.45125348189415043,0.4501795109873104,0.06581164561241422,25
14,0.8401727861771058,0.7998560115190785,0.8135349172066235,0.8430525557955364,0.822174226061915,0.8237580993520519,0.016248383941593135,29,0.6735294117647058,0.5,0.5511265164644714,0.6161971830985916,0.5704347826086957,0.5822575787872929,0.05891973362913318,22,0.715625,0.7091836734693877,0.7293577981651376,0.8373205741626795,0.7592592592592593,0.7501492610112928,0.0468704998755667,31,0.6361111111111111,0.3861111111111111,0.4428969359331476,0.48746518105849584,0.4568245125348189,0.4818817703497369,0.08383026503778201,21
15,0.8329733621310296,0.8149748020158387,0.8149748020158387,0.8480921526277898,0.8351331893448524,0.8292296616270699,0.012736267465800435,18,0.6821917808219178,0.575206611570248,0.5901116427432217,0.6512396694214875,0.6382306477093207,0.6273960704532391,0.03950276779935226,6,0.672972972972973,0.710204081632653,0.6902985074626866,0.8008130081300813,0.7372262773722628,0.7223029695141314,0.044700444111503326,41,0.6916666666666667,0.48333333333333334,0.5153203342618384,0.5487465181058496,0.5626740947075209,0.5603481894150418,0.0711945881050881,5
16,0.8315334773218143,0.8005759539236861,0.8185745140388769,0.8358531317494601,0.8286537077033838,0.8230381569474442,0.012588908852063022,31,0.5937499999999999,0.4662813102119461,0.5190839694656488,0.5714285714285714,0.5672727272727273,0.5435633156757786,0.04567068801603136,31,0.7916666666666666,0.7610062893081762,0.8242424242424242,0.8786127167630058,0.8167539267015707,0.8144564047363687,0.038970153087678365,13,0.475,0.33611111111111114,0.3788300835654596,0.4233983286908078,0.43454038997214484,0.40957598266790474,0.047826725980299085,31
17,0.8351331893448524,0.8048956083513319,0.8214542836573074,0.8387329013678906,0.8308135349172067,0.8262059035277177,0.01212071735391502,25,0.6085470085470086,0.47984644913627633,0.5320754716981132,0.5836431226765799,0.5750452079566003,0.5558314520029157,0.04529824412965014,30,0.7911111111111111,0.7763975155279503,0.8245614035087719,0.8770949720670391,0.8195876288659794,0.8177505262161704,0.03461576571190418,9,0.49444444444444446,0.3472222222222222,0.39275766016713093,0.4373259052924791,0.4428969359331476,0.42292943361188484,0.049723785232786796,30
18,0.8372930165586753,0.8113750899928006,0.8178545716342692,0.8545716342692584,0.8286537077033838,0.8299496040316775,0.015186519076671207,10,0.6852367688022284,0.5647840531561462,0.5845648604269293,0.6666666666666667,0.6136363636363636,0.6229777425376668,0.04633405831270321,11,0.6871508379888268,0.7024793388429752,0.712,0.8178137651821862,0.7354085603112841,0.7309705004650544,0.046158938462510415,37,0.6833333333333333,0.4722222222222222,0.4958217270194986,0.5626740947075209,0.5264623955431755,0.5481027545651501,0.07410681420220104,9
19,0.8372930165586753,0.8142548596112311,0.8207343412526998,0.8531317494600432,0.8308135349172067,0.8312455003599712,0.013527256076668727,8,0.6852367688022284,0.5728476821192053,0.5938009787928221,0.6644736842105263,0.6203554119547658,0.6273429051759096,0.042128397596643226,7,0.6871508379888268,0.7090163934426229,0.7165354330708661,0.8112449799196787,0.7384615384615385,0.7324818365767066,0.042659591707191455,36,0.6833333333333333,0.48055555555555557,0.5069637883008357,0.5626740947075209,0.5348189415041783,0.5536691426802848,0.07039347744366367,7
20,0.8214542836573074,0.7926565874730022,0.8077753779697624,0.8257739380849533,0.8156947444204463,0.8126709863210942,0.01168349187910774,41,0.537313432835821,0.4146341463414634,0.4670658682634731,0.5140562248995985,0.5019455252918288,0.487003039526437,0.04271073844694178,41,0.8181818181818182,0.7727272727272727,0.823943661971831,0.920863309352518,0.832258064516129,0.8335948253499138,0.048276578040336963,2,0.4,0.2833333333333333,0.32590529247910865,0.3565459610027855,0.3593314763231198,0.34502321262766944,0.038810007389934204,41
21,0.8401727861771058,0.8020158387329014,0.822174226061915,0.8394528437724982,0.8286537077033838,0.8264938804895609,0.013982460344201813,23,0.6262626262626263,0.4701348747591523,0.5365853658536586,0.5893186003683241,0.5608856088560885,0.55663741521997,0.05257100192039292,29,0.7948717948717948,0.7672955974842768,0.8218390804597702,0.8695652173913043,0.8306010928961749,0.8168345566206643,0.034442870789595105,11,0.5166666666666667,0.3388888888888889,0.3983286908077994,0.4456824512534819,0.4233983286908078,0.42459300526152893,0.05823875150764051,29
22,0.8430525557955364,0.8005759539236861,0.8142548596112311,0.8452123830093593,0.8243340532757379,0.8254859611231101,0.017004058105957717,27,0.6746268656716418,0.5062388591800356,0.5473684210526316,0.6221441124780316,0.5850340136054423,0.5870824543975566,0.05832740565904384,20,0.7290322580645161,0.7064676616915423,0.7393364928909952,0.8428571428571429,0.7510917030567685,0.7537570517121931,0.046907322822037904,30,0.6277777777777778,0.39444444444444443,0.43454038997214484,0.49303621169916434,0.479108635097493,0.4857814917982049,0.07902937421621659,18
23,0.8336933045356372,0.8120950323974082,0.8171346292296616,0.8524118070554355,0.8329733621310296,0.8296616270698344,0.014214806540745195,13,0.676923076923077,0.5628140703517589,0.5876623376623377,0.6589018302828619,0.6282051282051281,0.6229012886850327,0.04264922224294006,12,0.6816901408450704,0.7088607594936709,0.7042801556420234,0.8181818181818182,0.7396226415094339,0.7305271031344034,0.04755935128542218,38,0.6722222222222223,0.4666666666666667,0.5041782729805014,0.5515320334261838,0.5459610027855153,0.5481120396162179,0.06925775822143837,8
24,0.8250539956803455,0.7998560115190785,0.8099352051835853,0.8315334773218143,0.8236141108711303,0.8179985601151907,0.011477607132256089,35,0.5683836589698046,0.4549019607843137,0.49034749034749037,0.5517241379310345,0.5454545454545454,0.5221623586974377,0.04263561968544248,34,0.7881773399014779,0.7733333333333333,0.7987421383647799,0.8834355828220859,0.8166666666666667,0.8120710122176688,0.03837498194827732,15,0.4444444444444444,0.32222222222222224,0.35376044568245124,0.4011142061281337,0.40947075208913647,0.3862024141132776,0.04313202397391682,34
25,0.8264938804895609,0.8020158387329014,0.8120950323974082,0.8336933045356372,0.8257739380849533,0.8200143988480922,0.011392391904882644,33,0.5794066317626527,0.46183953033268105,0.4990403071017274,0.5633270321361059,0.5535055350553506,0.5314238072777036,0.04404187231527371,32,0.7793427230046949,0.7814569536423841,0.8024691358024691,0.8764705882352941,0.819672131147541,0.8118823063664766,0.035511862465087314,16,0.46111111111111114,0.3277777777777778,0.362116991643454,0.415041782729805,0.4178272980501393,0.39677499226245744,0.04664290731722427,32
26,0.8416126709863211,0.8120950323974082,0.8171346292296616,0.8567314614830813,0.8336933045356372,0.8322534197264219,0.01627133544883126,7,0.6829971181556197,0.5568760611205432,0.5738255033557047,0.6688851913477537,0.6231647634584013,0.6211497274876046,0.049957023510813575,13,0.7095808383233533,0.7161572052401747,0.7215189873417721,0.8305785123966942,0.7519685039370079,0.7459608094478004,0.04473345020466459,35,0.6583333333333333,0.45555555555555555,0.4763231197771588,0.5598885793871866,0.532033426183844,0.5364268028474156,0.07153121031993687,13
27,0.8416126709863211,0.816414686825054,0.8207343412526998,0.857451403887689,0.8351331893448524,0.8342692584593234,0.014792320053405701,2,0.6829971181556197,0.5714285714285714,0.5884297520661157,0.6710963455149502,0.6288492706645057,0.6285602115659525,0.04392553045780311,5,0.7095808383233533,0.723404255319149,0.7235772357723578,0.831275720164609,0.751937984496124,0.7479552068151186,0.04388119713850082,34,0.6583333333333333,0.4722222222222222,0.4958217270194986,0.5626740947075209,0.5403899721448467,0.5458882698854843,0.06463626347441377,10
28,0.8200143988480921,0.7912167026637869,0.802735781137509,0.8228941684665226,0.8113750899928006,0.8096472282217423,0.01160514999545566,43,0.5192307692307693,0.40082644628099173,0.43621399176954734,0.5060240963855422,0.490272373540856,0.4705135354415413,0.04484981511989595,43,0.84375,0.782258064516129,0.8346456692913385,0.9064748201438849,0.8129032258064516,0.8360063559515607,0.04111022595824807,1,0.375,0.26944444444444443,0.29526462395543174,0.35097493036211697,0.35097493036211697,0.32833178582482203,0.03940685821610125,43
29,0.8322534197264219,0.8012958963282938,0.8149748020158387,0.8293736501079914,0.8236141108711303,0.8203023758099353,0.011186709632573072,32,0.5933682373472948,0.45882352941176474,0.5029013539651838,0.5485714285714286,0.5454545454545454,0.5298238189500435,0.04560602114282661,33,0.7981220657276995,0.78,0.8227848101265823,0.8674698795180723,0.8166666666666667,0.8170086844078043,0.02934675417546226,10,0.4722222222222222,0.325,0.362116991643454,0.4011142061281337,0.40947075208913647,0.3939848344165893,0.04936840532224793,33
