,split0_test_auc,split1_test_auc,split2_test_auc,split3_test_auc,split4_test_auc,mean_test_auc,std_test_auc,rank_test_auc,split0_test_f1,split1_test_f1,split2_test_f1,split3_test_f1,split4_test_f1,mean_test_f1,std_test_f1,rank_test_f1,split0_test_prec,split1_test_prec,split2_test_prec,split3_test_prec,split4_test_prec,mean_test_prec,std_test_prec,rank_test_prec,split0_test_rec,split1_test_rec,split2_test_rec,split3_test_rec,split4_test_rec,mean_test_rec,std_test_rec,rank_test_rec
0,0.8236141108711303,0.8156947444204463,0.8178545716342692,0.8430525557955364,0.8257739380849533,0.8251979841612671,0.009652599431011905,31,0.6854942233632862,0.6012461059190032,0.6160849772382397,0.6483870967741936,0.6409495548961424,0.638432391638173,0.02899129195632833,38,0.6372315035799523,0.6843971631205674,0.6766666666666666,0.7701149425287356,0.6857142857142857,0.6908249123220415,0.043421314431817924,22,0.7416666666666667,0.5361111111111111,0.5654596100278552,0.5598885793871866,0.6016713091922006,0.6009594552770039,0.07341851220663655,33
1,0.8236141108711303,0.8171346292296616,0.8185745140388769,0.843772498200144,0.8293736501079914,0.8264938804895607,0.009648302702808318,29,0.6871008939974457,0.6055900621118012,0.6170212765957447,0.6527999999999999,0.648888888888889,0.6422802243187762,0.028800746521841773,36,0.6359338061465721,0.6866197183098591,0.6789297658862876,0.7669172932330827,0.6930379746835443,0.6922877116518692,0.042323659744650945,21,0.7472222222222222,0.5416666666666666,0.5654596100278552,0.5682451253481894,0.6100278551532033,0.6065242958836273,0.0737106461679658,29
2,0.7926565874730022,0.8106551475881929,0.8012958963282938,0.8423326133909287,0.8272138228941684,0.8148308135349172,0.01789980104607374,44,0.68,0.6382393397524072,0.6187845303867403,0.6802919708029197,0.6694214876033058,0.6573474657090745,0.024647880585380217,23,0.5666666666666667,0.6321525885558583,0.6136986301369863,0.7147239263803681,0.662125340599455,0.6378734304678668,0.049359307291103764,44,0.85,0.6444444444444445,0.6239554317548747,0.649025069637883,0.6768802228412256,0.6888610337356855,0.08231862594429078,12
3,0.7933765298776098,0.80849532037437,0.8020158387329014,0.8430525557955364,0.8293736501079914,0.8152627789776818,0.01828483634659659,43,0.681465038845727,0.6376021798365122,0.6196403872752422,0.6822157434402333,0.6740027510316369,0.6589852200858702,0.02559599961596581,19,0.5674676524953789,0.6256684491978609,0.6153846153846154,0.7155963302752294,0.6657608695652174,0.6379755833836603,0.04986018086879323,43,0.8527777777777777,0.65,0.6239554317548747,0.6518105849582173,0.6824512534818942,0.6921990095945527,0.08240112464305337,9
4,0.8322534197264219,0.8171346292296616,0.8293736501079914,0.838012958963283,0.8387329013678906,0.8311015118790497,0.0078152724233906,19,0.6732117812061712,0.5694915254237288,0.5976230899830222,0.6086956521739131,0.6327868852459015,0.6163617868065474,0.034952640824187045,44,0.6798866855524079,0.7304347826086957,0.7652173913043478,0.8101851851851852,0.7689243027888446,0.7509296694878962,0.04360345838930863,4,0.6666666666666666,0.4666666666666667,0.49025069637883006,0.48746518105849584,0.5376044568245125,0.5297307335190343,0.07229878573122842,44
5,0.8135349172066235,0.8207343412526998,0.8192944564434845,0.8459323254139669,0.8372930165586753,0.8273578113750901,0.012195747834620399,26,0.6766541822721598,0.609105180533752,0.6144393241167434,0.6603174603174604,0.6606606606606606,0.6442353615801553,0.027207858253140548,34,0.6145124716553289,0.7003610108303249,0.684931506849315,0.7675276752767528,0.7166123778501629,0.6967890084923769,0.04963811642466265,20,0.7527777777777778,0.5388888888888889,0.5571030640668524,0.5793871866295265,0.6128133704735376,0.6081940575673166,0.07637947634968283,28
6,0.8200143988480921,0.8135349172066235,0.8099352051835853,0.8365730741540677,0.8272138228941684,0.8214542836573075,0.009583620614712008,38,0.6958637469586375,0.6093514328808446,0.5963302752293578,0.6320907617504052,0.635258358662614,0.6337789150963717,0.03423059297654719,39,0.6190476190476191,0.6666666666666666,0.6610169491525424,0.7558139534883721,0.6989966555183946,0.680308368774719,0.04552247741266857,26,0.7944444444444444,0.5611111111111111,0.5431754874651811,0.5431754874651811,0.5821727019498607,0.6048158464871557,0.09589670356460622,30
7,0.7904967602591793,0.8106551475881929,0.8056155507559395,0.843772498200144,0.8336933045356372,0.8168466522678186,0.019326665786105146,42,0.6798679867986798,0.636237897648686,0.6260387811634349,0.6832116788321169,0.6865671641791045,0.6623847017244044,0.025802717018193436,15,0.5628415300546448,0.6336088154269972,0.6225895316804407,0.7177914110429447,0.6693121693121693,0.6412286915034393,0.05138201946098537,42,0.8583333333333333,0.6388888888888888,0.6295264623955432,0.6518105849582173,0.7047353760445683,0.6966589291241101,0.08492274322409735,3
8,0.8308135349172067,0.8257739380849533,0.8308135349172067,0.8538516918646508,0.8344132469402448,0.8351331893448524,0.009755153166856321,12,0.6944083224967491,0.6230529595015577,0.637904468412943,0.6772655007949125,0.655688622754491,0.6576639747921307,0.02579391167443074,22,0.6528117359413202,0.7092198581560284,0.7137931034482758,0.7888888888888889,0.7087378640776699,0.7146902901024367,0.0433602340217304,18,0.7416666666666667,0.5555555555555556,0.5766016713091922,0.5933147632311978,0.6100278551532033,0.6154333023831631,0.06564533651268865,23
9,0.8322534197264219,0.8264938804895609,0.8308135349172067,0.8509719222462203,0.8329733621310296,0.8347012239020877,0.008440230894026114,15,0.6993548387096774,0.625194401244168,0.6390168970814133,0.6719492868462758,0.6537313432835821,0.6578493534330233,0.025920951960108737,21,0.653012048192771,0.7102473498233216,0.7123287671232876,0.7794117647058824,0.7041800643086816,0.7118359988307887,0.040219699804785264,19,0.7527777777777778,0.5583333333333333,0.5793871866295265,0.5905292479108635,0.6100278551532033,0.6182110801609408,0.06933121142723465,22
10,0.7919366450683946,0.8135349172066235,0.8135349172066235,0.8596112311015118,0.8264938804895609,0.8210223182145429,0.02225821610820973,40,0.675645342312009,0.6447187928669411,0.6357243319268636,0.7102526002971769,0.6685006877579092,0.66696835103218,0.026162553531134346,13,0.5668549905838042,0.6368563685636857,0.6420454545454546,0.7611464968152867,0.6603260869565217,0.6534458794929506,0.06252987099024895,38,0.8361111111111111,0.6527777777777778,0.6295264623955432,0.6657381615598886,0.6768802228412256,0.6922067471371094,0.07365787949735707,8
11,0.7933765298776098,0.8135349172066235,0.8149748020158387,0.8588912886969042,0.8293736501079914,0.8220302375809936,0.021705517277133213,36,0.6793296089385475,0.6456908344733243,0.6385372714486639,0.7100591715976332,0.6748971193415638,0.6697028011599466,0.025675505021814468,7,0.5682242990654206,0.6361185983827493,0.6448863636363636,0.7570977917981072,0.6648648648648648,0.6542383835495011,0.06083944376961165,37,0.8444444444444444,0.6555555555555556,0.6323119777158774,0.6685236768802229,0.6852367688022284,0.6972144846796657,0.07561890103421996,2
12,0.8365730741540677,0.8185745140388769,0.8264938804895609,0.8552915766738661,0.8315334773218143,0.8336933045356372,0.012327634150038297,16,0.6816269284712483,0.5728813559322034,0.5935919055649241,0.6610455311973019,0.6176470588235294,0.6253585559978414,0.04065005223814245,43,0.6883852691218131,0.7347826086956522,0.7521367521367521,0.8376068376068376,0.7470355731225297,0.751989408136717,0.04836624208578844,3,0.675,0.46944444444444444,0.49025069637883006,0.5459610027855153,0.5264623955431755,0.5414237078303931,0.0719537979529242,43
13,0.8315334773218143,0.822174226061915,0.8308135349172067,0.8538516918646508,0.8394528437724982,0.8355651547876171,0.010655147588192939,8,0.6968911917098446,0.6085578446909666,0.6322378716744914,0.6782884310618067,0.6656671664167916,0.6563285011107801,0.031865891179138794,24,0.6529126213592233,0.7084870848708487,0.7214285714285714,0.7867647058823529,0.7207792207792207,0.7180744408640434,0.04260257891404706,17,0.7472222222222222,0.5333333333333333,0.5626740947075209,0.596100278551532,0.6183844011142061,0.6115428659857629,0.07375507524540152,26
14,0.8149748020158387,0.8063354931605472,0.8192944564434845,0.8502519798416127,0.8236141108711303,0.8228941684665226,0.014824521441305985,35,0.6936829558998808,0.5942684766214178,0.624813153961136,0.6729559748427673,0.6270928462709285,0.6425626815192261,0.03584334384418004,35,0.6075156576200418,0.6501650165016502,0.6741935483870968,0.7725631768953068,0.6912751677852349,0.6791425134378661,0.05453295466128837,27,0.8083333333333333,0.5472222222222223,0.5821727019498607,0.596100278551532,0.5738161559888579,0.6215289384091612,0.09475168571603879,21
15,0.7883369330453563,0.80849532037437,0.8171346292296616,0.8516918646508279,0.8372930165586753,0.8205903527717784,0.022112430606712707,41,0.6740576496674057,0.6295264623955432,0.6442577030812324,0.6961651917404129,0.6920980926430518,0.6672210199055293,0.026273815570422625,12,0.5608856088560885,0.6312849162011173,0.647887323943662,0.7398119122257053,0.6773333333333333,0.6514406189119812,0.05847906675925906,41,0.8444444444444444,0.6277777777777778,0.6406685236768802,0.6573816155988857,0.7075208913649025,0.6955586505725782,0.07921456124786992,4
16,0.8344132469402448,0.8272138228941684,0.8286537077033838,0.8596112311015118,0.838012958963283,0.8375809935205183,0.011685266272295724,3,0.6989528795811519,0.6129032258064515,0.6327160493827161,0.6919431279620852,0.659606656580938,0.6592243878626686,0.03315827860579556,17,0.6608910891089109,0.7307692307692307,0.7093425605536332,0.7992700729927007,0.7218543046357616,0.7244254516120474,0.04452567911159147,14,0.7416666666666667,0.5277777777777778,0.5710306406685237,0.6100278551532033,0.6072423398328691,0.6115490560198081,0.07156929997942099,25
17,0.8358531317494601,0.8286537077033838,0.8243340532757379,0.8596112311015118,0.8401727861771058,0.8377249820014399,0.012248334236507815,2,0.7015706806282722,0.617363344051447,0.6234567901234569,0.6929133858267715,0.6666666666666667,0.6603941734593229,0.03466517172581253,16,0.6633663366336634,0.732824427480916,0.698961937716263,0.7971014492753623,0.7231270358306189,0.7230762373873647,0.044094293241392,16,0.7444444444444445,0.5333333333333333,0.5626740947075209,0.6128133704735376,0.6183844011142061,0.6143299288146085,0.07235647800891525,24
18,0.7933765298776098,0.8113750899928006,0.8200143988480921,0.8516918646508279,0.830093592512599,0.8213102951763858,0.019395200277013948,39,0.6757062146892655,0.6340782122905028,0.6518105849582173,0.6997084548104956,0.6694677871148459,0.6661542507726654,0.022193319445603744,14,0.5695238095238095,0.6376404494382022,0.6518105849582173,0.7339449541284404,0.6732394366197183,0.6532318469336775,0.053229797118822295,40,0.8305555555555556,0.6305555555555555,0.6518105849582173,0.6685236768802229,0.6657381615598886,0.6894367069018881,0.07182787809442834,11
19,0.7948164146868251,0.8113750899928006,0.8192944564434845,0.8509719222462203,0.8322534197264219,0.8217422606191505,0.018991201835907894,37,0.6786922209695604,0.6330532212885154,0.6518723994452149,0.6986899563318778,0.6750348675034867,0.667468533107731,0.022740496592565326,11,0.571157495256167,0.6384180790960452,0.649171270718232,0.7317073170731707,0.6759776536312849,0.65328636315498,0.05224536625554437,39,0.8361111111111111,0.6277777777777778,0.6545961002785515,0.6685236768802229,0.6740947075208914,0.692220674713711,0.07370624348934347,7
20,0.8416126709863211,0.8178545716342692,0.827933765298776,0.8552915766738661,0.8365730741540677,0.8358531317494601,0.012634937922810858,7,0.6961325966850829,0.5675213675213675,0.603648424543947,0.6633165829145728,0.6296900489396412,0.6320618041209223,0.04485608314448796,40,0.6923076923076923,0.7377777777777778,0.7459016393442623,0.8319327731092437,0.7598425196850394,0.7535524804448032,0.04525778509725249,1,0.7,0.46111111111111114,0.5069637883008357,0.5515320334261838,0.5376044568245125,0.5514422779325285,0.08049713768101016,40
21,0.8372930165586753,0.8264938804895609,0.8293736501079914,0.8560115190784737,0.8408927285817135,0.838012958963283,0.010393136030305884,1,0.7041884816753927,0.6131621187800963,0.6291079812206571,0.6815286624203821,0.6666666666666667,0.658930782152639,0.03347517728179864,20,0.6658415841584159,0.7262357414448669,0.7178571428571429,0.7955390334572491,0.7269736842105263,0.7264894372256402,0.04128153142548806,9,0.7472222222222222,0.5305555555555556,0.5598885793871866,0.596100278551532,0.6155988857938719,0.6098731043020736,0.07466857674606195,27
22,0.8120950323974082,0.8171346292296616,0.8171346292296616,0.8545716342692584,0.8372930165586753,0.827645788336933,0.01600540617029833,25,0.689655172413793,0.6197604790419162,0.6163141993957704,0.6901840490797546,0.6616766467065869,0.6555181093275643,0.032312687029369055,26,0.6029106029106029,0.672077922077922,0.6732673267326733,0.7679180887372014,0.7152103559870551,0.6862768592890911,0.054448559273496136,25,0.8055555555555556,0.575,0.5682451253481894,0.6267409470752089,0.6155988857938719,0.6382281027545651,0.08664631875772533,19
23,0.796976241900648,0.8113750899928006,0.816414686825054,0.8538516918646508,0.8394528437724982,0.8236141108711305,0.020378312816347596,34,0.6838565022421524,0.6299435028248588,0.6403385049365303,0.7036496350364962,0.6924137931034483,0.6700403876286972,0.029363234880714118,6,0.5733082706766918,0.6408045977011494,0.6485714285714286,0.7392638036809815,0.6857923497267759,0.6575480900714055,0.0546488210564404,36,0.8472222222222222,0.6194444444444445,0.6323119777158774,0.6713091922005571,0.6991643454038997,0.6938904363974003,0.08170982259357433,6
24,0.8358531317494601,0.8250539956803455,0.827933765298776,0.857451403887689,0.8336933045356372,0.8359971202303816,0.011405123886717295,6,0.6976127320954907,0.6086956521739131,0.6248037676609105,0.6796116504854368,0.6494688922610016,0.6520385389353505,0.0330582069869741,29,0.6675126903553299,0.7241379310344828,0.7158273381294964,0.8108108108108109,0.7133333333333334,0.7263244207326907,0.04664870324158659,11,0.7305555555555555,0.525,0.5543175487465181,0.584958217270195,0.596100278551532,0.5981863200247601,0.07068473006067133,35
25,0.8351331893448524,0.8286537077033838,0.8272138228941684,0.857451403887689,0.838012958963283,0.8372930165586754,0.010842246564156506,4,0.6966887417218542,0.6185897435897436,0.6250000000000001,0.6806451612903225,0.659606656580938,0.6561060606365716,0.030451393038790745,25,0.6658227848101266,0.7310606060606061,0.7117437722419929,0.8084291187739464,0.7218543046357616,0.7277821173044867,0.04614328487020581,7,0.7305555555555555,0.5361111111111111,0.5571030640668524,0.5877437325905293,0.6072423398328691,0.6037511606313835,0.06796911338098227,31
26,0.796976241900648,0.8185745140388769,0.8250539956803455,0.8596112311015118,0.8416126709863211,0.8283657307415406,0.02118441994447966,22,0.6824324324324323,0.6389684813753581,0.6572637517630465,0.7153284671532846,0.6892655367231639,0.6766517338894571,0.026398240716036397,2,0.5738636363636364,0.6597633136094675,0.6657142857142857,0.7515337423312883,0.6991404011461319,0.6700030758329619,0.058072836298253404,31,0.8416666666666667,0.6194444444444445,0.649025069637883,0.6824512534818942,0.6796657381615598,0.6944506344784896,0.07710324107473777,5
27,0.7962562994960403,0.8207343412526998,0.8250539956803455,0.8596112311015118,0.843772498200144,0.8290856731461483,0.021500137025117456,21,0.6809470124013529,0.6417266187050359,0.6591865357643759,0.7161572052401748,0.6947960618846695,0.6785626867991218,0.02613383413743045,1,0.573055028462998,0.6656716417910448,0.6638418079096046,0.75,0.7017045454545454,0.6708546047236386,0.058062917558848806,29,0.8388888888888889,0.6194444444444445,0.6545961002785515,0.6852367688022284,0.6880222841225627,0.6972376973073352,0.07505211814436635,1
28,0.8444924406047516,0.8178545716342692,0.8293736501079914,0.8516918646508279,0.8344132469402448,0.8355651547876171,0.011773644980135138,8,0.6991643454038997,0.5689948892674618,0.6030150753768845,0.6543624161073825,0.6302250803858522,0.6311523613082961,0.044318065536301285,41,0.7011173184357542,0.73568281938326,0.7563025210084033,0.8227848101265823,0.7452471482889734,0.7522269234485947,0.0398237171371667,2,0.6972222222222222,0.4638888888888889,0.5013927576601671,0.5431754874651811,0.5459610027855153,0.5503280718043948,0.0793908300687366,41
29,0.8336933045356372,0.8257739380849533,0.8257739380849533,0.8567314614830813,0.8351331893448524,0.8354211663066955,0.011343148965431869,10,0.6948480845442536,0.6084142394822007,0.619496855345912,0.6805778491171749,0.6535552193645991,0.6513784495708281,0.033494213900872614,30,0.6624685138539043,0.7286821705426356,0.7111913357400722,0.803030303030303,0.7152317880794702,0.7241208222492771,0.04537555671443885,15,0.7305555555555555,0.5222222222222223,0.5487465181058496,0.5905292479108635,0.6016713091922006,0.5987449705973382,0.07184103024635047,34
