@startuml Dependencies
!include https://raw.githubusercontent.com/plantuml-stdlib/C4-PlantUML/master/C4_Container.puml
' uncomment the following line and comment the first to use locally
' !include C4_Container.puml

' LAYOUT_TOP_DOWN()
' LAYOUT_AS_SKETCH()
LAYOUT_WITH_LEGEND()

title Dependencies vorijk-test

System_Boundary(b1, "test_helper pkg") {
    Container(cryptography_test_helper, "cryptography_test_helper.go")
    Container(jwt_test_helper, "jwt_test_helper.go")
    Container(start_session_test_helper, "start_session_test_helper.go")
    Container(unregister_app_test_helper, "unregister_app_test_helper.go")
}

System_Boundary(b2, "repository_log_wrapper pkg") {
    Container(app_management_repository_log_wrapper, "app_management_repository_log_wrapper.go")
    Container(citizen_financial_claim_repository_log_wrapper, "citizen_financial_claim_repository_log_wrapper.go")
    Container(scheme_repository_log_wrapper, "scheme_repository_log_wrapper.go")
    Container(service_discovery_repository_log_wrapper, "service_discovery_repository_log_wrapper.go")
    Container(session_repository_log_wrapper, "session_repository_log_wrapper.go")
}

System_Boundary(b3, "external") {
    System_Ext(health_checker, "health-checker")
    System_Ext(rsa_mobile, "rsa-mobile")
    System_Ext(app_management_process, "app-management-process")
    System_Ext(app_management_service, "app-management-service")
    System_Ext(citizen_financial_claim_process, "citizen-financial-claim-process")
    System_Ext(mock_source_system, "mock-source-system")
    System_Ext(scheme_process, "scheme-process")
    System_Ext(service_discovery_process, "service-discovery-process")
    System_Ext(session_process, "session-process")
}

AddRelTag("relRed", $lineColor="red")

Rel(cryptography_test_helper, app_management_repository_log_wrapper, "model")
Rel(cryptography_test_helper, citizen_financial_claim_repository_log_wrapper, "model", $tags="relRed")
Rel(cryptography_test_helper, mock_source_system, "model")
Rel(cryptography_test_helper, session_repository_log_wrapper, "model")
Rel(cryptography_test_helper, rsa_mobile, "")
Rel(start_session_test_helper, rsa_mobile, "")
Rel(app_management_process, rsa_mobile, "model")
Rel(start_session_test_helper, app_management_repository_log_wrapper, "")
Rel(start_session_test_helper, session_repository_log_wrapper, "")
Rel(unregister_app_test_helper, session_process, "model")
Rel(unregister_app_test_helper, session_repository_log_wrapper, "")

Rel(app_management_repository_log_wrapper, health_checker, "")
Rel(app_management_repository_log_wrapper, app_management_process, "model, repositories")
Rel(app_management_repository_log_wrapper, app_management_service, "model")
Rel(citizen_financial_claim_repository_log_wrapper, health_checker, "")
Rel(citizen_financial_claim_repository_log_wrapper, citizen_financial_claim_process, "model, repositories", $tags="relRed")
Rel(scheme_repository_log_wrapper, health_checker, "")
Rel(scheme_repository_log_wrapper, scheme_process, "model, repositories")
Rel(service_discovery_repository_log_wrapper, service_discovery_process, "model, repositories")
Rel(session_repository_log_wrapper, health_checker, "")
Rel(session_repository_log_wrapper, session_process, "model, repositories")

Rel(citizen_financial_claim_process, cryptography_test_helper, "", $tags="relRed")
Rel(citizen_financial_claim_process, jwt_test_helper, "")
Rel(app_management_process, cryptography_test_helper, "")

@enduml
