{
  "contact_opties": [
    {
      "contact_vorm": "telefoon",
      "url": "tel:+31880424242",
      "naam": "Telefoon",
      "omschrijving": "Placeholder voor omschrijving",
      "prioriteit": 1
    },
    {
      "contact_vorm": "e_mail",
      "url": "mailto:cjib@mailtniet.nl?subject=RVO mailt nooit",
      "naam": "E-mail",
      "omschrijving": "Placeholder voor omschrijving",
      "prioriteit": 2
    },
    {
      "contact_vorm": "persoonlijke_website",
      "url": "https://mijn.rvo.nl/home",
      "naam": "Mijn RVO",
      "omschrijving": "Placeholder voor omschrijving",
      "prioriteit": 3
    },
    {
      "contact_vorm": "publieke_website",
      "url": "https://www.rvo.nl/",
      "naam": "Website",
      "omschrijving": "Placeholder voor omschrijving",
      "prioriteit": 4
    }
  ],
  "zaakkenmerk": "RVO_12345"
}
