{
  "datumtijd_opgelegd": "2023-05-11T00:00:00Z",
  "zaakkenmerk": "81029991234567891",
  "beschikkingsnummer": "81029991234567891-123",
  "bsn": "814859094",
  "primaire_verplichting": false,
  "type": "CJIB_KOSTEN_EERSTE_AANMANING",
  "categorie": "Algemeen",
  "bedrag": 5200,
  "omschrijving": "Kosten eerste aanmaning",
  "juridische_grondslag_omschrijving": "CJIB mag op grond van Artikel 63d van het Organisatiebesluit Ministerie van Justitie en Veiligheid aanmaningskosten in rekening brengen",
  "juridische_grondslag_bron": "http://wetten.overheid.nl/BWBR0045971/2021-12-03/0",
  "opgelegd_door": "00000004000000044000",
  "uitgevoerd_door": "00000004000000044000",
  "gebeurtenis_type": "FinancieleVerplichtingOpgelegd",
  "gebeurtenis_kenmerk": "81029991234567891-4",
  "datumtijd_gebeurtenis": "2023-05-11T00:00:00Z"
}
