{
  "datumtijd_opgelegd": "2023-03-31T10:25:00Z",
  "zaakkenmerk": "81029991234567891",
  "beschikkingsnummer": "81029991234567891-123",
  "bsn": "814859094",
  "primaire_verplichting": true,
  "type": "CJIB_WAHV",
  "categorie": "Algemeen",
  "bedrag": 10400,
  "omschrijving": "Kenteken: a-000-aa; 11 km te hard buiten de bebouwde kom op 31 maart 2023",
  "juridische_grondslag_omschrijving": "Boete voor te hard rijden Artikel 21 (RVV 1990)",
  "juridische_grondslag_bron": "http://wetten.overheid.nl/jci1.3:c:BWBR0004825\u0026hoofdstuk=II\u0026paragraaf=8\u0026artikel=21\u0026z=2023-01-01\u0026g=2023-01-01",
  "opgelegd_door": "00000004000000044000",
  "uitgevoerd_door": "00000004000000044000",
  "gebeurtenis_type": "FinancieleVerplichtingOpgelegd",
  "gebeurtenis_kenmerk": "81029991234567891-1",
  "datumtijd_gebeurtenis": "2023-03-31T10:25:00Z"
}
