[
    {
        "oin": "00000002003214394002",
        "organization": "Belastingdienst",
        "introText": "De Belastingdienst int namens de Rijksoverheid de belasting die belastingplichtigen moeten betalen, zoals inkomstenbelasting, vennootschapsbelasting en motorrijtuigenbelasting.",
        "availableClaims": [
            "Inkomensheffing",
            "Zorgverzekeringswet",
            "Motorrijtuigenbelasting",
            "Erfbelasting",
            "Zorgtoeslag"
        ],
        "nonAvailableClaims": [
            "Bestuurlijke boetes (BDGO)",
            "Kindgebonden budget",
            "BPM Registratie Parallelle Import",
            "Belasting personenauto's en motorrijwielen",
            "Schenkbelasting",
            "Huurtoeslag",
            "Kinderopvangtoeslag",
            "Dwangsommen (BDGO)"
        ]
    },
    {
        "oin": "00000001800866472000",
        "organization": "DUO",
        "introText": "De Dienst Uitvoering Onderwijs (DUO) voert als baten-lastendienst in opdracht van de minister van Onderwijs, Cultuur en Wetenschap onderwijswetten en -regelingen uit. Ook voert DUO in opdracht van het ministerie van Sociale Zaken en Werkgelegenheid de Wet inburgering uit.",
        "availableClaims": [
            "Langlopende lening studiefinanciering (sf)",
            "Langlopende schulden levenlanglerenkrediet",
            "Schulden in ISI: Leningen voor Inburgering",
            "Schulden in ISI: Bestuurlijke boetes voor Inburgering",
            "OV-boete zonder betalingsregeling"
        ],
        "nonAvailableClaims": [
            "Alle schulden waarvoor een deurwaarderstraject is gestart",
            "Lesgeld (evt. mét termijnregeling) maar zonder betalingsregeling",
            "Achterstallige termijnen langlopende lening waarvoor een regeling is getroffen, ov-boete met betalingsregeling, lesgeld achterstallige termijnen",
            "Langlopende schuld tegemoetkoming scholieren",
            "Kortlopende schulden studiefinanciering",
            "Schulden uit SFBES",
            "Schulden uit ABL-light: korte scholingstraject, tegemoetkoming onderwijs masters, bewegingsonderwijs of cultuurbeurs",
            "Schulden uit ABL: lerarenbeurs, instructeursbeurs en subsidie tweede lerarenopleiding",
            "Kortlopende schuld tegemoetkoming scholieren ",
            "Kortlopende schulden en langlopende schulden uit tegemoetkoming leraren en tegemoetkoming deeltijders",
            "Kortlopende schulden levenlanglerenkrediet",
            "Bestuurlijke boete misbruik uitwonende beurs"
        ]
    },
    {
        "oin": "00000001803670114000",
        "organization": "CAK",
        "introText": "Het CAK is de organisatie die in de zorg financiële regelingen uitvoert en burgers informeert. Dit doet het CAK in opdracht voor het ministerie van Volksgezondheid, Welzijn en Sport. Eén van de belangrijkste taken van het CAK is het innen en berekenen van de eigen bijdragen voor zorg voor de Wlz (Wet langdurige zorg) en de Wmo (Wet maatschappelijke ondersteuning).",
        "availableClaims": [
            "Eigen bijdrage Wlz",
            "Eigen bijdrage Wmo",
            "Verdragsbijdrage Zvw/Wlz",
            "Bestuursrechtelijke premie Zvw"
        ],
        "nonAvailableClaims": [
            "Bestuursrechtelijke Premie: Wanbetalers (broninhouding)",
            "Bestuursrechtelijke premie (wanbetalers regeling)",
            "Boete (onverzekerden regeling)",
            "Premie",
            "Eindafrekening (onverzekerden regeling)",
            "Bestuursrechtelijke Premie: Onverzekerden (broninhouding)"
        ]
    },
    {
        "oin": "00000004000000044000",
        "organization": "CJIB",
        "introText": "Het CJIB zorgt voor de inning van veel verschillende soorten boetes, zoals de verkeersboete en de strafbeschikking. Ook heeft het een centrale rol bij de afhandeling van strafrechtelijke beslissingen, zoals bijvoorbeeld een uitspraak van een rechter of een beslissing van een officier van justitie van het Nederlandse Openbaar Ministerie.",
        "availableClaims": [
            "WAHV beschikkingen (Mulder boetes)",
            "OM-afdoening",
            "Boetevonnissen",
            "Ontnemingsmaatregelen (PLUKZE)"
        ],
        "nonAvailableClaims": [
            "Schadevergoedingsmaatregelen vonnissen",
            "Schikkingen *3)",
            "Voorwaardelijk sepot schadevergoeding",
            "Confiscatiebeslissingen",
            "Transactievoorstel",
            "waarborgsom schorsing voorlopige hechtenis *2)",
            "Europese geldelijke sancties",
            "Schadevergoeding als bijzondere voorwaarde",
            "Storting Schadefonds ",
            "Geldsom voorwaardelijke gratie",
            "Waarborgsom"
        ]
    },
    {
        "oin": "00000001002179908000",
        "organization": "SVB",
        "introText": "De SVB voert verschillende wetten en regelingen uit als het gaat om sociale zekerheid. Een voorbeeld van deze wetten en regelingen is de AOW, kinderbijslag en het Persoonsgebonden budget (PGB).",
        "availableClaims": [
            "Vordering AOW"
        ],
        "nonAvailableClaims": [
            "Vordering AIO",
            "Vordering AKW (kinderbijslag)",
            "Vordering ANW (nabestaanden)",
            "Vordering KGB (kindgebonden budget)",
            "Vordering Remigratie",
            "Vordering OBR (overbruggingsregeling)",
            "Vordering KOT (kinderopvangtoeslag)",
            "Vordering BBL (bijstand buitenland)",
            "Vordering OW (ongevallenwet)",
            "Vordering WUV",
            "Vordering WLZ - Zorgverlener",
            "Vordering WMO - Zorgverlener",
            "Vordering Jeugdwet - Zorgverlener",
            "Vordering ZVW - Zorgverlener",
            "Vordering WBP",
            "Vordering WBPZO",
            "Vordering WIV",
            "Vordering WUBO",
            "Vordering AOR",
            "Vordering WLZ - Derden",
            "Vordering WMO - Derden",
            "Vordering Jeugdwet - Derden",
            "Vordering ZVW - Derden",
            "Vordering WLZ - Budgethouder",
            "Vordering WMO - Budgethouder",
            "Vordering Jeugdwet - Budgethouder",
            "Vordering ZVW - Budgethouder"
        ]
    },
    {
        "oin": "00000001810220350000",
        "organization": "UWV",
        "introText": "Het Uitvoeringsinstituut Werknemersverzekeringen (UWV) verzorgt uitkeringen zoals WW en WAO en helpt werkzoekenden bij het vinden van werk.",
        "availableClaims": [
            "Terugvorderen NOW",
            "Verhalen uitkeringen WIA eigenrisico (-drager)"
        ],
        "nonAvailableClaims": [
            "Terugvordering WIA",
            "Terugvordering ZW",
            "Terugvordering WW",
            "Terugvordering Wajong",
            "Boete",
            "Verhalen uitkeringen WW eigenrisico(drager)",
            "Verhalen faillissementsuitkeringen",
            "Terugvordering WIA toeslag",
            "Terugvordering WAO",
            "Terugvordering WW toeslag",
            "Terugvordering IOW",
            "Terugvordering ZW toeslag",
            "Terugvordering WAO toeslag",
            "Terugvordering Wajong toeslag",
            "Terugvordering WW faillissementen",
            "Terugvordering WAZ",
            "Terugvordering op verzoek werkgever",
            "Terugvorderen CRTV",
            "Terugvordering WAZO",
            "Verhalen uitkeringen ZW AOW+",
            "SV vorderingen",
            "EU vorderingen",
            "Terugvordering WAZ toeslag",
            "Terugvorderen buitengewoon natuurlijke omstandigdheden",
            "Terugvorderen werktijdverkorting",
            "Dwangsom",
            "Bestuurlijke boetes",
            "Onregelmatigheden"
        ]
    },
    {
        "oin": "00000004000000006000",
        "organization": "RVO",
        "introText": "RVO beantwoordt vragen van ondernemend Nederland over duurzaam, agrarisch, vernieuwend en internationaal ondernemen. RVO biedt voorlichting, advies en financiering. RVO stelt regelingen op, voert ze uit en zorgt voor de naleving van wetten en regels.",
        "availableClaims": [
            "Heffing Diergezondheidsfonds"
        ],
        "nonAvailableClaims": [
            "I&R",
            "EU subsidies",
            "Dierrechten",
            "Fosfaatrechten",
            "Leges CITES",
            "Nationale subsidies",
            "Bestuurlijke boetes",
            "CO2 heffing op tuinders",
            "Visserijrechten",
            "Dwangsommen",
            "Dierenwelzijn",
            "Bestuurlijke boetes CITES",
            "Terugvorderen van subsidie EZK",
            "Terugbetaling TVL",
            "Kosten bestuursdwang",
            "Terugvorderen van subsidie IenW",
            "FENF (Hoofdstuk 7 Wet natuurbescherming)",
            "INVA (invasieve uitheemse soorten)"
        ]
    },
    {
        "oin": "99000000000000000002",
        "organization": "NIO",
        "introText": "NIO is een fictieve overheidsorganisatie t.b.v. generieke scenario's",
        "availableClaims": [
            "NIO Wet Financiering",
            "NIO Wet ABC Lening",
            "NIO Wet ABC Ontheffing"
        ],
        "nonAvailableClaims": []
    },    
    {
        "oin": "99000000000000000003",
        "organization": "RCI",
        "introText": "RCI is een fictieve overheidsorganisatie t.b.v. generieke scenario's",
        "availableClaims": [
            "RCI Boete",
            "RCI Administratiekosten",
            "RCI Kosten eerste aanmaning"
        ],
        "nonAvailableClaims": []
    },
    {
        "oin": "99000000000000000001",
        "organization": "RMB",
        "introText": "RMB is een fictieve overheidsorganisatie t.b.v. generieke scenario's",
        "availableClaims": [
            "RMB Heffing",
            "RMB Fonds heffing"
        ],
        "nonAvailableClaims": []
    },
    {
        "oin": "00000001822948837000",
        "organization": "Belastingsamenwerking Zonnewoud",
        "introText": "Belastingsamenwerking Zonnewoud",
        "availableClaims": [],
        "nonAvailableClaims": []
    }
]