module gitlab.com/blauwe-knop/common/rsa-mobile

go 1.19

require (
	github.com/lestrrat-go/jwx v1.2.25
	github.com/stretchr/testify v1.7.1
	golang.org/x/crypto v0.9.0
	software.sslmate.com/src/go-pkcs12 v0.2.0
)

require (
	github.com/davecgh/go-spew v1.1.0 // indirect
	github.com/decred/dcrd/dcrec/secp256k1/v4 v4.2.0 // indirect
	github.com/goccy/go-json v0.10.2 // indirect
	github.com/lestrrat-go/backoff/v2 v2.0.8 // indirect
	github.com/lestrrat-go/blackmagic v1.0.1 // indirect
	github.com/lestrrat-go/httpcc v1.0.1 // indirect
	github.com/lestrrat-go/iter v1.0.2 // indirect
	github.com/lestrrat-go/option v1.0.1 // indirect
	github.com/pkg/errors v0.9.1 // indirect
	github.com/pmezard/go-difflib v1.0.0 // indirect
	gopkg.in/yaml.v3 v3.0.0-20200313102051-9f266ea9e77c // indirect
)
