2
5
20
10
3
6
9
16
14
17
548
121
626
408
510
540
2478
2002
1613
506
2552
1271
2640
851
3354
2135
3480
954
165
2893
58268694
73690651
47391725
77983550
29659186
60334985
67107206
38437586
24254594
80796604
15786899603025688
31113503465410184
113998791686974800
9779103639624492
94097122050942288
150278536605546712
102852656619617273
42629456900116143
133529547238474590
136480774161696497
