
Query index: 1656


My: 175231204
Correct: 165524961

Velikost boxu: 100000000,100000000
Vchod je na:    64179263,100000000


                        100000000,100000000
-H #5519 = 175231204, at 48302362,199997077
-H #4130 = 165524961, at 16462013,199999763

