50
5 8 0 5 9
3 5 0 2 4
8 7 6 3 6
2 5 0 3 2
6 9 4 4 3
8 5 2 0 8
2 9 0 3 1
6 2 2 1 8
8 9 1 1 2
6 7 5 2 0
89 79 8 19 74
19 54 14 27 56
14 68 13 16 33
36 60 34 59 34
58 37 15 32 56
63 70 30 41 54
94 50 79 20 74
98 79 88 59 51
88 71 83 48 84
94 52 26 14 81
30 85 0 47 807627837
79 15 26 3 873785778
53 29 3 5 856450630
95 37 79 20 843849222
72 25 22 3 861767128
50 38 10 0 904293964
63 67 46 39 961681509
40 65 26 44 839975708
95 45 2 16 807295032
99 21 46 0 933625168
10955 14363 4268 1966 11017
19593 13291 3725 10656 11658
17811 15979 9536 3835 11105
18436 16587 9488 13911 9867
17000 13627 5994 8129 8833
16026 16169 2912 8609 7290
10666 18714 6260 487 8076
15023 12725 574 12520 10329
15377 13033 3939 5286 10138
16118 10740 9406 3778 10883
919808945 980764411 220474917 747465528 867135681
108382048 796462317 52705674 309216560 901406428
800529845 382041861 233865297 79253990 962264992
250811218 970890874 99710409 304556064 871599744
770527398 812962315 279177981 648179411 901264620
517762268 161045529 348748556 45469643 937872939
397215595 845113643 29774970 190015810 925859934
538289383 298397858 307454102 137316080 853055404
323728679 336243783 140156259 238152607 997539634
302394962 813967744 18551898 179037191 989414682
