20
8
24
4
13
20
3
6
7
1
2318
513
308
341
992
2030
1915
1405
2462
2312
1275
592
769
1758
900
950
2111
1300
2137
1039
55390255
70258617
91672790
71015726
68193900
43573050
31023906
30666535
69155407
75766816
451057939087728197
43161108535642608
152917955884920772
121755161326512266
313204868624503185
41691649173149886
167846159273431293
80312199435670807
54425877846276329
123069872508052864
