10
3
15
6
3
11
14
2
24
4
880
791
169
1254
638
305
1627
222
99
2401
2340
531
1681
717
767
1073
924
540
864
1092
32151776
75487060
56815122
29131946
58401589
40240815
50555643
74735732
52426851
69183824
18056880021721320
51169654480770098
39209300577075980
127094101816624472
328266727808399926
173294750033150637
59142279217032174
84649580186069073
52712180461828960
54001721918386125
