50
3 9 0 4 5
9 3 0 0 8
3 6 0 3 3
9 6 4 4 2
4 8 2 4 8
9 7 6 3 0
3 3 1 1 4
9 7 1 5 5
9 2 8 0 1
5 7 1 2 5
48 26 40 23 80
48 82 23 8 82
31 53 19 35 19
20 76 14 58 83
21 13 7 7 81
87 86 62 31 18
48 13 42 12 14
67 16 54 4 40
31 80 23 17 47
92 19 65 13 47
58 59 57 38 934605016
46 62 28 13 919089637
42 97 3 61 923645887
35 86 8 22 982132616
63 95 48 58 893547924
75 52 55 32 816729390
65 46 46 28 930741542
50 66 14 46 854591565
92 69 54 53 828903638
91 10 65 4 866529156
13362 12999 5401 2679 11979
14187 11666 9448 7335 7215
11733 17140 325 6055 9980
10427 17905 7708 12139 8731
13052 16598 1666 10102 9713
17080 16048 1875 13042 7614
17312 17541 2478 14279 8472
13593 14115 13 12577 11310
14705 17670 13910 8621 8805
15782 14018 2974 12726 11064
284152794 280606672 80595074 57462876 944933279
613518375 118259669 441975679 89121827 901037495
908646293 968080195 487348743 138796259 872250122
411631508 162409853 264071221 66647175 939292142
150719899 492237056 127540317 188455181 879120647
739692970 132302131 322658048 76336329 805135752
642385082 832933178 343357342 425419389 945945767
283192055 557320472 114629271 67847262 991113355
217759283 633814028 99360003 246126264 972610287
431443673 677902180 424649146 393392082 896344531
