-2147483648
-2147483648
109071
88019
-2147483648
104923
-2147483648
114927
127694
108961
-2147483648
131422
104128
118149
98572
109153
105082
-2147483648
126105
-2147483648
-2147483648
105288
-2147483648
93988
-2147483648
-2147483648
117874
119460
-2147483648
92371
-2147483648
92880
-2147483648
109833
105005
-2147483648
-2147483648
107213
116047
84726
118942
-2147483648
-2147483648
126862
-2147483648
102896
-2147483648
-2147483648
127579
-2147483648
-2147483648
-2147483648
-2147483648
108623
128122
-2147483648
113500
96641
118095
-2147483648
117188
-2147483648
102246
94545
-2147483648
98926
-2147483648
-2147483648
-2147483648
-2147483648
104944
-2147483648
-2147483648
-2147483648
-2147483648
-2147483648
95189
-2147483648
-2147483648
-2147483648
106239
112900
-2147483648
-2147483648
-2147483648
106314
-2147483648
127788
132276
106246
126313
105054
-2147483648
97171
-2147483648
117648
95938
104828
113048
-2147483648
-2147483648
-2147483648
-2147483648
106129
108079
-2147483648
-2147483648
127166
-2147483648
118991
-2147483648
120338
-2147483648
-2147483648
111572
100128
93004
-2147483648
-2147483648
-2147483648
-2147483648
116123
-2147483648
-2147483648
113028
-2147483648
117219
-2147483648
109548
-2147483648
91113
118048
-2147483648
113731
-2147483648
-2147483648
101740
-2147483648
-2147483648
-2147483648
117640
96206
109528
109378
108832
-2147483648
106519
-2147483648
-2147483648
-2147483648
101128
-2147483648
-2147483648
106415
98248
101820
-2147483648
-2147483648
-2147483648
116005
105929
112700
-2147483648
97833
-2147483648
-2147483648
112099
95429
110375
108911
110354
-2147483648
-2147483648
-2147483648
-2147483648
101393
121546
110120
-2147483648
105987
111637
112866
-2147483648
-2147483648
119762
123363
104451
97525
128604
112975
-2147483648
-2147483648
-2147483648
121387
105298
99150
95041
-2147483648
-2147483648
-2147483648
109358
-2147483648
120802
114439
124798
86549
-2147483648
-2147483648
-2147483648
115272
-2147483648
-2147483648
-2147483648
98354
121820
-2147483648
133587
99140
114419
-2147483648
-2147483648
-2147483648
102551
99989
124493
-2147483648
-2147483648
99402
-2147483648
115315
-2147483648
-2147483648
121076
-2147483648
101774
106914
106407
106594
90062
-2147483648
108131
106141
115418
-2147483648
-2147483648
112161
99801
-2147483648
119277
-2147483648
115453
111754
-2147483648
97878
-2147483648
93977
116802
121700
-2147483648
-2147483648
-2147483648
-2147483648
-2147483648
114099
119732
120913
104756
94774
101331
118622
105146
-2147483648
101795
107259
-2147483648
-2147483648
-2147483648
-2147483648
-2147483648
-2147483648
109655
-2147483648
-2147483648
124064
-2147483648
-2147483648
-2147483648
117935
-2147483648
125118
-2147483648
109824
-2147483648
104929
-2147483648
-2147483648
-2147483648
120481
-2147483648
-2147483648
-2147483648
104825
-2147483648
-2147483648
119919
104093
101805
115169
-2147483648
-2147483648
-2147483648
-2147483648
103703
-2147483648
-2147483648
-2147483648
110575
115166
-2147483648
93841
-2147483648
-2147483648
-2147483648
-2147483648
115127
111607
131616
126829
-2147483648
-2147483648
111998
-2147483648
-2147483648
-2147483648
-2147483648
112354
120341
-2147483648
-2147483648
127399
105306
115241
111521
-2147483648
122679
-2147483648
-2147483648
-2147483648
-2147483648
86912
-2147483648
118686
117818
-2147483648
96504
-2147483648
-2147483648
-2147483648
125795
108976
-2147483648
-2147483648
-2147483648
-2147483648
114931
118164
113509
81494
128121
128146
108514
-2147483648
116489
-2147483648
-2147483648
-2147483648
-2147483648
-2147483648
116079
114495
109217
108160
116561
-2147483648
116610
-2147483648
108561
128444
121387
132191
113187
107068
108185
-2147483648
117988
-2147483648
-2147483648
-2147483648
-2147483648
-2147483648
101261
110294
112641
106058
-2147483648
126834
132535
-2147483648
102997
-2147483648
-2147483648
-2147483648
-2147483648
99207
114998
-2147483648
-2147483648
104566
107162
-2147483648
106973
99640
108825
-2147483648
119109
-2147483648
-2147483648
-2147483648
-2147483648
-2147483648
-2147483648
110617
-2147483648
-2147483648
-2147483648
-2147483648
-2147483648
105228
110092
-2147483648
114426
-2147483648
-2147483648
-2147483648
103674
-2147483648
-2147483648
-2147483648
108116
118237
106736
-2147483648
-2147483648
-2147483648
110127
-2147483648
-2147483648
-2147483648
-2147483648
-2147483648
-2147483648
-2147483648
-2147483648
-2147483648
114458
101971
93970
-2147483648
-2147483648
126062
-2147483648
-2147483648
126371
-2147483648
102758
-2147483648
119550
98880
92726
-2147483648
-2147483648
-2147483648
114044
126742
117664
-2147483648
121335
110954
90399
108818
-2147483648
98769
97986
105365
125407
-2147483648
116539
-2147483648
-2147483648
-2147483648
-2147483648
-2147483648
-2147483648
103958
116967
-2147483648
100538
108832
-2147483648
-2147483648
-2147483648
101685
-2147483648
-2147483648
-2147483648
-2147483648
-2147483648
-2147483648
-2147483648
109503
117069
112613
-2147483648
99842
-2147483648
-2147483648
-2147483648
114625
105777
99029
-2147483648
-2147483648
116582
94748
100294
-2147483648
-2147483648
109276
-2147483648
-2147483648
-2147483648
-2147483648
-2147483648
-2147483648
101681
-2147483648
88175
-2147483648
125751
108465
126641
104082
121777
108132
103233
-2147483648
-2147483648
-2147483648
-2147483648
-2147483648
-2147483648
87825
104744
105661
-2147483648
110918
115286
-2147483648
111530
-2147483648
-2147483648
-2147483648
115217
107953
105706
103173
104981
103114
-2147483648
101859
-2147483648
111034
95236
109181
-2147483648
55549
101723
108667
-2147483648
121218
85759
-2147483648
96112
116892
133607
128678
-2147483648
102269
-2147483648
-2147483648
115979
-2147483648
96656
-2147483648
-2147483648
118479
-2147483648
-2147483648
-2147483648
91332
-2147483648
101755
-2147483648
114967
115885
106198
129687
117289
88422
-2147483648
110004
115227
130167
115258
123897
92784
-2147483648
-2147483648
-2147483648
-2147483648
112546
94773
-2147483648
106373
121970
-2147483648
-2147483648
102161
-2147483648
-2147483648
96074
93519
110265
113661
-2147483648
-2147483648
-2147483648
119461
115421
-2147483648
119546
111893
113924
99508
-2147483648
100815
-2147483648
-2147483648
-2147483648
-2147483648
-2147483648
-2147483648
115317
113594
-2147483648
108652
115842
103802
-2147483648
94955
-2147483648
97719
111615
-2147483648
-2147483648
-2147483648
-2147483648
-2147483648
-2147483648
129215
-2147483648
104587
-2147483648
-2147483648
97556
-2147483648
116809
113716
-2147483648
-2147483648
-2147483648
103836
109863
121766
106186
-2147483648
-2147483648
-2147483648
110606
125738
110254
70250
-2147483648
-2147483648
-2147483648
-2147483648
104419
-2147483648
116766
-2147483648
-2147483648
-2147483648
-2147483648
102274
-2147483648
116463
-2147483648
117576
118952
119888
96722
120241
-2147483648
104162
-2147483648
132078
-2147483648
-2147483648
103479
113156
-2147483648
-2147483648
-2147483648
-2147483648
109978
108070
-2147483648
107001
-2147483648
-2147483648
-2147483648
117304
126169
119798
-2147483648
-2147483648
-2147483648
108545
-2147483648
109792
83243
-2147483648
-2147483648
-2147483648
110645
-2147483648
-2147483648
-2147483648
99681
-2147483648
-2147483648
105890
-2147483648
126149
100510
96689
-2147483648
-2147483648
-2147483648
129447
-2147483648
77126
112845
-2147483648
116084
-2147483648
-2147483648
126230
129256
-2147483648
100959
-2147483648
-2147483648
-2147483648
119854
113685
106914
-2147483648
92729
-2147483648
-2147483648
102659
118023
-2147483648
110461
-2147483648
117430
-2147483648
113111
126342
106601
-2147483648
123311
-2147483648
102273
-2147483648
-2147483648
-2147483648
-2147483648
101538
118450
-2147483648
-2147483648
-2147483648
-2147483648
98437
121594
83617
124724
125830
-2147483648
-2147483648
108127
111436
108753
-2147483648
-2147483648
127027
114519
-2147483648
-2147483648
-2147483648
-2147483648
122884
-2147483648
121131
101943
105645
-2147483648
118662
117874
-2147483648
-2147483648
-2147483648
112760
-2147483648
-2147483648
105021
-2147483648
125495
113970
98286
132758
-2147483648
117898
128948
-2147483648
119576
-2147483648
88693
125876
123882
-2147483648
112628
110091
116129
-2147483648
-2147483648
-2147483648
-2147483648
-2147483648
-2147483648
113861
-2147483648
102557
120759
-2147483648
112023
-2147483648
125992
123257
-2147483648
-2147483648
116537
-2147483648
-2147483648
124150
109414
118340
118764
116797
-2147483648
125325
-2147483648
-2147483648
-2147483648
85668
-2147483648
111452
-2147483648
110122
-2147483648
-2147483648
-2147483648
-2147483648
-2147483648
121994
123334
117814
114179
114784
116493
-2147483648
129956
-2147483648
-2147483648
125093
104384
-2147483648
105529
-2147483648
111773
-2147483648
-2147483648
-2147483648
110723
101498
-2147483648
94147
118530
-2147483648
-2147483648
129962
-2147483648
109165
107883
-2147483648
76178
-2147483648
-2147483648
113383
120680
-2147483648
109698
-2147483648
-2147483648
108528
-2147483648
-2147483648
108496
-2147483648
114673
-2147483648
-2147483648
97446
-2147483648
-2147483648
-2147483648
125014
-2147483648
94602
-2147483648
-2147483648
-2147483648
-2147483648
-2147483648
-2147483648
-2147483648
-2147483648
-2147483648
122111
99378
114044
132598
83814
-2147483648
90263
-2147483648
-2147483648
-2147483648
103861
107924
-2147483648
119813
-2147483648
-2147483648
110753
115002
-2147483648
121215
-2147483648
-2147483648
-2147483648
87586
-2147483648
109159
125636
-2147483648
117812
-2147483648
102352
106458
121870
-2147483648
115002
98704
-2147483648
105530
115726
-2147483648
103527
-2147483648
-2147483648
104143
-2147483648
109622
108562
-2147483648
-2147483648
-2147483648
-2147483648
108946
-2147483648
118281
-2147483648
-2147483648
-2147483648
-2147483648
111137
134754
-2147483648
122226
118569
-2147483648
-2147483648
-2147483648
110908
-2147483648
106902
-2147483648
-2147483648
102671
-2147483648
-2147483648
-2147483648
-2147483648
107718
123544
-2147483648
-2147483648
-2147483648
-2147483648
123225
129781
-2147483648
121045
-2147483648
109767
123762
-2147483648
-2147483648
-2147483648
-2147483648
111682
-2147483648
126194
-2147483648
-2147483648
-2147483648
-2147483648
-2147483648
-2147483648
122955
-2147483648
-2147483648
105324
-2147483648
122284
-2147483648
105703
106532
119436
-2147483648
-2147483648
-2147483648
109044
114054
122893
-2147483648
-2147483648
126291
-2147483648
108104
-2147483648
117112
-2147483648
-2147483648
108784
107748
-2147483648
107769
105800
-2147483648
-2147483648
124198
109398
113951
-2147483648
128561
106186
-2147483648
-2147483648
-2147483648
119372
-2147483648
-2147483648
-2147483648
109722
-2147483648
-2147483648
111946
110846
-2147483648
109404
-2147483648
106793
117956
86950
118176
-2147483648
-2147483648
114277
92280
101940
-2147483648
-2147483648
120898
-2147483648
121658
109677
-2147483648
-2147483648
116873
89817
116785
97291
131558
-2147483648
114175
-2147483648
96119
98524
-2147483648
121014
96356
89428
101602
116291
101145
69259
123865
105791
106277
-2147483648
110248
96594
-2147483648
-2147483648
111424
122090
-2147483648
114173
134075
131425
99838
-2147483648
115407
107105
107454
116079
106783
-2147483648
-2147483648
120474
-2147483648
120022
-2147483648
107476
-2147483648
-2147483648
101147
-2147483648
-2147483648
-2147483648
115386
121715
101220
132721
70429
123645
-2147483648
-2147483648
-2147483648
101104
-2147483648
89105
-2147483648
-2147483648
107150
-2147483648
125457
-2147483648
120812
101688
-2147483648
120467
108432
-2147483648
90103
-2147483648
110385
-2147483648
101219
100357
101516
-2147483648
-2147483648
110217
96552
125169
125964
115164
-2147483648
109017
115633
106727
-2147483648
90526
117152
126635
-2147483648
132784
111724
95013
-2147483648
-2147483648
-2147483648
-2147483648
-2147483648
-2147483648
114183
108483
115677
-2147483648
-2147483648
-2147483648
-2147483648
-2147483648
109541
130760
117644
-2147483648
-2147483648
124286
-2147483648
-2147483648
113809
-2147483648
-2147483648
-2147483648
115297
95644
123819
-2147483648
-2147483648
-2147483648
-2147483648
-2147483648
98708
-2147483648
-2147483648
126348
126656
-2147483648
-2147483648
-2147483648
109992
-2147483648
107508
122262
-2147483648
126849
-2147483648
-2147483648
94841
115243
135515
-2147483648
-2147483648
-2147483648
-2147483648
86286
113688
-2147483648
-2147483648
115920
-2147483648
117082
117343
-2147483648
-2147483648
131150
-2147483648
-2147483648
132150
98353
-2147483648
110287
113960
-2147483648
-2147483648
127080
-2147483648
112721
101201
111334
-2147483648
98193
-2147483648
-2147483648
120074
98184
-2147483648
-2147483648
123243
-2147483648
-2147483648
-2147483648
-2147483648
123480
103577
-2147483648
106385
-2147483648
109333
95643
96769
-2147483648
109728
110987
-2147483648
97208
-2147483648
134309
119900
130403
109319
-2147483648
-2147483648
-2147483648
-2147483648
-2147483648
-2147483648
83633
-2147483648
112898
123028
94259
-2147483648
125570
-2147483648
103195
-2147483648
-2147483648
97143
-2147483648
-2147483648
112178
-2147483648
106777
112565
127600
-2147483648
-2147483648
