Ne.
1
1 2
Ano.
Ne.
3
0 1
2 3
4 6
Ne.
1
0 1
Ne.
2
0 1
4 6
Ne.
9
0 1
7 9
14 16
17 18
20 21
23 24
27 28
30 34
35 36
Ne.
4
4 11
12 14
18 20
21 23
Ne.
3
0 4
6 8
9 16
Ne.
5
1 3
4 12
14 16
17 19
21 23
Ne.
4
0 1
2 6
8 10
11 12
Ne.
23
1 3
6 7
8 10
11 12
18 19
20 21
22 24
26 28
30 32
33 34
35 36
38 39
43 44
45 47
49 51
54 55
56 59
60 61
63 65
68 69
75 76
78 80
83 84
Ne.
23
1 3
4 6
11 12
13 14
16 18
19 21
22 27
28 30
31 32
34 35
36 38
39 42
44 45
47 49
51 54
61 62
64 65
66 71
72 73
75 76
77 78
79 80
83 84
Ne.
15
2 3
6 7
8 11
16 18
20 21
22 28
29 30
32 34
39 41
43 45
46 47
48 51
53 55
56 57
58 62
Ne.
15
0 3
5 6
7 8
9 11
13 14
16 17
18 19
21 22
24 26
30 34
36 37
40 41
48 49
50 51
52 54
Ne.
25
2 6
8 10
11 12
14 15
16 17
18 20
22 23
26 27
28 29
30 31
33 35
37 38
39 40
42 45
47 49
50 51
52 54
55 56
57 58
59 61
65 66
67 68
71 74
75 76
77 80
Ne.
39
0 2
3 4
5 6
7 9
10 12
13 19
21 22
24 25
26 27
28 31
33 38
39 41
44 45
47 48
54 57
58 59
60 62
66 68
70 71
73 75
76 80
84 85
88 89
92 95
96 97
98 99
100 101
103 106
109 111
114 115
116 118
119 121
122 124
126 128
131 134
135 136
138 144
146 147
149 150
Ne.
37
0 1
3 5
7 8
9 11
15 18
19 23
24 25
26 29
30 32
35 36
37 38
39 42
43 45
48 49
50 51
52 53
54 55
58 62
66 68
71 73
74 78
80 83
84 87
90 91
93 95
97 98
101 103
104 105
106 109
110 111
115 117
118 125
126 127
130 133
134 136
137 138
140 141
Ne.
53
0 2
8 11
13 20
21 22
23 24
25 27
29 31
32 33
35 38
39 40
41 42
43 45
47 48
49 50
51 52
54 55
57 58
59 60
61 62
64 65
71 72
73 74
75 77
78 81
83 84
86 88
89 91
92 95
98 100
103 107
108 118
119 120
125 128
129 130
131 132
133 134
136 138
143 144
145 147
148 151
157 158
159 160
161 163
164 165
169 171
172 173
174 175
178 180
181 182
183 187
188 190
191 192
193 196
Ne.
30
6 8
14 16
17 19
23 25
28 31
32 35
36 37
38 39
45 46
47 48
49 51
52 54
55 58
59 61
62 64
66 67
68 69
70 72
73 74
75 76
81 82
83 85
87 88
89 92
95 101
106 107
110 111
112 113
115 117
121 123
Ne.
41
1 2
5 9
10 11
13 14
16 18
22 27
28 30
31 32
33 34
36 37
39 40
42 43
47 49
50 52
54 56
57 60
61 63
64 66
67 70
71 72
73 75
76 81
83 84
88 89
90 91
95 101
102 106
108 109
110 112
115 116
118 120
121 125
126 129
130 131
132 133
134 135
139 140
141 145
146 147
151 153
154 156
Ne.
101
3 4
5 7
8 9
11 12
15 16
18 21
24 25
26 27
28 29
31 34
36 37
44 45
47 51
53 54
55 56
57 61
63 64
66 67
72 73
74 75
77 83
85 87
89 90
92 95
97 100
101 102
103 104
105 106
111 112
113 114
115 116
117 118
119 120
122 123
124 126
128 129
130 132
133 134
136 138
139 141
142 146
147 150
151 154
155 158
159 161
162 164
165 167
168 169
173 174
176 177
178 180
182 185
187 188
190 191
192 193
194 195
197 199
201 206
208 209
212 213
215 217
218 219
220 222
223 224
225 226
227 228
229 231
232 233
237 239
241 242
245 246
251 252
253 255
256 258
259 260
262 264
266 269
272 275
276 277
279 280
282 285
286 288
289 290
291 294
295 297
298 301
306 308
309 310
313 314
316 320
321 322
323 331
332 336
338 339
340 341
342 344
345 347
350 351
356 358
359 360
361 362
Ne.
127
3 6
9 11
15 17
18 19
25 27
28 29
31 32
33 35
36 37
40 42
46 47
48 49
53 54
56 59
60 61
62 63
64 67
70 71
73 78
79 82
83 85
87 92
93 94
98 99
102 105
108 109
110 111
116 117
120 121
122 126
127 128
130 134
136 140
141 143
144 147
149 151
152 153
155 158
160 161
162 163
164 167
168 170
179 181
183 184
185 187
189 190
193 196
199 200
202 204
208 210
211 212
214 215
218 219
220 223
224 227
228 229
230 236
237 238
239 240
241 242
243 246
247 249
250 253
254 261
262 263
264 266
268 269
271 272
276 277
278 279
280 281
282 283
284 285
287 289
295 296
297 298
302 303
305 308
310 312
313 315
319 321
322 323
324 327
329 330
332 334
335 336
337 339
340 341
342 345
356 357
361 363
364 366
367 369
370 371
374 375
379 380
381 382
383 384
385 387
389 390
392 395
398 399
401 402
405 406
409 410
412 413
416 417
418 420
422 423
426 429
430 433
434 436
438 440
443 445
448 449
451 452
453 454
455 456
457 459
461 462
463 466
470 471
473 479
480 482
484 485
486 487
488 491
Ne.
71
3 4
7 9
12 14
16 18
19 20
21 22
23 25
27 29
31 32
34 36
37 41
42 43
45 48
49 50
53 54
56 57
58 59
60 62
63 64
66 69
70 71
72 74
75 77
83 84
85 89
91 93
94 97
103 104
105 107
108 109
112 113
114 115
116 117
118 120
121 122
123 127
128 131
132 133
136 137
139 140
141 142
144 145
146 150
152 155
156 157
158 161
164 165
170 173
177 180
185 189
190 193
196 199
200 201
203 204
205 208
209 211
216 219
220 221
224 228
230 233
234 236
238 241
242 243
244 247
249 253
254 257
258 260
261 263
264 267
268 273
274 275
Ne.
73
0 2
5 6
7 9
10 11
17 18
20 22
23 25
28 30
33 37
39 41
46 48
49 52
53 56
57 58
59 60
61 62
63 64
65 68
72 73
75 76
77 82
83 86
87 88
94 95
96 98
100 104
108 111
114 117
118 119
120 121
122 124
125 129
130 131
132 133
136 138
139 140
141 143
146 147
148 150
151 153
155 158
160 162
164 169
171 175
178 179
182 184
185 186
187 189
191 193
198 199
201 203
205 206
207 212
213 215
217 218
220 222
224 225
226 233
234 236
237 240
242 244
247 249
250 255
256 257
262 264
265 268
269 270
272 273
274 278
280 282
283 284
285 286
288 289
Ne.
117
5 7
9 10
12 14
16 17
18 19
21 22
23 26
27 29
32 33
36 38
40 41
43 44
46 49
51 53
55 56
57 58
59 60
62 66
67 68
70 72
73 74
76 77
79 81
82 85
87 90
91 93
94 95
98 100
103 107
108 110
114 115
117 119
123 126
128 131
134 135
137 140
141 142
149 151
152 153
156 157
160 161
162 163
165 167
169 170
172 173
174 176
177 178
180 182
183 185
187 189
192 194
196 198
205 207
209 210
211 215
218 220
223 224
226 227
228 230
233 235
238 239
240 242
243 245
247 250
251 252
253 255
257 259
260 262
264 265
266 267
270 273
274 276
277 282
283 286
287 289
292 293
294 295
296 299
301 303
306 308
310 313
314 315
317 319
320 322
325 326
329 330
331 332
333 336
337 338
340 341
343 346
347 348
349 350
357 358
359 360
362 364
369 370
372 374
375 376
377 380
381 383
384 385
386 390
393 395
396 398
404 406
410 411
413 414
417 418
423 424
425 426
427 428
429 430
431 433
434 435
436 437
442 444
Ne.
200
0 2
4 5
6 7
8 10
12 13
14 15
16 18
21 22
23 24
25 26
29 30
33 34
38 39
40 42
46 47
48 49
52 54
55 56
59 62
63 64
65 67
68 69
70 72
75 77
78 80
81 82
83 84
85 88
90 91
93 94
99 102
103 105
106 107
108 111
112 116
117 119
121 122
127 129
130 135
136 141
145 147
148 149
150 151
152 153
154 155
157 158
161 163
165 166
167 170
171 172
174 177
178 179
180 181
182 183
184 185
186 187
188 189
190 191
192 194
196 197
202 203
205 207
208 209
211 212
215 217
219 220
222 223
224 225
226 227
228 233
235 240
242 243
245 246
247 248
251 252
256 257
261 267
268 270
272 275
276 277
279 281
283 286
287 288
290 291
292 293
297 299
300 302
303 306
308 309
310 311
312 314
316 319
320 322
325 326
328 333
334 338
342 345
349 351
352 353
358 359
360 361
365 370
373 375
377 378
391 392
394 399
400 401
402 403
406 407
408 411
413 414
415 417
418 422
426 427
428 429
430 433
436 444
446 447
450 453
464 466
472 473
479 483
484 485
487 488
493 494
495 496
498 500
502 504
506 509
510 511
514 518
519 523
525 526
527 532
533 534
535 536
539 540
541 543
544 546
548 550
552 553
554 558
560 563
566 567
570 573
578 581
583 585
586 591
592 594
595 596
597 599
600 601
605 606
608 609
613 615
616 617
618 622
623 626
628 629
632 633
636 639
640 642
644 649
650 653
656 660
661 664
666 668
669 671
672 673
674 675
677 679
680 681
683 684
687 688
690 691
692 695
696 697
698 700
703 704
705 707
708 713
722 723
724 726
729 730
734 737
739 740
741 742
743 744
747 749
750 753
755 756
757 758
760 762
763 764
765 766
767 769
773 774
776 780
785 786
788 789
Ne.
222
3 4
5 8
9 11
12 17
18 20
21 22
23 25
26 29
31 32
34 35
37 38
39 47
48 49
51 53
55 56
57 58
59 61
62 64
65 66
67 68
69 70
71 74
75 76
77 78
79 81
83 84
85 87
88 89
90 94
95 96
98 99
101 103
104 106
107 108
110 113
114 115
119 120
121 123
124 125
126 127
129 131
132 133
134 136
137 139
140 142
143 144
145 147
148 149
150 151
152 155
156 157
158 160
161 162
163 164
166 167
168 169
170 171
172 173
174 175
177 178
180 181
182 183
184 185
186 187
188 190
192 193
194 196
199 200
202 204
205 206
207 208
209 210
211 214
216 218
219 220
221 222
224 225
228 229
230 231
232 233
234 235
236 238
242 244
247 252
253 254
255 256
257 260
261 262
263 264
267 269
270 271
272 273
275 276
279 280
281 282
283 286
287 289
291 295
296 297
299 300
301 302
304 305
310 311
312 314
315 316
318 320
321 322
324 325
326 330
332 333
334 335
336 337
338 340
341 342
344 345
346 347
348 350
351 352
353 354
357 358
360 361
362 363
367 368
369 370
371 372
373 374
375 377
380 381
383 384
385 386
387 388
389 390
393 395
397 398
400 401
402 404
406 407
408 409
410 411
412 413
415 418
420 424
426 428
429 430
432 436
437 438
439 441
445 449
451 455
456 457
459 460
462 463
464 468
469 472
473 474
475 476
477 478
481 482
483 489
490 491
492 493
495 501
503 507
509 510
511 512
513 514
515 517
519 521
523 524
525 528
530 531
532 534
537 538
541 542
543 544
546 549
550 551
552 553
556 557
558 559
560 561
562 563
564 566
567 568
569 572
574 576
578 580
581 582
583 584
585 586
587 588
590 591
592 593
594 595
598 599
602 603
607 608
609 610
612 613
615 616
617 618
620 621
622 623
624 626
629 630
631 634
636 639
640 641
642 643
644 645
647 649
652 654
656 659
661 662
663 664
665 666
667 668
669 670
672 676
678 681
682 683
685 686
Ne.
149
0 1
2 3
4 5
6 8
10 12
13 18
19 20
22 24
26 28
29 31
33 36
37 38
39 40
45 47
49 50
54 56
58 59
61 65
74 76
77 80
81 83
84 85
87 90
91 92
93 99
100 101
104 105
106 107
108 109
111 112
115 118
119 120
121 123
124 125
127 131
132 133
135 137
138 140
141 142
143 145
148 149
151 152
154 155
156 157
158 159
164 169
170 171
172 173
174 177
178 184
185 186
188 191
192 193
194 195
196 197
198 199
200 203
204 208
209 210
212 213
216 217
218 219
220 223
225 228
229 231
232 233
236 237
238 242
246 247
250 252
254 256
258 259
262 265
266 269
271 272
273 274
276 278
283 284
285 287
288 290
291 292
293 295
296 298
299 300
301 304
313 314
319 323
325 328
331 332
333 335
336 338
342 345
346 351
352 354
355 357
358 361
362 363
365 367
368 370
373 374
375 377
380 381
383 384
386 387
389 390
391 394
398 400
404 405
407 408
409 410
414 415
416 418
419 421
423 424
428 431
432 435
436 437
438 440
443 444
445 448
450 453
456 457
460 461
462 463
467 470
471 473
474 478
480 481
483 484
486 487
488 490
491 492
493 497
498 499
502 505
506 511
514 516
517 518
521 522
523 525
527 529
530 531
533 534
537 541
548 549
551 554
557 558
559 560
561 564
Ne.
193
10 11
17 19
21 23
25 27
28 29
31 32
33 34
35 36
37 40
41 47
48 52
53 54
58 61
62 63
65 67
68 76
80 81
82 83
84 85
86 87
92 93
96 100
105 107
109 110
111 112
115 116
119 120
126 128
129 131
132 133
134 135
136 140
141 143
144 147
148 149
150 151
153 154
157 159
160 162
163 164
166 170
171 172
179 180
181 182
183 185
187 189
190 195
196 198
199 201
203 205
207 209
210 211
215 219
223 225
227 232
233 234
236 239
243 247
249 251
252 253
258 263
266 269
271 274
276 279
283 284
287 289
292 293
294 297
299 303
304 307
310 316
317 321
324 325
326 329
330 331
333 334
335 336
337 340
341 343
347 348
353 354
355 357
358 359
360 361
362 364
365 372
373 375
380 382
383 384
385 387
389 390
391 392
394 395
396 398
400 402
403 404
405 406
409 412
413 416
417 418
419 421
424 428
429 430
432 433
436 439
441 445
448 452
454 455
456 457
460 464
465 466
469 472
473 475
476 479
480 483
487 488
489 491
492 494
497 498
499 502
503 507
508 509
512 513
515 516
519 520
524 525
526 527
529 530
531 532
533 534
537 541
543 545
547 552
553 554
556 558
559 561
562 563
565 568
574 575
578 582
583 584
585 586
589 591
592 593
596 598
601 603
604 605
606 607
609 610
611 612
613 622
625 626
627 629
630 631
633 635
637 642
647 652
655 658
662 664
665 667
671 674
675 677
678 680
682 687
688 689
690 694
695 696
698 699
703 705
706 708
710 711
715 717
718 721
722 723
724 726
736 737
739 740
741 742
743 745
747 749
750 753
754 755
756 757
758 762
763 767
771 775
776 779
782 783
784 785
786 787
788 790
792 793
794 796
Ne.
149
0 1
4 5
6 7
8 11
15 23
24 26
27 28
34 35
39 42
43 46
49 50
54 55
56 60
63 64
65 67
69 70
72 74
79 80
81 83
86 89
91 93
94 96
101 102
103 104
105 106
107 108
109 112
115 121
123 124
125 126
127 129
130 133
134 137
138 140
142 147
148 151
152 155
156 157
158 159
160 162
163 165
168 169
170 171
172 177
178 181
183 184
187 189
190 192
193 194
195 196
199 200
202 204
205 206
209 210
211 213
218 219
220 222
223 226
227 230
232 233
235 236
237 239
240 241
244 245
247 249
251 252
253 255
256 257
259 263
266 268
275 280
284 285
286 287
289 290
292 293
294 295
297 298
301 303
305 307
309 312
313 314
316 324
326 327
328 331
332 333
337 338
339 341
345 347
348 349
351 352
353 354
358 359
362 364
365 366
368 371
376 380
382 383
384 390
391 392
395 397
398 399
404 405
406 410
413 415
416 418
419 421
422 425
427 428
430 431
434 435
441 443
444 448
450 451
452 453
458 460
463 465
466 467
470 471
474 476
477 479
485 487
488 489
492 494
496 497
498 499
500 501
502 503
510 512
514 515
516 517
519 520
521 525
527 528
530 531
532 536
538 539
540 546
547 548
551 553
556 558
565 567
570 571
572 573
574 577
581 582
588 590
596 597
601 603
604 605
Ne.
459
4 5
6 8
9 10
11 12
15 16
17 18
19 20
26 31
32 33
36 39
42 43
45 46
47 48
50 52
54 55
56 59
61 63
68 69
71 72
74 75
76 77
78 79
80 81
82 85
88 89
91 93
94 95
96 97
98 99
101 103
104 105
107 108
109 111
113 114
116 117
118 119
120 121
122 123
124 128
130 132
133 135
139 142
143 144
145 146
149 150
151 156
157 158
159 160
161 164
169 172
173 174
178 180
181 182
187 188
191 193
194 195
196 199
200 203
204 206
211 214
215 217
218 219
220 221
227 229
231 232
235 237
239 241
243 245
246 248
249 250
251 256
258 266
269 271
273 277
278 279
280 281
285 286
287 290
291 293
294 297
299 305
307 309
310 316
317 318
322 323
324 328
330 331
333 337
341 343
346 347
348 349
350 352
356 358
360 361
362 363
366 369
370 371
374 375
376 379
382 384
388 389
390 391
392 393
395 396
399 405
406 407
408 409
410 411
412 415
416 420
422 424
425 426
428 429
432 433
434 435
437 438
439 440
441 447
448 451
452 454
455 457
458 469
470 471
479 483
484 485
490 492
493 494
495 497
498 501
504 507
509 510
512 514
517 518
519 522
525 526
528 529
534 535
537 539
541 544
547 548
549 552
553 554
560 561
562 563
565 566
568 570
571 573
576 578
579 581
586 588
589 591
593 594
596 597
599 600
603 604
605 606
612 613
618 622
623 624
625 629
630 635
636 638
639 642
644 647
648 651
659 660
661 662
663 664
665 668
673 675
676 677
678 680
683 684
685 686
688 689
690 692
694 695
697 699
700 702
703 704
708 709
711 713
714 715
716 718
719 720
721 723
724 727
728 731
740 742
744 745
746 747
748 749
752 754
756 759
760 761
762 763
766 768
770 775
776 777
778 782
783 786
787 789
791 794
795 798
799 801
805 806
808 809
810 811
812 813
814 815
818 819
820 821
823 825
826 827
830 831
835 836
838 844
845 848
850 852
855 857
859 862
867 868
870 871
873 874
876 880
881 882
883 884
885 887
889 890
891 892
894 895
896 897
898 909
911 913
914 915
918 919
922 925
928 931
933 935
936 939
942 944
948 951
953 955
957 960
961 962
967 968
969 971
972 973
977 982
983 984
985 986
987 991
995 1000
1004 1006
1007 1008
1009 1012
1014 1015
1017 1018
1019 1024
1027 1031
1032 1035
1037 1038
1040 1041
1042 1044
1045 1049
1050 1053
1055 1056
1058 1061
1064 1066
1067 1069
1070 1071
1074 1075
1076 1078
1079 1084
1087 1091
1092 1094
1096 1097
1098 1100
1101 1103
1104 1105
1109 1112
1113 1114
1115 1116
1117 1121
1122 1123
1125 1127
1128 1130
1132 1133
1135 1136
1138 1139
1141 1142
1146 1148
1149 1151
1152 1154
1156 1157
1158 1159
1160 1164
1166 1167
1168 1172
1175 1177
1179 1182
1189 1190
1191 1192
1195 1197
1202 1204
1206 1208
1209 1211
1212 1213
1214 1215
1216 1217
1218 1219
1224 1225
1230 1231
1232 1234
1236 1242
1244 1245
1246 1248
1249 1250
1251 1252
1257 1258
1259 1260
1262 1266
1267 1268
1270 1272
1276 1278
1279 1281
1282 1286
1288 1291
1293 1294
1295 1299
1303 1304
1305 1306
1309 1310
1312 1314
1323 1326
1327 1328
1329 1330
1336 1340
1342 1343
1348 1355
1356 1357
1358 1359
1360 1361
1366 1367
1368 1370
1372 1376
1377 1385
1390 1392
1393 1395
1396 1400
1404 1405
1406 1409
1412 1413
1416 1419
1423 1424
1425 1426
1428 1429
1431 1433
1434 1436
1438 1440
1442 1446
1448 1452
1456 1459
1460 1461
1462 1465
1469 1470
1472 1476
1477 1479
1480 1482
1483 1490
1492 1494
1502 1512
1513 1517
1521 1523
1524 1526
1529 1530
1531 1534
1536 1538
1542 1544
1545 1547
1548 1552
1555 1556
1558 1561
1562 1565
1570 1572
1574 1575
1576 1578
1580 1583
1584 1585
1586 1587
1589 1591
1592 1598
1600 1603
1605 1606
1607 1609
1610 1611
1612 1615
1617 1620
1624 1626
1629 1630
1632 1634
1637 1639
1641 1650
1655 1657
1662 1664
1666 1667
1669 1670
1671 1672
1674 1678
1680 1681
1682 1683
1684 1685
1686 1688
1690 1696
1698 1699
1700 1701
1703 1704
1705 1707
1708 1713
1715 1725
1727 1729
1731 1735
1737 1739
1740 1741
1744 1745
1747 1749
1752 1757
1758 1759
1760 1761
1762 1766
1767 1769
1770 1771
1775 1776
1779 1780
1785 1786
1788 1794
1800 1804
1807 1808
1817 1818
1819 1820
1822 1823
1827 1829
1830 1831
1832 1833
1836 1838
1839 1840
1842 1844
1846 1849
1850 1852
1853 1856
1857 1858
1859 1863
1864 1868
1871 1872
1876 1878
1879 1880
1883 1884
1886 1888
1889 1897
Ne.
577
1 2
5 6
7 8
10 11
13 14
16 19
20 21
24 25
28 30
31 34
35 36
37 39
41 42
43 46
47 48
49 51
52 53
55 59
62 63
64 65
69 71
72 73
75 76
77 83
86 90
92 93
94 95
96 100
103 104
105 106
108 110
111 113
114 115
116 118
119 120
123 125
126 127
130 133
136 137
141 143
144 145
146 151
152 157
158 159
160 161
164 166
167 169
170 172
175 177
178 179
180 181
182 183
186 187
189 190
192 195
198 200
202 207
209 218
221 222
224 225
226 230
231 233
234 236
241 243
244 245
246 250
253 255
256 258
259 260
262 264
267 268
270 275
277 278
282 287
289 290
292 296
298 301
303 305
306 309
311 317
318 319
320 324
325 326
328 329
331 333
334 339
344 346
347 353
357 359
361 362
366 367
369 370
371 372
374 375
380 381
382 383
384 390
391 395
396 397
398 399
402 403
404 406
407 409
412 414
417 418
422 427
431 432
433 436
439 440
444 446
447 450
452 454
455 456
458 462
463 464
469 474
475 478
480 481
483 485
488 489
490 491
497 499
501 502
504 505
506 507
509 510
512 514
515 516
517 519
520 521
522 523
525 526
530 532
533 534
537 538
539 540
542 543
544 546
547 549
550 551
555 556
560 561
564 566
567 569
570 574
575 576
577 578
581 582
583 584
586 587
588 589
590 591
592 594
595 596
599 604
605 607
609 610
613 618
619 623
624 628
629 637
638 640
641 644
645 646
647 648
649 650
651 652
654 655
656 659
661 665
668 671
674 675
677 678
679 681
682 689
692 693
694 695
703 704
705 706
707 708
709 710
711 712
716 720
724 726
729 730
731 732
736 741
743 744
747 748
749 750
751 753
754 756
759 760
761 762
764 767
768 770
773 777
779 781
782 783
784 785
787 791
794 795
796 799
802 807
809 810
811 813
816 817
819 820
821 823
829 831
834 839
843 844
848 850
853 854
855 856
860 861
862 865
866 868
869 872
873 875
876 878
879 880
883 884
885 886
887 889
890 892
893 895
896 897
898 899
900 902
903 905
907 908
910 911
912 913
915 916
918 919
920 921
923 926
927 928
933 934
935 941
942 946
949 951
952 953
954 958
959 960
961 963
964 965
967 968
972 973
974 981
986 987
993 996
997 998
1000 1002
1003 1004
1005 1006
1012 1014
1017 1019
1020 1021
1022 1024
1025 1026
1028 1029
1030 1031
1032 1034
1037 1038
1041 1045
1047 1048
1050 1054
1057 1060
1062 1063
1065 1066
1067 1069
1072 1074
1076 1077
1079 1080
1083 1084
1085 1088
1089 1090
1091 1092
1094 1101
1107 1110
1112 1114
1115 1117
1122 1124
1127 1129
1130 1137
1138 1139
1140 1145
1146 1147
1148 1150
1151 1154
1156 1157
1159 1160
1164 1165
1169 1170
1175 1180
1181 1182
1183 1184
1185 1186
1187 1189
1195 1197
1198 1202
1206 1208
1211 1213
1216 1217
1219 1220
1221 1222
1225 1227
1228 1229
1230 1232
1239 1240
1241 1243
1244 1245
1246 1247
1248 1249
1251 1252
1253 1254
1255 1258
1264 1265
1266 1269
1270 1271
1277 1278
1279 1280
1281 1282
1285 1286
1287 1292
1296 1297
1298 1300
1303 1304
1306 1307
1311 1312
1313 1314
1317 1318
1323 1327
1330 1332
1333 1334
1335 1337
1343 1346
1347 1348
1349 1350
1352 1354
1356 1359
1361 1364
1365 1367
1368 1369
1371 1375
1376 1377
1380 1381
1382 1383
1384 1385
1388 1389
1391 1394
1395 1397
1400 1403
1404 1405
1406 1407
1412 1415
1419 1421
1422 1423
1427 1430
1432 1433
1434 1438
1441 1442
1443 1445
1447 1448
1454 1455
1460 1461
1463 1469
1470 1473
1477 1478
1481 1484
1485 1486
1490 1492
1494 1496
1497 1498
1499 1501
1502 1503
1504 1505
1506 1507
1513 1515
1516 1518
1519 1520
1521 1524
1526 1527
1528 1531
1533 1537
1539 1540
1541 1543
1545 1546
1549 1552
1553 1554
1556 1557
1558 1559
1560 1561
1562 1563
1567 1571
1573 1579
1584 1586
1587 1590
1591 1595
1596 1598
1601 1602
1603 1605
1606 1607
1608 1610
1611 1612
1613 1620
1621 1622
1623 1624
1625 1627
1628 1630
1631 1636
1640 1641
1642 1643
1644 1645
1646 1647
1649 1650
1654 1655
1656 1659
1661 1663
1664 1674
1677 1681
1684 1685
1686 1687
1688 1689
1690 1693
1694 1696
1697 1701
1705 1706
1708 1713
1714 1715
1719 1720
1722 1723
1725 1726
1730 1731
1733 1734
1735 1738
1739 1742
1745 1748
1749 1751
1753 1754
1755 1757
1758 1759
1760 1762
1764 1765
1766 1774
1776 1777
1779 1782
1785 1786
1787 1791
1794 1796
1798 1799
1800 1803
1804 1805
1807 1809
1810 1813
1816 1819
1822 1824
1825 1826
1827 1829
1831 1833
1836 1837
1838 1840
1842 1844
1846 1847
1848 1849
1850 1851
1852 1854
1857 1859
1860 1861
1862 1864
1865 1866
1875 1876
1879 1883
1885 1886
1892 1894
1896 1897
1898 1899
1902 1903
1906 1908
1909 1910
1915 1916
1917 1920
1922 1923
1924 1925
1927 1928
1929 1932
1933 1935
1936 1937
1940 1942
1943 1945
1947 1948
1949 1952
1957 1962
1964 1968
1971 1974
1975 1976
1980 1981
1982 1985
1987 1988
1989 1992
1998 1999
2002 2003
2006 2008
2011 2014
2019 2021
2022 2023
2024 2025
2027 2029
2034 2037
2038 2039
2040 2042
2043 2045
2046 2049
2051 2053
2056 2057
2060 2061
2062 2065
2066 2067
2069 2071
2076 2078
2080 2081
2082 2083
2085 2088
2090 2091
2093 2095
2096 2097
2100 2102
2103 2106
2108 2110
2111 2112
2118 2120
2121 2124
2125 2127
2130 2132
2134 2136
2138 2143
2144 2145
2146 2147
2148 2153
2157 2158
2159 2160
2162 2163
2166 2170
2172 2177
2178 2180
2181 2184
2185 2188
2189 2190
2191 2192
2193 2194
2195 2198
2201 2202
2204 2207
2208 2209
2213 2215
2216 2220
2221 2222
2224 2225
2228 2230
2232 2233
2236 2237
2239 2243
2244 2245
2246 2248
2249 2250
2251 2254
2255 2260
2261 2268
2269 2270
2273 2274
2275 2276
2278 2280
2281 2282
2283 2286
2287 2288
Ne.
326
2 3
5 6
9 13
14 15
16 17
24 25
30 31
32 35
36 39
40 41
43 44
47 49
52 54
55 58
59 60
61 65
66 67
71 72
73 74
75 78
79 84
88 89
90 91
93 95
98 99
101 102
103 106
108 109
113 114
116 117
119 120
122 127
137 141
143 144
146 147
148 150
151 152
153 155
158 159
160 161
162 163
165 166
169 170
172 173
174 175
179 180
182 185
186 188
189 191
193 195
196 200
201 202
208 209
211 213
215 217
218 224
226 227
228 229
231 232
234 238
240 241
243 245
246 247
249 252
253 256
266 268
270 274
275 276
277 278
279 281
283 288
291 293
294 296
297 299
304 306
307 311
314 315
316 318
320 321
322 323
324 325
327 328
330 334
337 338
339 340
341 345
347 348
350 351
353 356
357 359
360 361
363 365
366 368
369 371
372 373
376 378
379 381
383 388
393 396
397 400
401 404
406 408
409 411
415 416
418 421
422 424
425 426
427 428
429 430
431 432
434 438
440 441
443 448
449 450
455 456
457 458
460 463
465 466
470 471
472 477
479 481
482 483
485 487
488 489
493 497
500 501
502 503
506 510
511 512
514 515
517 519
524 526
530 537
539 540
544 545
546 548
549 551
555 559
560 563
566 569
570 573
574 575
580 584
587 591
595 596
597 598
603 606
608 611
612 613
615 616
617 618
620 621
622 627
629 631
633 634
638 645
648 649
650 653
654 655
656 659
661 663
664 665
666 669
670 671
673 675
676 680
685 688
690 692
694 699
700 701
703 704
706 707
713 716
719 720
721 724
726 727
728 729
730 733
734 736
737 738
739 740
741 743
745 746
748 750
751 757
758 759
762 763
767 770
773 774
775 778
780 781
784 789
790 791
792 793
794 795
796 797
798 800
803 804
806 807
808 811
812 813
814 815
816 817
821 823
824 828
829 831
834 836
837 838
839 843
846 848
853 856
857 859
861 862
864 866
868 870
871 872
873 876
879 881
882 884
885 886
887 889
890 892
893 894
898 899
901 902
907 908
910 913
914 917
919 920
922 924
928 929
930 932
933 934
936 940
942 946
947 948
949 950
951 952
953 954
956 957
958 960
962 964
965 966
968 970
972 973
974 978
979 981
983 986
989 995
996 1001
1004 1006
1008 1009
1010 1014
1016 1018
1019 1022
1025 1026
1027 1030
1031 1032
1033 1034
1035 1036
1037 1041
1042 1044
1046 1049
1050 1051
1052 1053
1057 1059
1063 1064
1065 1066
1069 1070
1074 1075
1076 1080
1081 1082
1085 1087
1091 1093
1095 1097
1104 1107
1108 1109
1110 1112
1113 1117
1119 1121
1123 1124
1125 1129
1130 1131
1133 1134
1135 1136
1137 1138
1139 1141
1143 1144
1145 1146
1147 1149
1155 1157
1158 1160
1163 1166
1167 1168
1169 1173
1176 1181
1185 1187
1189 1190
1191 1192
1194 1195
1198 1199
1202 1203
1204 1206
1208 1209
1210 1214
1215 1217
1220 1221
1222 1223
1224 1226
1229 1231
1236 1237
1238 1241
1245 1246
1247 1253
1255 1256
1260 1264
1265 1266
1267 1268
1278 1279
1281 1282
1284 1288
1292 1294
1295 1296
1298 1304
1306 1309
1314 1316
Ne.
423
2 3
4 5
7 9
11 12
15 16
17 21
22 23
24 27
28 29
30 31
33 35
38 40
43 44
45 46
47 50
51 54
56 58
59 60
61 62
64 65
66 68
70 73
74 76
77 81
82 83
84 85
89 90
93 95
99 100
102 105
106 108
110 117
119 120
122 124
125 126
128 129
131 132
133 134
136 137
138 139
141 144
145 146
147 151
152 153
156 157
159 161
164 165
166 167
169 173
175 177
178 179
180 181
182 183
184 185
187 190
191 194
196 199
200 201
202 204
207 208
209 211
213 214
215 217
218 220
221 222
225 226
227 228
231 233
236 239
241 242
243 246
247 248
251 254
256 257
260 261
262 263
264 267
268 270
271 272
273 278
279 281
282 283
284 286
287 288
291 292
294 295
296 299
301 302
303 304
306 309
310 313
314 315
317 318
321 324
325 327
328 330
333 334
336 337
340 341
342 344
345 351
356 357
359 361
364 365
366 368
369 373
374 375
376 380
381 382
384 385
386 388
389 390
393 395
396 400
405 408
410 411
413 414
416 417
419 420
421 423
425 426
427 429
432 433
435 437
438 442
443 446
449 451
452 456
459 460
461 462
463 467
468 469
470 471
472 475
476 477
480 481
484 486
488 490
491 495
496 497
498 502
503 506
507 510
511 512
513 515
517 518
519 520
523 524
526 528
530 531
532 533
534 538
539 541
544 545
547 548
550 551
553 555
557 558
559 560
563 564
565 571
572 574
575 577
578 579
580 582
583 586
587 588
590 591
593 595
597 598
602 603
604 607
609 610
611 612
615 616
618 619
620 622
623 624
626 631
632 634
635 638
639 641
642 643
644 645
646 648
649 651
652 653
654 655
656 657
658 660
664 668
669 670
671 673
674 677
681 684
685 687
688 690
691 692
695 697
698 699
703 705
707 708
709 710
711 713
715 716
718 720
723 724
728 729
730 731
732 734
735 737
740 741
743 744
746 748
749 750
751 752
753 754
755 760
763 766
767 768
769 770
772 775
776 777
778 779
780 784
786 787
788 790
798 799
800 801
802 803
804 805
807 809
810 811
813 814
815 817
818 819
821 822
823 824
825 827
828 829
830 832
834 835
838 839
840 842
843 848
849 850
851 852
854 855
856 857
858 859
860 861
862 863
864 865
866 868
869 872
874 877
882 883
885 887
888 889
890 891
892 893
895 901
903 904
906 908
909 911
913 914
915 916
917 919
921 923
928 930
931 932
933 935
939 941
942 945
947 949
950 951
953 954
956 959
962 963
964 966
967 968
971 972
973 975
976 978
981 984
986 987
990 992
993 994
995 997
998 1000
1005 1008
1011 1013
1014 1015
1018 1020
1021 1023
1024 1027
1028 1031
1032 1034
1035 1036
1037 1038
1040 1043
1046 1048
1050 1051
1052 1057
1058 1060
1065 1067
1068 1069
1071 1075
1077 1078
1079 1080
1082 1083
1089 1090
1091 1092
1093 1095
1098 1099
1100 1101
1102 1104
1105 1107
1114 1116
1118 1119
1121 1125
1126 1128
1129 1130
1131 1133
1134 1135
1136 1137
1143 1144
1145 1149
1150 1151
1158 1159
1160 1162
1168 1170
1176 1177
1178 1181
1182 1184
1185 1186
1187 1189
1191 1192
1193 1196
1197 1201
1202 1203
1204 1205
1206 1210
1211 1214
1217 1219
1222 1225
1228 1231
1234 1237
1240 1241
1242 1246
1247 1248
1251 1252
1254 1256
1257 1259
1265 1266
1267 1268
1270 1274
1275 1276
1278 1279
1281 1283
1284 1286
1288 1289
1290 1297
1299 1302
1303 1306
1309 1310
1311 1313
1314 1316
1319 1320
1325 1330
1334 1338
1339 1344
1345 1346
1351 1352
1353 1354
1355 1357
1358 1363
1364 1366
1371 1372
1375 1377
1378 1379
1380 1384
1385 1388
1390 1391
1394 1395
1396 1397
1398 1399
1400 1404
1409 1410
1411 1412
1413 1414
1416 1418
1421 1422
1423 1424
1426 1428
1430 1431
1432 1434
1435 1436
1437 1441
1443 1445
1450 1456
1457 1459
1460 1461
1462 1466
1467 1468
1471 1473
1475 1476
1478 1481
1482 1484
1485 1487
1488 1490
1491 1492
1493 1496
1497 1498
1501 1502
1504 1506
1508 1510
1511 1512
1517 1519
1522 1523
1528 1529
1531 1533
1535 1536
Ne.
365
1 2
3 6
7 10
12 14
15 17
20 22
23 32
38 40
41 42
43 45
47 48
52 59
62 67
68 73
75 76
77 80
82 84
85 86
89 91
92 94
97 98
102 103
104 106
109 112
113 116
117 119
121 122
125 126
127 128
130 131
135 140
141 142
145 146
147 148
155 157
161 162
163 165
168 172
176 177
179 181
185 186
192 197
207 208
209 213
215 216
220 223
224 225
227 228
229 231
232 233
234 236
237 238
239 241
245 247
249 252
254 255
257 258
259 261
262 263
264 268
273 275
278 279
280 281
283 284
286 290
292 295
296 298
300 302
304 307
308 309
310 313
315 316
319 326
328 329
332 333
334 335
336 337
338 339
342 344
345 346
348 349
355 356
357 358
360 361
362 363
364 366
367 377
379 381
383 384
387 390
391 394
395 396
398 400
401 403
404 405
406 408
412 414
415 416
420 421
424 425
427 433
434 435
437 441
445 446
447 452
453 456
465 470
471 475
478 483
484 488
493 494
495 496
499 500
502 504
505 507
508 515
516 517
518 519
527 529
531 532
534 535
536 537
539 540
541 542
543 544
549 551
552 554
555 561
562 564
565 566
567 570
571 574
578 582
583 585
588 591
592 593
594 596
597 598
599 602
604 605
606 607
608 609
610 611
613 615
618 619
620 624
626 629
630 632
633 635
638 639
640 643
644 645
646 647
649 651
652 653
659 660
662 663
666 667
669 670
671 673
677 682
683 684
685 686
687 688
689 690
691 693
694 697
699 700
702 703
705 708
709 710
711 713
714 715
716 723
724 725
726 730
733 735
740 742
746 748
751 754
755 756
758 760
761 762
766 767
773 774
775 776
777 778
779 780
781 782
785 786
789 797
798 799
800 801
804 805
807 808
810 816
818 824
825 828
830 835
837 838
842 843
844 845
855 856
868 870
873 875
876 877
885 887
889 894
895 896
897 898
902 905
908 910
911 912
917 918
920 924
928 930
931 933
937 938
939 941
942 946
947 950
951 952
954 956
957 960
961 963
966 968
969 973
974 975
976 979
981 984
985 988
989 990
996 997
1000 1004
1005 1008
1009 1010
1012 1016
1019 1022
1023 1026
1028 1034
1036 1037
1039 1041
1045 1046
1047 1049
1052 1055
1058 1064
1066 1070
1072 1073
1074 1075
1076 1077
1078 1082
1094 1096
1097 1099
1101 1102
1103 1104
1105 1106
1107 1111
1116 1118
1121 1122
1123 1126
1127 1129
1131 1134
1135 1137
1144 1146
1147 1148
1149 1150
1151 1154
1155 1160
1162 1163
1165 1166
1167 1169
1171 1173
1175 1177
1178 1179
1180 1181
1182 1183
1185 1186
1189 1191
1192 1195
1196 1198
1201 1204
1206 1210
1211 1213
1214 1215
1217 1220
1221 1222
1224 1228
1229 1231
1234 1235
1237 1238
1239 1240
1246 1249
1250 1253
1254 1257
1262 1263
1265 1267
1268 1271
1273 1276
1278 1279
1281 1285
1287 1288
1289 1290
1291 1292
1293 1294
1296 1297
1298 1302
1303 1305
1308 1312
1313 1314
1316 1317
1318 1320
1321 1325
1326 1329
1331 1335
1336 1338
1339 1341
1343 1344
1345 1347
1348 1350
1351 1352
1355 1356
1357 1359
1363 1364
1365 1366
1370 1371
1373 1375
1380 1381
1383 1384
1387 1388
1392 1394
1396 1397
1398 1400
1401 1406
1407 1409
1410 1411
1412 1414
1417 1418
1419 1420
1423 1424
1425 1426
1427 1428
1429 1434
1438 1440
1441 1442
1448 1449
1450 1451
1452 1454
1458 1459
1465 1466
1469 1470
1472 1476
1477 1479
1481 1484
1489 1490
1491 1493
1494 1495
1496 1497
1498 1499
1502 1503
1505 1508
1513 1514
1515 1516
1517 1519
1521 1522
1524 1526
Ne.
1173
2 8
12 15
16 17
18 20
21 25
26 29
30 31
35 37
41 43
44 46
47 48
49 50
55 56
57 60
61 64
65 68
72 77
78 79
80 82
88 89
90 91
94 96
97 99
101 103
106 107
110 111
113 115
116 117
120 121
123 125
126 127
128 129
130 132
133 135
136 137
138 140
141 142
143 145
151 152
153 154
155 156
157 158
160 161
162 164
165 174
175 179
181 184
190 192
193 194
196 197
200 206
209 211
212 214
215 216
221 222
223 224
230 232
236 237
239 240
242 245
246 247
250 252
253 254
257 259
260 261
263 264
268 271
272 274
275 276
279 282
283 284
285 286
288 289
293 295
297 298
300 301
302 304
307 308
311 312
319 320
321 325
327 329
330 332
333 334
336 337
338 339
340 345
349 350
352 356
357 359
362 364
365 368
370 371
372 373
375 376
377 378
379 380
383 385
386 387
389 390
393 395
396 397
398 400
401 407
408 409
412 413
414 415
416 420
421 422
423 425
426 429
431 432
433 434
440 441
445 446
447 448
449 450
453 454
457 462
463 464
465 467
471 473
474 475
476 479
480 481
483 484
485 487
488 492
493 495
498 502
503 504
506 509
512 513
514 515
518 526
527 528
529 531
534 536
537 538
539 542
547 554
555 556
559 563
565 566
567 568
572 573
574 578
582 584
587 589
593 597
600 601
605 606
607 608
610 611
612 614
616 617
619 620
623 624
625 627
628 632
633 634
635 637
639 642
643 644
648 650
653 656
657 659
660 662
663 666
668 669
671 672
674 677
679 682
685 687
688 689
690 691
692 693
694 695
696 699
700 701
703 706
707 709
710 712
714 716
718 721
722 723
727 730
731 732
733 734
737 739
740 743
744 746
747 749
752 756
759 760
761 762
763 764
765 767
768 770
772 776
778 782
784 785
786 787
791 794
797 799
802 803
804 805
813 815
825 828
829 831
832 833
837 839
840 841
843 846
847 848
850 851
854 855
860 864
865 866
867 872
876 881
884 885
888 889
890 891
892 894
895 899
906 907
908 909
912 913
914 917
918 919
920 921
924 925
926 927
929 931
933 934
936 940
944 945
949 950
951 952
953 954
955 956
962 966
970 971
973 975
976 979
980 982
983 984
986 990
991 994
995 996
998 999
1005 1011
1012 1017
1022 1023
1032 1033
1036 1037
1038 1039
1042 1047
1048 1049
1050 1052
1054 1055
1057 1060
1061 1062
1063 1064
1065 1066
1067 1069
1074 1075
1076 1078
1081 1082
1084 1085
1089 1091
1092 1093
1094 1095
1096 1097
1098 1103
1105 1107
1108 1110
1114 1115
1116 1117
1119 1122
1124 1126
1128 1129
1134 1135
1142 1143
1144 1145
1147 1148
1150 1151
1152 1153
1155 1157
1159 1160
1163 1164
1166 1167
1169 1171
1172 1175
1176 1178
1179 1180
1181 1183
1185 1186
1187 1188
1189 1190
1191 1194
1197 1198
1202 1205
1206 1207
1208 1209
1210 1211
1212 1214
1216 1217
1220 1221
1222 1223
1224 1225
1226 1227
1230 1235
1237 1245
1248 1250
1252 1258
1261 1262
1266 1267
1268 1270
1272 1273
1275 1276
1280 1282
1283 1292
1293 1294
1295 1296
1298 1300
1304 1305
1307 1310
1311 1314
1316 1317
1318 1319
1320 1321
1322 1324
1325 1326
1328 1329
1332 1335
1336 1339
1341 1343
1344 1349
1351 1357
1358 1359
1362 1364
1367 1368
1372 1374
1375 1376
1377 1378
1379 1384
1385 1388
1389 1391
1395 1400
1401 1402
1409 1410
1411 1412
1413 1415
1417 1419
1422 1424
1426 1428
1429 1435
1437 1438
1439 1443
1444 1450
1452 1455
1459 1460
1461 1462
1469 1472
1473 1477
1480 1481
1482 1484
1488 1489
1490 1491
1496 1500
1502 1504
1509 1510
1518 1519
1520 1521
1522 1523
1524 1525
1526 1529
1530 1531
1532 1535
1537 1539
1542 1543
1544 1545
1546 1548
1551 1552
1554 1555
1558 1559
1561 1564
1566 1568
1575 1576
1579 1580
1582 1584
1585 1589
1597 1601
1604 1606
1607 1608
1609 1611
1612 1613
1616 1617
1618 1620
1622 1624
1627 1628
1634 1637
1639 1640
1642 1643
1644 1647
1651 1652
1654 1655
1657 1659
1661 1664
1665 1667
1668 1669
1670 1671
1672 1674
1675 1676
1677 1679
1680 1681
1683 1684
1685 1686
1687 1688
1692 1694
1696 1700
1703 1704
1705 1706
1709 1710
1711 1712
1714 1715
1716 1717
1718 1719
1722 1723
1724 1725
1730 1734
1736 1738
1740 1741
1742 1746
1749 1750
1752 1755
1758 1759
1760 1762
1763 1766
1767 1768
1769 1770
1771 1773
1774 1776
1777 1778
1779 1780
1781 1782
1783 1785
1786 1787
1788 1789
1793 1794
1795 1796
1798 1799
1800 1802
1803 1804
1806 1809
1810 1811
1812 1819
1820 1822
1823 1824
1827 1828
1829 1832
1835 1836
1840 1841
1843 1846
1847 1849
1852 1853
1854 1856
1857 1859
1863 1866
1869 1870
1871 1872
1873 1874
1875 1877
1878 1879
1880 1885
1886 1890
1892 1896
1899 1901
1904 1905
1906 1908
1909 1910
1918 1919
1920 1921
1924 1926
1928 1930
1931 1934
1937 1938
1940 1943
1944 1947
1949 1951
1953 1954
1955 1963
1964 1965
1971 1972
1974 1975
1977 1981
1982 1983
1984 1989
1991 1993
1995 1999
2000 2001
2002 2006
2008 2012
2016 2017
2018 2019
2020 2021
2023 2025
2026 2030
2031 2034
2036 2038
2041 2043
2049 2050
2054 2057
2058 2062
2063 2067
2072 2074
2075 2078
2079 2082
2083 2084
2085 2086
2087 2091
2094 2095
2097 2098
2105 2108
2112 2115
2118 2120
2122 2125
2129 2132
2134 2139
2141 2142
2143 2144
2147 2150
2151 2155
2156 2158
2162 2163
2164 2165
2168 2169
2174 2177
2179 2181
2182 2183
2184 2185
2186 2187
2188 2189
2192 2193
2195 2198
2199 2203
2204 2205
2206 2207
2208 2210
2214 2218
2219 2220
2221 2222
2225 2226
2231 2232
2237 2238
2239 2241
2243 2244
2245 2246
2248 2249
2254 2256
2257 2258
2259 2260
2261 2262
2264 2265
2269 2270
2271 2272
2273 2274
2275 2276
2277 2284
2286 2291
2295 2296
2297 2301
2302 2304
2310 2313
2314 2316
2319 2321
2323 2325
2326 2327
2329 2332
2339 2340
2341 2342
2343 2345
2347 2348
2349 2350
2352 2357
2360 2361
2364 2365
2366 2367
2368 2372
2373 2376
2378 2382
2383 2384
2385 2387
2388 2390
2392 2393
2394 2395
2396 2397
2398 2399
2401 2403
2404 2407
2413 2414
2415 2417
2418 2419
2420 2421
2424 2425
2427 2428
2431 2432
2437 2438
2441 2442
2443 2446
2450 2452
2457 2460
2462 2464
2466 2467
2472 2475
2477 2478
2480 2482
2483 2484
2485 2487
2490 2491
2493 2494
2498 2499
2500 2503
2504 2505
2506 2507
2508 2513
2520 2521
2522 2523
2525 2528
2529 2530
2531 2532
2533 2536
2537 2539
2541 2542
2543 2546
2547 2548
2549 2550
2556 2558
2560 2561
2562 2564
2566 2567
2569 2571
2575 2576
2577 2581
2582 2588
2589 2590
2591 2592
2594 2596
2603 2605
2611 2612
2614 2615
2616 2617
2623 2628
2631 2634
2635 2640
2641 2642
2643 2644
2645 2646
2647 2648
2654 2657
2658 2659
2660 2662
2665 2668
2670 2671
2674 2675
2676 2678
2680 2682
2684 2685
2689 2691
2693 2696
2697 2699
2700 2704
2705 2706
2708 2717
2719 2721
2722 2723
2724 2725
2727 2728
2729 2732
2733 2735
2736 2743
2745 2746
2750 2751
2752 2753
2755 2759
2760 2762
2764 2765
2767 2769
2770 2772
2773 2776
2777 2779
2784 2786
2787 2788
2789 2791
2792 2796
2797 2798
2802 2803
2805 2806
2807 2808
2809 2810
2812 2814
2815 2817
2818 2823
2825 2827
2829 2833
2837 2838
2839 2840
2841 2842
2843 2846
2847 2848
2849 2852
2855 2856
2858 2861
2862 2863
2864 2867
2868 2869
2870 2872
2873 2876
2879 2880
2881 2882
2883 2885
2886 2887
2889 2892
2894 2898
2899 2900
2904 2906
2911 2917
2918 2919
2923 2924
2925 2926
2927 2932
2933 2934
2936 2937
2938 2940
2942 2943
2944 2945
2946 2947
2948 2949
2951 2953
2958 2959
2960 2963
2965 2968
2974 2976
2979 2982
2983 2986
2987 2988
2989 2991
2992 2993
2994 2995
2996 2998
3000 3001
3004 3005
3008 3011
3012 3015
3016 3017
3018 3021
3022 3023
3027 3028
3032 3033
3035 3036
3037 3038
3039 3042
3046 3047
3048 3050
3054 3056
3058 3059
3065 3068
3069 3071
3073 3077
3078 3082
3084 3088
3089 3091
3096 3097
3098 3099
3102 3103
3104 3106
3112 3113
3114 3117
3118 3123
3124 3125
3126 3127
3130 3131
3133 3134
3135 3136
3138 3139
3142 3143
3144 3145
3146 3148
3149 3155
3157 3159
3161 3163
3165 3167
3168 3172
3174 3175
3176 3177
3178 3179
3181 3184
3186 3187
3189 3190
3192 3194
3195 3196
3201 3203
3205 3208
3209 3211
3212 3214
3217 3218
3219 3220
3224 3225
3227 3228
3229 3232
3235 3239
3240 3243
3245 3247
3249 3250
3253 3255
3256 3258
3263 3265
3266 3267
3268 3269
3277 3278
3281 3282
3283 3284
3286 3287
3288 3291
3292 3294
3298 3299
3300 3301
3304 3307
3308 3309
3314 3317
3318 3319
3321 3324
3328 3329
3330 3331
3334 3338
3339 3343
3344 3346
3348 3349
3350 3354
3356 3357
3359 3360
3363 3364
3367 3369
3372 3373
3374 3377
3378 3380
3381 3383
3386 3388
3390 3392
3393 3394
3396 3397
3398 3400
3402 3405
3407 3408
3409 3413
3414 3415
3417 3418
3421 3423
3424 3425
3427 3428
3432 3436
3437 3442
3444 3445
3448 3451
3452 3455
3456 3457
3459 3462
3463 3466
3467 3469
3470 3473
3474 3477
3480 3481
3483 3484
3485 3488
3491 3492
3495 3497
3500 3501
3502 3503
3505 3506
3507 3512
3514 3516
3519 3520
3523 3524
3526 3532
3535 3537
3538 3540
3541 3545
3546 3547
3549 3550
3553 3555
3557 3559
3560 3561
3564 3565
3567 3570
3571 3574
3576 3582
3583 3589
3590 3591
3592 3596
3599 3600
3603 3604
3605 3606
3607 3609
3611 3612
3613 3615
3618 3627
3628 3629
3634 3637
3639 3640
3641 3645
3648 3649
3654 3656
3657 3658
3659 3660
3661 3664
3666 3667
3668 3670
3671 3672
3673 3677
3679 3680
3681 3684
3687 3688
3690 3691
3694 3697
3699 3706
3709 3712
3713 3714
3715 3716
3717 3722
3723 3725
3727 3728
3731 3733
3734 3736
3737 3739
3741 3742
3745 3746
3748 3749
3753 3755
3761 3764
3765 3767
3768 3769
3773 3775
3776 3784
3785 3786
3787 3788
3789 3791
3792 3796
3797 3798
3799 3804
3809 3810
3811 3812
3813 3817
3818 3823
3824 3826
3827 3830
3831 3832
3833 3834
3835 3836
3837 3838
3840 3843
3847 3848
3851 3852
3854 3856
3857 3860
3861 3867
3870 3874
3875 3876
3879 3880
3885 3886
3887 3888
3890 3899
3900 3901
3902 3903
3904 3905
3908 3910
3914 3915
3916 3918
3919 3922
3926 3928
3930 3931
3932 3934
3935 3936
3938 3940
3941 3943
3947 3948
3950 3951
3952 3954
3956 3960
3961 3962
3964 3965
3967 3970
3971 3972
3974 3976
3979 3982
3984 3986
3987 3988
3989 4001
4002 4004
4005 4010
4012 4013
4016 4017
4018 4021
4023 4024
4028 4029
4030 4031
4032 4033
4035 4036
4037 4039
4042 4045
4048 4050
4051 4052
4053 4055
4058 4059
4060 4066
4067 4068
4069 4072
4075 4079
4081 4084
4088 4090
4091 4092
4098 4100
4101 4102
4110 4113
4114 4118
4121 4122
4123 4124
4126 4127
4128 4131
4132 4133
4134 4136
4138 4139
4145 4146
4147 4151
4152 4155
4156 4158
4160 4161
4162 4164
4165 4166
4168 4173
4174 4176
4178 4179
4185 4186
4189 4192
4193 4197
4200 4201
4202 4203
4204 4205
4207 4208
4209 4210
4214 4215
4216 4217
4218 4219
4220 4222
4223 4224
4227 4228
4231 4234
4236 4237
4239 4241
4243 4245
4248 4252
4258 4259
4261 4262
4264 4268
4270 4272
4275 4277
4278 4285
4286 4288
4289 4290
4291 4292
4293 4300
4301 4305
4308 4314
4323 4324
4325 4326
4330 4338
4339 4342
4345 4347
4348 4350
4352 4357
4358 4359
4361 4362
4363 4364
4365 4366
4367 4368
4371 4373
4374 4377
4378 4381
4386 4389
4393 4394
4396 4397
4398 4399
4400 4401
4404 4405
4406 4407
4408 4410
4411 4413
4414 4420
4421 4422
4424 4425
4426 4427
4428 4429
4430 4431
4432 4433
4434 4439
4440 4443
4444 4445
4450 4452
4454 4457
4461 4463
4468 4470
4471 4472
4473 4474
4476 4477
4478 4480
4481 4483
4485 4487
4488 4493
4495 4497
4499 4500
4502 4503
4504 4506
4508 4510
4511 4512
4513 4514
4516 4517
4523 4524
4525 4527
4528 4529
4530 4531
4532 4534
4536 4537
4538 4539
4540 4541
4542 4544
4550 4553
4554 4556
4561 4566
4567 4570
4571 4574
4575 4576
4577 4585
4586 4587
4588 4590
4591 4592
4594 4596
4598 4602
4603 4604
4606 4608
4612 4614
4616 4618
4627 4629
4630 4632
4633 4634
4635 4638
4639 4640
4643 4645
4648 4653
4654 4656
4661 4663
4664 4667
4671 4673
4674 4677
4678 4679
4680 4681
4682 4683
4687 4690
4692 4693
4695 4696
4698 4703
4704 4705
4706 4711
Ne.
1114
0 6
8 11
13 14
16 18
20 22
23 26
27 28
29 30
31 33
34 35
38 40
41 46
48 53
54 56
57 58
59 60
61 62
63 66
69 70
71 77
79 80
81 82
84 96
97 98
101 102
105 106
107 108
110 111
112 117
122 125
126 128
131 136
138 139
140 144
148 153
157 158
160 161
164 168
170 173
177 178
180 182
183 184
187 188
190 193
195 196
197 201
207 210
211 217
221 222
223 226
227 228
233 234
240 241
242 251
252 253
254 255
256 259
267 269
270 271
272 274
275 276
278 279
281 283
284 286
289 291
292 300
302 304
305 308
309 310
311 314
316 317
318 319
321 322
323 324
326 327
328 329
330 331
333 334
337 339
340 343
345 349
351 354
356 357
358 361
363 364
365 367
368 372
376 377
378 379
380 382
383 384
385 386
388 389
391 396
397 402
404 405
406 407
408 409
410 411
412 416
420 421
422 423
424 427
428 429
438 441
442 444
446 451
453 456
460 462
463 466
467 468
470 471
472 473
474 475
476 477
483 484
486 491
492 493
494 496
497 498
499 501
502 503
506 508
513 515
517 518
519 522
525 526
527 530
532 533
534 536
537 541
543 545
546 547
551 552
553 554
558 559
562 566
569 570
571 572
574 578
581 583
585 589
591 592
593 594
601 602
603 604
608 609
611 614
618 619
620 622
624 625
627 628
629 630
634 635
636 638
640 642
644 647
649 650
651 653
654 657
660 662
666 667
670 675
677 680
683 684
685 686
688 689
690 692
693 694
695 697
698 701
703 704
707 709
710 711
712 713
714 716
717 718
720 722
723 724
727 729
730 731
732 734
738 740
741 743
744 746
753 755
756 757
759 763
764 765
766 768
770 773
774 775
776 780
781 783
784 788
790 791
792 793
794 795
800 801
804 806
808 809
813 814
817 818
819 820
823 824
825 826
827 830
832 833
834 836
838 839
840 841
842 843
844 845
848 855
856 857
858 859
861 864
865 866
872 874
877 879
881 885
887 889
890 891
892 893
894 901
902 903
904 905
906 907
909 912
913 915
918 919
922 923
925 929
930 931
934 939
944 945
947 948
950 951
952 953
954 955
958 961
963 964
966 969
971 972
974 976
978 980
981 982
983 984
988 990
991 992
993 996
998 999
1000 1001
1004 1007
1008 1009
1011 1012
1017 1023
1027 1031
1032 1033
1034 1035
1038 1039
1042 1043
1044 1047
1048 1049
1052 1055
1057 1058
1059 1060
1062 1063
1064 1065
1067 1068
1069 1071
1074 1075
1078 1079
1080 1084
1085 1088
1090 1092
1095 1103
1108 1110
1111 1112
1115 1121
1123 1124
1127 1130
1132 1140
1141 1143
1146 1148
1149 1150
1152 1153
1155 1156
1160 1162
1166 1168
1169 1172
1173 1174
1175 1176
1177 1180
1181 1183
1184 1185
1186 1188
1189 1191
1193 1194
1196 1197
1198 1199
1200 1202
1205 1208
1213 1214
1216 1218
1221 1224
1225 1226
1228 1229
1231 1232
1233 1234
1235 1236
1238 1239
1240 1242
1243 1244
1246 1247
1248 1249
1250 1252
1253 1254
1256 1259
1260 1261
1266 1268
1269 1271
1272 1273
1274 1275
1276 1277
1279 1280
1282 1284
1289 1293
1296 1297
1299 1300
1301 1303
1305 1308
1309 1310
1311 1313
1314 1315
1319 1323
1325 1326
1328 1330
1332 1334
1340 1344
1348 1350
1351 1352
1353 1354
1356 1357
1358 1361
1363 1365
1369 1371
1372 1374
1375 1377
1378 1383
1385 1386
1388 1389
1392 1394
1396 1399
1406 1407
1408 1409
1411 1413
1416 1417
1419 1422
1424 1425
1426 1428
1429 1432
1433 1434
1436 1437
1438 1441
1444 1445
1446 1447
1448 1449
1452 1453
1455 1456
1457 1458
1459 1460
1464 1465
1466 1467
1469 1471
1474 1475
1476 1477
1480 1483
1484 1485
1489 1492
1498 1500
1501 1502
1504 1506
1507 1509
1512 1514
1515 1517
1518 1520
1521 1522
1524 1525
1526 1527
1528 1529
1531 1532
1533 1534
1535 1543
1544 1545
1547 1548
1549 1553
1554 1555
1556 1559
1560 1561
1562 1563
1565 1566
1567 1569
1570 1571
1572 1573
1574 1575
1576 1579
1580 1581
1584 1585
1586 1587
1588 1589
1593 1595
1598 1600
1603 1604
1605 1610
1611 1621
1623 1624
1625 1627
1629 1631
1632 1633
1636 1637
1639 1641
1642 1644
1647 1650
1658 1662
1666 1668
1670 1677
1679 1680
1683 1684
1686 1687
1691 1692
1693 1695
1696 1698
1699 1701
1702 1704
1706 1709
1710 1712
1714 1717
1720 1722
1723 1724
1728 1731
1733 1737
1738 1740
1742 1746
1748 1749
1754 1755
1756 1758
1759 1761
1765 1766
1771 1774
1775 1780
1781 1782
1783 1788
1789 1791
1793 1798
1799 1800
1801 1803
1804 1808
1809 1814
1816 1817
1818 1819
1820 1826
1829 1830
1832 1833
1834 1836
1837 1838
1841 1842
1843 1844
1845 1848
1849 1852
1854 1856
1861 1863
1864 1867
1869 1870
1876 1879
1881 1882
1883 1884
1886 1887
1891 1892
1893 1896
1897 1899
1901 1904
1905 1908
1909 1912
1913 1916
1918 1919
1920 1922
1925 1932
1933 1935
1942 1946
1949 1950
1951 1952
1954 1955
1960 1961
1965 1968
1970 1973
1976 1977
1980 1981
1983 1984
1987 1988
1993 1996
1998 1999
2001 2002
2004 2005
2006 2007
2016 2020
2021 2022
2024 2027
2029 2031
2032 2036
2041 2042
2045 2046
2047 2048
2049 2050
2052 2053
2056 2060
2061 2062
2063 2064
2065 2066
2069 2070
2073 2074
2075 2076
2077 2079
2081 2082
2084 2085
2086 2090
2092 2093
2094 2096
2097 2098
2104 2105
2106 2107
2108 2110
2112 2114
2115 2117
2119 2120
2121 2122
2124 2127
2128 2130
2133 2134
2136 2137
2138 2139
2142 2143
2147 2148
2150 2152
2153 2155
2158 2159
2161 2162
2163 2165
2167 2168
2169 2171
2172 2175
2176 2179
2180 2181
2182 2185
2186 2187
2188 2189
2190 2191
2192 2193
2194 2195
2196 2197
2199 2211
2213 2215
2218 2220
2221 2222
2225 2230
2233 2235
2238 2240
2241 2245
2247 2248
2249 2250
2252 2253
2254 2256
2260 2261
2263 2265
2266 2267
2270 2273
2274 2277
2278 2280
2283 2286
2289 2290
2293 2296
2298 2299
2300 2301
2311 2312
2316 2318
2320 2326
2329 2330
2333 2334
2335 2338
2340 2345
2348 2350
2354 2358
2360 2361
2362 2369
2370 2371
2375 2376
2377 2378
2379 2380
2381 2382
2383 2385
2386 2387
2388 2389
2392 2397
2398 2400
2405 2407
2409 2411
2412 2415
2419 2421
2423 2425
2426 2427
2428 2432
2434 2435
2436 2438
2443 2445
2447 2451
2452 2453
2454 2456
2457 2459
2460 2461
2463 2464
2468 2469
2471 2472
2475 2476
2479 2481
2483 2486
2488 2491
2493 2494
2495 2496
2497 2499
2501 2502
2505 2506
2507 2508
2510 2511
2512 2514
2517 2519
2520 2521
2524 2526
2527 2528
2530 2533
2536 2537
2541 2544
2548 2549
2550 2553
2556 2558
2559 2560
2561 2563
2564 2568
2570 2572
2573 2575
2581 2584
2587 2588
2589 2590
2592 2593
2594 2597
2598 2599
2602 2605
2607 2608
2609 2612
2614 2616
2617 2618
2619 2622
2626 2627
2628 2629
2631 2634
2637 2640
2643 2644
2646 2647
2651 2652
2653 2654
2659 2660
2662 2663
2664 2666
2667 2668
2669 2673
2675 2676
2678 2680
2681 2682
2683 2684
2685 2687
2690 2692
2695 2698
2700 2702
2707 2709
2711 2712
2713 2714
2715 2717
2718 2721
2722 2724
2725 2726
2727 2732
2734 2736
2740 2742
2744 2747
2752 2753
2754 2755
2758 2761
2762 2765
2766 2767
2769 2770
2771 2772
2777 2778
2783 2785
2788 2792
2793 2794
2797 2798
2801 2802
2803 2804
2805 2808
2809 2811
2814 2816
2817 2818
2819 2820
2823 2824
2831 2832
2838 2841
2843 2845
2847 2848
2849 2853
2856 2859
2860 2861
2865 2867
2869 2871
2872 2874
2875 2876
2878 2880
2881 2882
2883 2885
2886 2888
2891 2892
2893 2895
2896 2897
2898 2899
2902 2905
2906 2907
2909 2910
2911 2912
2913 2914
2915 2916
2917 2921
2922 2923
2924 2925
2928 2929
2930 2932
2933 2936
2937 2938
2939 2940
2942 2943
2944 2946
2947 2949
2951 2952
2954 2956
2957 2959
2960 2961
2964 2965
2967 2968
2969 2971
2972 2973
2977 2979
2980 2982
2983 2984
2987 2991
2992 2993
2994 2996
2999 3001
3002 3004
3008 3010
3012 3017
3018 3019
3021 3022
3024 3032
3033 3034
3035 3037
3040 3041
3043 3045
3051 3052
3058 3060
3061 3062
3065 3066
3067 3068
3070 3071
3072 3074
3075 3078
3083 3084
3086 3090
3093 3096
3099 3100
3104 3105
3108 3110
3111 3112
3113 3115
3116 3120
3125 3130
3131 3133
3134 3137
3138 3142
3143 3145
3146 3147
3150 3151
3152 3153
3157 3163
3165 3166
3167 3171
3174 3175
3180 3182
3183 3188
3191 3194
3195 3198
3200 3203
3205 3206
3207 3210
3211 3212
3215 3220
3224 3225
3230 3232
3233 3236
3238 3240
3241 3248
3249 3253
3254 3255
3259 3264
3266 3268
3269 3270
3271 3272
3274 3278
3279 3282
3284 3285
3286 3287
3290 3291
3292 3297
3298 3301
3302 3304
3305 3306
3308 3310
3311 3313
3314 3315
3316 3317
3319 3321
3322 3324
3325 3326
3328 3329
3332 3333
3334 3339
3340 3341
3346 3347
3351 3352
3356 3357
3358 3359
3360 3362
3364 3365
3366 3367
3370 3372
3374 3377
3379 3380
3381 3383
3386 3387
3389 3392
3394 3395
3397 3399
3400 3402
3404 3407
3408 3409
3410 3412
3413 3415
3417 3418
3420 3423
3425 3426
3428 3429
3430 3431
3432 3434
3437 3441
3442 3443
3444 3445
3448 3449
3450 3451
3452 3454
3455 3456
3458 3459
3460 3462
3463 3465
3467 3470
3472 3473
3474 3475
3476 3479
3481 3483
3485 3486
3490 3493
3494 3498
3499 3501
3502 3508
3509 3510
3512 3513
3516 3520
3521 3522
3524 3528
3531 3532
3533 3535
3541 3542
3543 3544
3546 3547
3548 3549
3556 3558
3559 3560
3563 3565
3571 3572
3573 3575
3577 3578
3579 3580
3581 3585
3586 3589
3590 3596
3597 3598
3601 3602
3604 3606
3607 3608
3612 3614
3617 3620
3623 3625
3626 3627
3628 3629
3632 3633
3635 3640
3641 3647
3651 3652
3653 3656
3657 3658
3659 3660
3664 3669
3671 3675
3676 3677
3679 3689
3690 3691
3694 3695
3696 3697
3698 3699
3701 3702
3704 3705
3711 3712
3715 3719
3720 3723
3724 3725
3727 3729
3736 3739
3741 3743
3744 3748
3750 3751
3754 3756
3757 3759
3760 3762
3764 3765
3766 3767
3768 3771
3772 3774
3775 3781
3787 3788
3790 3792
3798 3799
3801 3802
3804 3805
3807 3808
3809 3812
3816 3818
3819 3824
3825 3826
3831 3833
3834 3835
3836 3838
3841 3844
3847 3848
3849 3850
3851 3852
3853 3855
3856 3859
3861 3864
3865 3866
3867 3870
3871 3874
3879 3883
3884 3885
3889 3892
3894 3895
3896 3897
3898 3899
3901 3902
3903 3904
3907 3908
3909 3910
3912 3914
3915 3916
3917 3920
3921 3922
3924 3925
3926 3930
3931 3934
3937 3941
3942 3943
3944 3945
3946 3949
3955 3956
3957 3960
3961 3962
3964 3965
3967 3969
3970 3971
3972 3973
3975 3977
3980 3981
3982 3984
3986 3988
3994 3998
4000 4003
4007 4008
4011 4015
4019 4020
4021 4023
4024 4025
4028 4031
4032 4033
4034 4036
4037 4038
4039 4047
4051 4052
4053 4059
4061 4063
4064 4065
4067 4068
4069 4070
4073 4077
4079 4080
4081 4082
4083 4084
4087 4088
4090 4092
4097 4098
4102 4108
4109 4110
4112 4114
4115 4117
4118 4120
4124 4128
4130 4133
4134 4135
4136 4137
4139 4140
4141 4143
4144 4145
4146 4147
4150 4153
4154 4158
4159 4160
4162 4164
4165 4167
4168 4174
4178 4179
4181 4182
4183 4189
4190 4191
4192 4193
4194 4195
4198 4199
4200 4201
4208 4209
4211 4212
4213 4216
4218 4220
4222 4223
4224 4225
4227 4228
4230 4231
4236 4237
4238 4240
4241 4245
4246 4249
4250 4252
4258 4260
4261 4263
4264 4265
4271 4273
4274 4279
4280 4281
4282 4283
4284 4286
4287 4288
4289 4290
4292 4295
4296 4297
4299 4301
4302 4305
4309 4310
4311 4312
4314 4319
4326 4328
4330 4332
4333 4335
4336 4337
4338 4340
4341 4343
4346 4348
4349 4351
4353 4354
4356 4358
4360 4362
4364 4366
4367 4370
4371 4373
4374 4379
4384 4385
4388 4392
4394 4395
4396 4398
4400 4401
4402 4403
4404 4405
4406 4408
4411 4412
Ne.
904
1 4
5 6
7 9
10 17
20 21
22 24
26 27
30 34
35 36
37 39
41 43
45 47
49 50
52 55
56 67
68 71
72 73
74 80
82 83
85 87
88 90
93 95
96 98
100 101
103 106
107 108
109 112
113 116
118 119
121 125
126 129
134 135
136 137
140 143
144 145
146 152
155 156
157 160
162 163
164 166
167 170
172 174
177 181
183 184
186 187
192 194
196 197
199 200
202 203
205 206
207 210
211 212
214 215
217 218
220 222
223 224
228 229
233 234
235 236
237 238
240 242
243 246
248 249
251 252
255 257
258 260
264 265
268 271
272 273
274 277
278 280
283 284
288 289
294 295
301 303
305 310
312 313
315 316
317 318
319 320
321 322
326 327
333 335
337 340
341 343
345 346
349 350
351 352
355 359
360 361
362 365
370 371
373 376
378 379
380 381
384 385
386 388
389 391
394 395
396 397
399 400
402 408
409 410
411 414
416 424
425 426
430 432
435 438
440 443
444 450
451 452
454 458
459 462
463 468
469 471
473 474
475 476
479 480
481 482
484 487
489 492
494 495
496 497
498 499
502 505
508 509
515 517
521 527
528 529
532 533
534 537
540 541
543 547
548 549
550 551
553 554
555 557
559 563
567 568
569 570
571 572
574 575
576 578
580 584
587 590
592 593
595 597
598 601
602 603
605 606
608 610
611 617
618 619
620 622
623 627
628 629
632 636
639 640
641 642
644 647
649 650
652 653
654 656
657 659
660 668
672 673
674 675
678 679
680 684
686 687
689 690
691 692
694 696
699 700
701 703
705 706
707 709
710 713
716 717
719 720
721 722
723 725
726 727
729 730
733 736
738 741
742 743
744 745
747 749
751 753
754 755
756 758
759 760
762 763
764 766
768 771
772 773
774 776
778 779
780 781
783 788
789 790
791 792
793 795
798 802
805 807
809 810
811 812
815 820
821 822
823 825
828 831
836 841
846 848
850 855
856 857
858 859
862 865
866 871
872 874
875 877
879 882
883 885
888 891
892 893
895 896
899 901
902 903
907 908
909 912
914 915
916 919
920 922
925 926
935 938
940 949
952 958
960 961
966 969
970 971
972 975
976 977
979 981
986 987
990 991
993 995
1001 1002
1004 1005
1007 1008
1009 1010
1011 1017
1025 1026
1027 1033
1038 1040
1041 1044
1045 1046
1050 1053
1054 1056
1060 1063
1066 1068
1071 1073
1074 1077
1078 1081
1083 1084
1087 1090
1094 1095
1096 1097
1102 1103
1104 1106
1107 1108
1109 1110
1113 1116
1118 1119
1122 1123
1124 1126
1128 1129
1131 1135
1137 1138
1141 1144
1145 1146
1147 1148
1150 1156
1158 1164
1170 1173
1174 1175
1177 1180
1181 1182
1183 1187
1191 1194
1195 1196
1197 1198
1200 1201
1203 1204
1205 1206
1207 1208
1211 1212
1214 1215
1217 1218
1219 1220
1221 1227
1228 1230
1231 1232
1233 1234
1235 1236
1238 1239
1240 1243
1244 1245
1246 1247
1249 1251
1253 1254
1255 1257
1258 1259
1260 1261
1263 1264
1267 1268
1269 1275
1276 1277
1280 1282
1284 1286
1287 1288
1289 1291
1294 1296
1297 1299
1303 1305
1306 1307
1308 1313
1320 1324
1325 1327
1328 1333
1334 1335
1336 1338
1345 1348
1349 1351
1353 1355
1359 1360
1364 1365
1366 1367
1368 1369
1370 1372
1378 1379
1381 1383
1384 1388
1389 1391
1392 1398
1401 1402
1403 1404
1408 1413
1414 1416
1418 1419
1420 1422
1423 1426
1428 1430
1431 1432
1435 1436
1438 1441
1444 1445
1447 1450
1458 1461
1464 1470
1471 1472
1474 1476
1477 1488
1496 1497
1501 1504
1508 1509
1510 1514
1522 1527
1530 1532
1533 1537
1540 1541
1542 1543
1544 1549
1550 1551
1554 1555
1556 1561
1562 1564
1565 1568
1569 1572
1573 1575
1577 1579
1580 1581
1586 1587
1588 1589
1590 1592
1594 1597
1599 1600
1601 1603
1605 1607
1608 1609
1610 1611
1614 1615
1616 1618
1620 1622
1623 1624
1626 1628
1635 1639
1642 1643
1647 1650
1652 1655
1657 1660
1662 1665
1666 1667
1670 1671
1674 1675
1677 1679
1680 1683
1684 1685
1687 1690
1694 1695
1696 1697
1699 1701
1704 1705
1706 1712
1715 1717
1723 1724
1726 1728
1732 1734
1735 1738
1739 1740
1742 1744
1745 1746
1747 1748
1749 1750
1751 1752
1753 1755
1757 1759
1760 1763
1766 1767
1770 1771
1777 1779
1783 1788
1791 1797
1799 1800
1801 1804
1805 1806
1807 1808
1810 1812
1813 1814
1815 1817
1819 1824
1825 1830
1831 1836
1838 1840
1841 1842
1847 1851
1854 1857
1858 1859
1861 1863
1867 1873
1874 1876
1878 1880
1881 1887
1888 1889
1893 1894
1895 1896
1897 1898
1900 1903
1906 1911
1914 1916
1918 1920
1922 1923
1924 1927
1929 1930
1931 1934
1935 1937
1939 1941
1942 1943
1945 1947
1951 1952
1953 1955
1957 1959
1962 1963
1964 1965
1966 1968
1969 1971
1974 1975
1976 1977
1979 1980
1983 1984
1986 1990
1994 1999
2002 2005
2008 2010
2013 2014
2016 2018
2021 2024
2025 2026
2027 2031
2032 2033
2036 2038
2039 2040
2043 2044
2046 2047
2049 2050
2052 2053
2056 2057
2060 2064
2067 2068
2069 2070
2072 2073
2078 2080
2081 2082
2086 2087
2088 2089
2090 2091
2092 2093
2095 2096
2097 2098
2100 2101
2102 2103
2105 2107
2109 2111
2112 2113
2115 2116
2117 2120
2122 2125
2126 2129
2131 2132
2136 2137
2140 2143
2146 2147
2151 2154
2155 2156
2157 2160
2161 2164
2166 2167
2168 2172
2173 2174
2175 2177
2180 2184
2186 2188
2193 2195
2197 2201
2202 2207
2208 2209
2212 2214
2215 2216
2217 2219
2223 2225
2226 2231
2233 2237
2239 2240
2243 2244
2247 2248
2249 2250
2251 2253
2257 2261
2262 2263
2264 2267
2268 2269
2270 2271
2272 2275
2276 2278
2279 2280
2281 2284
2286 2288
2290 2291
2292 2293
2294 2296
2297 2299
2301 2303
2305 2307
2308 2309
2310 2317
2318 2319
2321 2323
2325 2327
2329 2334
2337 2340
2341 2342
2343 2344
2347 2348
2351 2352
2353 2354
2357 2360
2362 2365
2369 2370
2371 2374
2377 2378
2383 2384
2385 2393
2394 2395
2397 2399
2400 2401
2403 2404
2406 2409
2411 2414
2421 2424
2427 2428
2430 2431
2434 2436
2437 2438
2439 2441
2442 2446
2450 2451
2452 2453
2454 2460
2463 2465
2468 2470
2472 2474
2477 2478
2479 2480
2481 2483
2484 2486
2490 2491
2493 2494
2497 2498
2506 2507
2509 2510
2515 2516
2517 2518
2527 2530
2531 2534
2535 2536
2537 2539
2541 2547
2549 2551
2554 2555
2557 2560
2562 2563
2564 2566
2567 2568
2570 2572
2575 2577
2578 2582
2584 2586
2587 2588
2589 2592
2593 2596
2597 2598
2601 2604
2608 2610
2611 2612
2613 2614
2615 2616
2617 2618
2619 2622
2624 2626
2633 2638
2639 2643
2645 2647
2650 2652
2655 2656
2658 2659
2661 2664
2668 2669
2670 2677
2678 2679
2680 2681
2682 2687
2691 2692
2694 2695
2696 2697
2698 2703
2705 2706
2707 2708
2709 2710
2711 2713
2717 2725
2730 2735
2736 2737
2740 2743
2744 2746
2747 2752
2753 2754
2757 2759
2761 2763
2765 2766
2768 2771
2773 2774
2777 2784
2785 2787
2790 2792
2797 2801
2802 2804
2806 2807
2808 2810
2811 2816
2817 2818
2819 2820
2821 2822
2823 2824
2828 2829
2830 2833
2834 2836
2837 2841
2847 2849
2850 2851
2858 2859
2860 2861
2862 2865
2866 2868
2869 2872
2874 2876
2878 2879
2882 2884
2886 2887
2888 2890
2895 2896
2902 2904
2908 2910
2912 2914
2915 2917
2918 2920
2924 2925
2927 2929
2930 2933
2934 2935
2936 2940
2943 2948
2951 2955
2957 2958
2961 2964
2965 2966
2968 2969
2975 2978
2979 2980
2982 2983
2989 2991
2993 2994
2995 2996
2997 2998
3000 3008
3013 3014
3015 3017
3019 3022
3023 3024
3025 3026
3030 3031
3032 3034
3035 3036
3039 3040
3042 3048
3049 3050
3054 3056
3057 3061
3062 3066
3069 3070
3076 3077
3078 3079
3084 3087
3089 3090
3092 3094
3096 3100
3105 3108
3111 3113
3115 3116
3117 3118
3119 3120
3121 3125
3126 3127
3129 3134
3135 3137
3142 3143
3145 3146
3153 3154
3155 3158
3164 3166
3167 3169
3173 3178
3179 3181
3183 3184
3186 3187
3188 3189
3190 3193
3195 3199
3201 3208
3209 3211
3212 3214
3216 3226
3231 3233
3234 3236
3239 3241
3242 3245
3254 3255
3257 3258
3259 3260
3262 3264
3265 3267
3269 3270
3271 3273
3276 3277
3279 3280
3281 3282
3287 3290
3291 3292
3293 3296
3298 3300
3302 3303
3304 3306
3308 3309
3310 3311
3312 3314
3315 3316
3320 3322
3323 3324
3325 3328
3331 3332
3333 3334
3336 3337
3338 3339
3342 3345
3347 3349
3351 3354
3355 3359
3364 3365
3366 3369
3370 3371
3372 3377
3378 3379
3380 3381
3383 3384
3385 3390
3391 3392
3393 3394
3397 3399
3400 3401
3407 3411
3412 3413
3415 3416
3417 3418
3419 3420
3421 3422
3423 3424
3425 3426
3427 3429
3430 3433
3436 3437
3439 3440
3441 3444
3445 3446
3448 3449
3450 3456
3457 3458
3459 3460
3463 3464
3466 3467
3469 3471
3472 3473
3474 3476
3482 3486
3487 3489
3491 3493
3495 3496
3497 3498
3499 3500
3502 3507
3509 3511
3512 3513
3515 3516
3517 3518
3519 3523
3524 3528
3529 3530
3534 3536
3537 3538
3539 3541
3542 3543
3546 3548
3550 3553
3555 3558
3560 3561
3563 3564
3565 3567
3568 3569
3572 3574
3575 3578
3586 3592
3594 3595
3601 3602
3603 3605
3613 3614
3615 3616
3618 3619
3623 3626
3629 3630
3632 3633
3639 3643
3645 3646
3647 3648
3649 3654
3658 3660
3662 3663
3666 3667
3669 3670
3671 3673
3674 3676
3679 3680
3682 3684
3687 3688
3689 3691
3692 3694
3695 3699
3701 3703
3705 3706
3707 3708
3709 3710
3712 3713
3714 3715
3717 3718
3719 3720
3722 3726
3729 3731
3732 3736
Ne.
750
1 2
6 7
8 10
12 13
15 18
19 20
23 24
25 27
28 30
31 33
38 39
42 44
45 46
52 53
55 57
60 62
66 67
68 69
71 72
74 75
76 78
81 82
84 85
86 87
88 89
91 94
95 97
98 99
105 106
107 109
119 120
121 122
123 127
128 129
130 132
133 134
135 136
138 143
144 146
148 152
153 154
156 162
163 166
168 169
170 172
178 179
180 182
183 187
189 193
194 195
196 200
202 204
206 207
210 211
212 213
215 218
222 225
227 232
234 236
237 238
239 240
241 243
245 247
248 252
254 258
259 260
263 264
265 266
268 272
274 275
276 278
279 284
286 287
288 289
290 292
294 297
299 301
303 306
307 308
309 311
313 314
315 316
320 322
324 325
326 329
331 335
338 347
349 353
355 357
358 359
360 362
364 370
372 373
374 376
378 379
382 384
386 387
389 393
403 404
407 408
409 410
411 415
420 421
424 426
427 431
436 437
439 440
442 443
444 445
446 448
450 452
454 456
457 458
459 462
463 466
467 468
469 472
473 475
476 477
479 480
481 485
486 487
488 489
490 492
494 495
498 499
506 507
508 515
516 518
519 522
523 524
527 529
532 533
541 542
543 544
547 548
549 550
554 555
556 557
560 562
563 564
565 570
573 577
581 582
583 587
590 592
593 594
595 598
599 601
602 603
604 605
606 607
608 610
611 612
613 615
617 619
623 627
628 631
633 636
637 638
640 641
647 648
651 652
653 654
656 658
660 661
662 663
665 666
668 669
672 673
675 677
679 682
684 685
686 689
690 692
696 698
699 700
701 708
709 710
711 716
725 726
727 728
730 732
735 736
738 739
740 741
744 745
746 747
749 752
753 754
755 759
760 763
764 765
767 768
770 771
773 774
775 776
777 778
780 784
785 787
788 791
792 795
796 798
799 802
806 808
809 810
813 815
816 817
818 824
826 830
831 833
834 835
837 838
846 847
849 850
851 852
854 860
865 866
867 868
869 870
871 872
874 878
879 880
881 882
883 885
886 887
888 889
890 892
893 895
900 901
905 906
913 914
916 919
921 922
924 925
926 928
930 931
933 939
941 942
945 948
949 950
951 955
958 959
961 966
968 970
971 974
977 979
980 984
993 998
1002 1003
1005 1006
1007 1008
1010 1011
1013 1017
1019 1020
1021 1022
1025 1026
1028 1029
1030 1031
1038 1039
1040 1042
1045 1048
1049 1051
1053 1058
1059 1061
1062 1063
1065 1066
1067 1069
1076 1078
1081 1082
1085 1088
1089 1091
1096 1097
1098 1100
1102 1103
1105 1106
1108 1111
1113 1114
1116 1117
1118 1121
1124 1125
1129 1130
1132 1133
1136 1137
1139 1140
1141 1142
1145 1146
1148 1149
1151 1154
1155 1156
1159 1161
1163 1164
1165 1166
1167 1169
1171 1172
1174 1178
1180 1184
1187 1189
1190 1193
1194 1199
1200 1209
1210 1212
1213 1214
1215 1216
1219 1222
1223 1224
1226 1228
1229 1230
1231 1232
1235 1237
1238 1241
1244 1245
1247 1249
1250 1251
1252 1253
1256 1257
1259 1260
1261 1263
1265 1269
1270 1271
1276 1277
1278 1284
1285 1286
1289 1290
1291 1292
1293 1295
1298 1300
1301 1304
1307 1309
1312 1313
1314 1316
1318 1319
1320 1321
1324 1326
1327 1330
1331 1332
1337 1342
1343 1347
1349 1350
1352 1354
1357 1358
1359 1365
1366 1368
1370 1373
1374 1375
1376 1377
1378 1379
1380 1381
1383 1384
1385 1388
1391 1392
1394 1395
1397 1398
1399 1400
1402 1403
1404 1407
1409 1411
1414 1415
1416 1420
1421 1422
1423 1424
1425 1426
1427 1428
1429 1435
1441 1442
1443 1444
1445 1446
1449 1450
1451 1452
1461 1463
1464 1465
1471 1473
1476 1477
1478 1479
1480 1486
1489 1491
1492 1495
1500 1502
1504 1506
1507 1510
1512 1513
1515 1516
1519 1521
1522 1525
1530 1534
1536 1538
1539 1541
1542 1545
1548 1550
1552 1555
1559 1560
1563 1566
1568 1569
1570 1573
1575 1576
1580 1584
1586 1587
1589 1591
1592 1593
1595 1597
1599 1600
1603 1608
1610 1611
1613 1615
1617 1618
1620 1623
1625 1627
1629 1630
1631 1632
1634 1637
1638 1642
1643 1644
1650 1652
1656 1660
1662 1665
1669 1670
1671 1672
1675 1680
1683 1684
1685 1686
1687 1688
1690 1694
1695 1697
1699 1701
1702 1703
1707 1708
1710 1712
1713 1715
1720 1724
1726 1728
1730 1731
1734 1735
1737 1739
1741 1742
1748 1749
1752 1753
1755 1756
1757 1760
1763 1764
1770 1773
1774 1776
1777 1782
1784 1787
1789 1790
1791 1794
1795 1796
1797 1798
1800 1801
1803 1805
1806 1809
1810 1812
1813 1814
1817 1818
1819 1820
1821 1822
1825 1826
1829 1830
1832 1836
1839 1840
1842 1843
1845 1847
1849 1850
1851 1852
1853 1855
1857 1858
1859 1860
1864 1866
1867 1869
1870 1873
1874 1875
1876 1877
1880 1885
1886 1888
1890 1893
1894 1896
1897 1898
1899 1900
1902 1905
1906 1909
1910 1917
1919 1920
1923 1924
1925 1926
1927 1929
1930 1931
1932 1933
1935 1937
1938 1941
1943 1944
1945 1947
1950 1951
1952 1954
1955 1959
1961 1966
1967 1969
1970 1972
1974 1977
1978 1980
1981 1985
1988 1989
1992 1994
1998 2003
2007 2011
2012 2013
2016 2017
2018 2021
2022 2026
2028 2030
2031 2032
2033 2034
2035 2038
2039 2041
2045 2047
2048 2049
2051 2052
2053 2055
2056 2057
2059 2060
2061 2062
2063 2064
2070 2072
2073 2080
2081 2082
2083 2084
2085 2089
2091 2097
2101 2102
2105 2106
2107 2108
2110 2111
2112 2114
2123 2125
2126 2128
2129 2130
2132 2133
2136 2137
2138 2141
2142 2144
2146 2147
2149 2150
2151 2154
2156 2159
2160 2164
2165 2166
2167 2170
2171 2180
2187 2188
2191 2192
2195 2196
2197 2198
2202 2204
2205 2206
2207 2208
2210 2214
2218 2220
2222 2223
2225 2226
2230 2231
2232 2234
2236 2245
2248 2249
2253 2254
2256 2258
2260 2261
2264 2265
2267 2268
2271 2273
2274 2275
2279 2281
2285 2286
2287 2288
2289 2290
2292 2293
2294 2295
2297 2299
2300 2302
2303 2306
2307 2308
2313 2314
2315 2317
2320 2323
2324 2327
2328 2330
2331 2333
2337 2338
2341 2342
2344 2345
2346 2349
2352 2362
2365 2366
2367 2372
2373 2376
2377 2380
2381 2382
2383 2384
2387 2388
2390 2392
2393 2395
2397 2398
2400 2401
2402 2404
2405 2406
2407 2408
2411 2415
2417 2419
2424 2427
2428 2430
2431 2432
2433 2438
2439 2440
2441 2442
2443 2445
2447 2448
2455 2457
2458 2460
2468 2469
2471 2472
2474 2475
2477 2480
2481 2484
2486 2488
2489 2496
2498 2501
2509 2510
2519 2522
2523 2524
2525 2527
2530 2531
2533 2534
2536 2537
2540 2543
2545 2547
2549 2550
2556 2560
2564 2565
2567 2568
2572 2573
2575 2579
2584 2585
2586 2587
2588 2589
2591 2592
2593 2594
2596 2598
2601 2603
2604 2606
2608 2609
2611 2612
2616 2617
2618 2621
2622 2626
2627 2628
2631 2633
2634 2635
2636 2637
2640 2641
2643 2646
2648 2649
2650 2651
2652 2655
2656 2658
2661 2664
2665 2666
2668 2670
2671 2672
2673 2674
2675 2676
2681 2682
2685 2686
2687 2688
2691 2693
2694 2695
2697 2700
2701 2702
2706 2707
2708 2710
2712 2713
2714 2716
2717 2718
2721 2722
2724 2725
2728 2729
2731 2732
2737 2742
2743 2744
2745 2746
2750 2751
2753 2756
2757 2759
2761 2762
2765 2766
2768 2772
2773 2775
2776 2777
2778 2779
2782 2783
2784 2785
2786 2787
2790 2793
2794 2795
2796 2798
2801 2803
2804 2805
2806 2807
2808 2809
2810 2811
2812 2815
2819 2821
2822 2825
2828 2830
2831 2834
2836 2838
2839 2840
2841 2842
2843 2844
2847 2848
2851 2855
2857 2859
2861 2863
2866 2869
2871 2872
2873 2881
2882 2883
2885 2891
2893 2894
2895 2896
2897 2899
2901 2902
2903 2905
2906 2907
2908 2909
2911 2913
2914 2917
2922 2923
2926 2933
2937 2938
2942 2943
2944 2945
2947 2948
2949 2952
2955 2956
2957 2959
2960 2961
2962 2964
2965 2970
2971 2978
2980 2981
2983 2985
2988 2994
2995 2996
Ne.
522
0 2
6 8
9 10
15 16
19 20
21 22
24 25
27 29
30 32
33 35
38 42
44 45
47 49
54 55
56 58
61 64
66 69
70 71
72 73
76 79
80 81
82 84
86 87
89 91
92 93
94 95
96 99
100 101
107 108
109 112
114 118
122 124
127 128
132 135
137 138
139 141
143 144
146 147
149 150
151 154
156 157
158 159
160 161
162 163
165 167
171 172
173 175
178 185
186 190
192 199
200 201
202 203
204 206
208 210
211 212
214 215
216 219
223 224
226 229
230 231
234 236
237 238
240 241
242 243
244 245
248 249
251 252
254 255
256 258
259 260
261 262
263 265
266 267
268 269
271 272
274 275
281 284
285 290
292 295
297 298
300 301
303 304
305 306
308 309
310 312
313 314
319 320
321 322
327 332
333 336
339 341
345 349
350 352
355 359
362 363
364 365
366 368
372 375
379 381
382 383
384 386
388 389
390 391
392 394
400 401
404 406
407 409
411 413
414 416
418 421
426 428
431 434
435 436
437 438
441 446
447 448
449 450
452 453
454 458
460 461
462 463
464 466
467 469
470 474
475 477
478 479
484 487
488 489
492 493
494 496
500 502
504 507
508 509
510 511
512 516
517 518
523 526
528 529
530 532
534 536
537 538
539 540
542 545
546 547
548 549
550 551
553 555
556 557
563 564
566 572
573 575
583 584
586 589
590 591
592 593
595 597
598 599
601 605
607 608
610 612
616 620
621 622
623 624
627 628
631 637
639 640
641 642
643 646
649 651
652 654
659 661
662 663
665 667
668 669
676 679
683 685
686 693
698 699
700 701
705 706
710 711
712 713
714 716
717 718
727 728
729 731
732 734
735 736
737 738
745 746
747 748
749 750
753 754
755 756
758 760
768 769
771 772
775 776
777 780
782 783
784 786
788 791
792 793
794 796
798 799
801 802
803 805
808 809
810 811
812 813
814 815
816 817
818 819
825 827
829 831
832 836
837 838
840 841
842 843
847 859
860 861
862 863
865 870
871 872
875 877
878 879
883 884
889 890
893 894
895 897
899 900
901 902
905 906
907 908
910 914
915 916
918 920
921 923
924 925
926 928
932 933
935 936
940 941
944 947
948 949
953 955
956 958
960 964
965 966
971 974
976 979
980 984
986 987
988 991
993 997
998 1002
1003 1004
1006 1009
1012 1014
1015 1016
1017 1019
1020 1027
1030 1033
1038 1039
1044 1046
1047 1048
1049 1052
1053 1054
1058 1061
1064 1068
1069 1071
1073 1076
1077 1079
1080 1081
1082 1083
1084 1085
1086 1088
1093 1096
1097 1102
1103 1104
1105 1106
1113 1115
1116 1118
1120 1124
1125 1126
1127 1128
1129 1131
1133 1135
1136 1139
1141 1142
1143 1146
1148 1152
1153 1154
1158 1165
1170 1171
1172 1175
1177 1178
1182 1184
1187 1190
1193 1195
1197 1199
1200 1205
1206 1207
1209 1210
1211 1212
1214 1215
1217 1219
1220 1221
1224 1225
1226 1227
1229 1230
1231 1232
1233 1234
1236 1237
1239 1241
1243 1245
1248 1249
1250 1255
1256 1257
1259 1260
1262 1263
1264 1266
1267 1269
1270 1271
1273 1275
1276 1277
1279 1280
1282 1284
1286 1287
1288 1290
1292 1293
1295 1298
1299 1302
1304 1305
1306 1308
1309 1310
1311 1312
1313 1314
1315 1316
1317 1318
1320 1322
1324 1326
1331 1333
1335 1338
1340 1343
1344 1346
1347 1348
1349 1350
1352 1354
1355 1357
1358 1359
1361 1362
1363 1364
1366 1368
1370 1372
1377 1378
1380 1384
1385 1387
1391 1393
1394 1395
1397 1398
1399 1404
1405 1406
1410 1411
1413 1416
1419 1427
1432 1434
1437 1441
1446 1447
1449 1450
1459 1462
1464 1466
1468 1469
1470 1476
1477 1479
1480 1482
1484 1485
1487 1489
1490 1491
1492 1494
1499 1501
1510 1515
1516 1517
1526 1530
1532 1535
1538 1542
1543 1544
1546 1549
1550 1552
1553 1557
1558 1567
1569 1573
1576 1581
1582 1583
1587 1588
1590 1593
1595 1596
1598 1604
1606 1608
1609 1610
1611 1612
1614 1615
1618 1620
1622 1623
1624 1625
1627 1628
1629 1632
1633 1634
1639 1641
1647 1650
1652 1653
1654 1660
1662 1663
1665 1668
1669 1671
1672 1674
1679 1680
1681 1683
1684 1686
1687 1689
1691 1693
1695 1699
1702 1707
1709 1713
1714 1715
1716 1717
1719 1720
1723 1727
1730 1731
1738 1739
1740 1742
1743 1744
1746 1747
1748 1749
1751 1754
1755 1756
1757 1758
1759 1763
1765 1767
1768 1770
1773 1775
1777 1778
1779 1780
1781 1784
1787 1788
1791 1795
1796 1797
1798 1800
1805 1806
1808 1810
1811 1812
1813 1816
1817 1819
1821 1823
1825 1826
1827 1829
1830 1832
1833 1834
1838 1839
1842 1843
1844 1846
1849 1853
1854 1857
1858 1859
1860 1862
1867 1870
1871 1873
1874 1877
1878 1879
1880 1881
1884 1887
1891 1893
1894 1895
1896 1900
1901 1902
1905 1906
1908 1910
1911 1914
1915 1916
1919 1921
1924 1925
1926 1929
1931 1934
1935 1937
1943 1945
1946 1948
1949 1951
1952 1953
1956 1959
1960 1961
1963 1965
1966 1968
1970 1971
1973 1975
1977 1978
1981 1983
1984 1985
1988 1989
1994 1995
1996 1997
1999 2001
2002 2004
2005 2006
2012 2013
2014 2015
2017 2020
2022 2026
2028 2029
2030 2034
2035 2037
2038 2039
2040 2042
2043 2045
2046 2047
2048 2050
2053 2055
2057 2063
2065 2066
2069 2070
2072 2073
2074 2076
2077 2080
Ne.
713
0 4
5 14
18 19
22 23
24 27
28 32
34 37
41 42
43 45
47 48
49 50
51 52
53 55
58 60
62 64
65 66
67 68
71 74
76 78
79 87
89 91
94 96
98 99
102 104
105 106
107 108
112 114
115 121
122 123
124 126
127 131
132 133
135 138
139 141
143 145
148 149
150 151
154 155
156 157
160 162
165 168
175 177
178 179
180 185
186 188
189 190
192 195
196 198
200 202
208 209
210 214
215 216
218 219
220 221
223 225
226 229
230 231
232 233
240 242
244 245
249 252
253 254
255 256
263 264
267 269
270 271
272 273
274 280
281 283
285 286
287 288
290 293
295 296
298 300
301 302
303 304
305 307
308 309
310 313
314 315
320 322
324 326
327 328
329 331
332 334
335 339
340 342
347 348
349 351
353 354
355 356
359 361
365 366
369 370
372 373
376 377
378 380
382 383
384 385
391 393
395 396
397 402
404 405
406 411
413 414
416 417
418 419
425 429
430 431
433 435
436 437
438 439
440 443
447 449
451 452
453 454
455 457
458 459
460 461
464 466
467 468
469 470
472 474
475 478
479 481
483 484
488 491
493 494
497 501
502 503
504 505
507 508
513 514
516 518
519 525
526 527
530 531
533 535
537 538
540 547
549 550
552 553
554 558
562 564
566 567
569 570
575 577
578 581
583 584
585 587
590 593
594 597
605 610
611 613
615 616
621 623
624 625
626 627
628 630
631 632
634 635
636 638
640 641
643 645
646 649
650 651
652 653
658 659
660 661
663 665
667 669
671 676
677 681
684 686
690 691
693 694
695 697
700 703
704 705
707 713
714 715
718 719
721 725
726 727
729 730
731 733
734 736
737 738
743 745
747 748
749 751
753 754
755 756
761 762
763 764
765 766
769 772
774 776
779 781
785 786
788 791
797 798
799 800
802 803
805 807
808 809
812 814
815 816
818 820
824 826
828 832
833 834
835 837
839 843
852 855
856 858
863 864
865 867
868 869
870 873
875 878
882 883
885 886
887 888
889 892
895 898
899 900
904 905
907 908
909 911
912 913
914 916
921 923
927 928
930 931
932 933
936 940
941 945
946 947
949 950
951 955
956 957
958 959
960 961
964 965
967 970
972 973
976 978
980 982
983 986
987 989
990 992
993 995
996 998
999 1000
1002 1005
1007 1008
1009 1012
1013 1015
1016 1019
1022 1024
1028 1033
1040 1044
1049 1050
1053 1054
1055 1057
1060 1064
1068 1069
1072 1073
1076 1077
1078 1079
1082 1084
1085 1088
1089 1090
1091 1092
1094 1097
1098 1100
1102 1103
1105 1113
1114 1115
1118 1119
1121 1124
1125 1126
1129 1132
1136 1139
1140 1141
1143 1145
1148 1153
1155 1159
1162 1163
1164 1169
1170 1172
1174 1175
1183 1187
1189 1191
1193 1194
1195 1196
1197 1199
1202 1203
1206 1208
1210 1211
1214 1215
1216 1217
1219 1220
1221 1223
1225 1227
1229 1232
1233 1236
1237 1238
1239 1243
1245 1246
1247 1248
1251 1252
1253 1255
1257 1261
1262 1263
1264 1265
1266 1268
1269 1270
1272 1276
1277 1278
1279 1280
1282 1283
1284 1285
1286 1291
1295 1296
1298 1303
1304 1306
1307 1309
1310 1311
1312 1315
1316 1318
1319 1320
1321 1326
1327 1331
1333 1335
1336 1338
1342 1343
1345 1346
1349 1351
1354 1358
1359 1360
1361 1364
1366 1367
1369 1371
1374 1377
1378 1384
1386 1391
1392 1393
1397 1400
1406 1409
1410 1414
1417 1418
1419 1420
1421 1422
1423 1425
1426 1429
1430 1431
1432 1434
1435 1436
1437 1438
1443 1444
1446 1447
1449 1450
1452 1455
1456 1457
1459 1460
1463 1464
1466 1468
1469 1473
1475 1477
1480 1481
1482 1483
1484 1485
1490 1491
1493 1495
1498 1505
1507 1510
1511 1512
1513 1514
1518 1519
1520 1521
1523 1524
1526 1528
1535 1536
1537 1538
1540 1541
1543 1545
1546 1548
1551 1553
1555 1556
1558 1559
1560 1561
1562 1563
1564 1565
1569 1570
1571 1572
1581 1582
1583 1584
1590 1593
1595 1596
1597 1600
1603 1604
1608 1609
1610 1617
1623 1625
1627 1631
1632 1633
1634 1636
1637 1641
1643 1646
1648 1650
1652 1653
1656 1657
1658 1659
1662 1663
1665 1666
1667 1671
1673 1676
1678 1679
1680 1681
1688 1690
1692 1693
1694 1695
1696 1698
1704 1706
1707 1710
1712 1713
1715 1716
1717 1720
1721 1724
1725 1726
1727 1730
1732 1734
1737 1739
1744 1751
1757 1758
1762 1765
1766 1769
1770 1772
1776 1779
1780 1782
1783 1786
1789 1790
1791 1792
1793 1794
1795 1797
1798 1799
1801 1802
1804 1806
1807 1810
1812 1813
1817 1821
1822 1823
1824 1825
1827 1828
1830 1831
1832 1833
1835 1837
1838 1839
1845 1846
1847 1848
1850 1851
1852 1855
1856 1859
1860 1861
1865 1866
1867 1869
1870 1873
1875 1878
1880 1881
1886 1887
1890 1891
1892 1893
1894 1895
1897 1898
1900 1902
1903 1906
1907 1908
1910 1911
1913 1915
1920 1921
1922 1923
1925 1926
1928 1929
1931 1933
1937 1939
1942 1943
1944 1945
1946 1947
1948 1950
1952 1953
1954 1956
1958 1959
1962 1964
1968 1970
1971 1972
1973 1981
1985 1986
1987 1988
1989 1991
1993 1994
1995 1996
1997 2000
2001 2002
2005 2006
2007 2008
2011 2015
2018 2020
2021 2022
2025 2026
2027 2029
2033 2035
2038 2040
2042 2043
2047 2048
2052 2055
2059 2060
2064 2065
2066 2068
2075 2076
2077 2078
2080 2081
2083 2085
2086 2087
2089 2090
2091 2092
2096 2100
2101 2104
2106 2108
2109 2110
2111 2112
2113 2114
2118 2120
2121 2124
2125 2126
2127 2131
2134 2136
2139 2143
2144 2146
2147 2148
2152 2155
2157 2158
2160 2162
2164 2165
2167 2168
2169 2171
2173 2174
2175 2176
2177 2178
2180 2182
2184 2186
2189 2195
2199 2200
2205 2206
2209 2211
2214 2215
2218 2221
2223 2224
2226 2227
2229 2230
2231 2233
2234 2236
2237 2238
2239 2240
2242 2245
2246 2247
2248 2249
2250 2251
2256 2257
2258 2262
2263 2266
2267 2268
2269 2278
2279 2282
2286 2287
2295 2296
2307 2309
2310 2311
2312 2313
2316 2319
2323 2325
2327 2330
2332 2333
2334 2336
2338 2339
2340 2343
2353 2355
2356 2357
2360 2361
2362 2365
2368 2374
2376 2377
2379 2380
2381 2382
2384 2385
2386 2387
2390 2391
2393 2395
2396 2397
2398 2399
2403 2405
2409 2413
2414 2421
2423 2425
2427 2428
2429 2434
2437 2438
2439 2440
2441 2442
2444 2447
2449 2451
2452 2455
2456 2461
2463 2465
2471 2472
2473 2474
2476 2477
2480 2482
2483 2484
2485 2486
2487 2489
2490 2495
2496 2498
2499 2500
2505 2507
2508 2509
2511 2512
2521 2523
2526 2530
2531 2532
2535 2536
2537 2538
2539 2540
2541 2546
2547 2549
2552 2555
2556 2559
2560 2561
2562 2569
2570 2572
2575 2577
2578 2579
2581 2585
2587 2588
2589 2592
2594 2596
2599 2602
2603 2604
2606 2607
2608 2610
2611 2615
2618 2619
2621 2624
2626 2627
2628 2629
2631 2638
2639 2641
2643 2645
2647 2648
2652 2654
2655 2656
2657 2659
2661 2662
2664 2666
2669 2672
2686 2687
2688 2691
2693 2695
2696 2697
2699 2700
2702 2703
2704 2708
2709 2710
2713 2714
2717 2718
2719 2720
2721 2723
2724 2725
2726 2736
2737 2741
2751 2752
2753 2754
2757 2760
2761 2762
2764 2766
2767 2772
2773 2774
2777 2779
2782 2784
2788 2791
2792 2793
2795 2796
2797 2798
2802 2803
2805 2806
2807 2808
2809 2810
2811 2812
2813 2818
2819 2822
2823 2824
2826 2829
2830 2833
2834 2836
2837 2838
2841 2844
2845 2846
2848 2850
2851 2853
2854 2855
2857 2858
2859 2860
Ne.
588
1 3
4 5
7 8
12 14
16 17
18 19
22 23
24 26
27 30
33 37
38 42
43 44
45 46
47 52
53 58
59 60
62 63
64 68
69 71
78 80
81 82
83 84
86 87
89 91
92 99
102 104
106 107
108 110
113 115
117 118
119 123
125 126
128 129
133 134
135 141
154 155
156 160
163 166
168 170
172 175
176 179
182 183
186 187
190 191
192 194
195 197
199 202
207 208
209 218
223 224
225 228
229 231
232 233
237 240
241 242
243 244
245 251
253 254
255 256
257 261
263 264
267 268
269 272
274 275
277 280
281 283
285 286
287 289
291 292
293 295
296 297
298 299
300 302
304 305
306 308
312 313
315 317
319 320
321 322
324 326
327 331
332 336
337 338
341 344
346 347
349 350
351 352
353 354
355 356
357 358
359 361
363 364
370 371
372 374
378 379
380 381
382 383
386 387
388 389
395 398
399 400
401 404
405 406
414 418
421 423
424 425
426 428
429 432
433 436
439 440
442 444
449 450
454 467
468 470
471 475
476 480
484 485
486 487
490 492
494 496
497 498
502 503
507 508
509 511
514 515
517 518
519 520
521 530
531 534
536 538
539 542
543 544
546 547
550 551
552 553
559 560
563 569
570 572
575 577
578 579
586 587
590 595
596 597
599 600
605 606
608 609
610 611
613 616
618 620
624 625
627 628
630 631
632 633
634 635
638 640
643 644
645 646
649 650
651 652
653 655
656 657
660 662
664 668
670 671
672 674
676 682
686 688
692 694
696 699
700 706
707 710
711 712
714 721
723 725
727 728
730 731
733 736
737 739
741 742
743 746
747 751
752 757
758 759
760 763
764 766
769 772
774 777
778 780
781 782
784 787
788 792
795 798
799 804
807 810
811 814
815 817
819 822
825 826
828 830
832 833
835 837
838 843
844 846
847 848
849 850
851 853
855 856
859 863
864 867
869 871
873 874
876 879
882 884
885 886
888 889
890 892
895 897
898 900
904 906
907 910
911 914
917 919
920 921
923 926
927 930
934 937
939 940
942 943
946 950
953 955
956 957
959 961
962 963
965 966
968 970
973 975
976 977
980 982
983 984
985 986
991 992
993 994
995 997
1003 1011
1013 1014
1019 1020
1022 1023
1024 1025
1026 1029
1030 1032
1033 1035
1038 1042
1045 1047
1052 1053
1055 1056
1057 1058
1060 1063
1064 1067
1068 1069
1070 1071
1072 1073
1074 1075
1077 1079
1080 1081
1084 1085
1088 1089
1090 1091
1092 1093
1095 1097
1100 1102
1104 1110
1111 1114
1117 1119
1121 1123
1126 1127
1128 1129
1133 1136
1138 1144
1147 1153
1156 1158
1159 1161
1164 1165
1167 1170
1171 1175
1176 1177
1180 1181
1182 1186
1188 1189
1190 1191
1192 1193
1194 1195
1196 1197
1202 1203
1206 1207
1208 1213
1215 1216
1219 1222
1225 1226
1227 1230
1231 1232
1233 1235
1241 1242
1245 1246
1248 1251
1252 1254
1257 1259
1260 1261
1264 1265
1266 1268
1269 1275
1277 1278
1280 1281
1282 1284
1285 1287
1288 1290
1291 1292
1293 1302
1306 1307
1308 1310
1311 1312
1313 1314
1315 1319
1320 1322
1325 1326
1328 1330
1332 1333
1335 1336
1337 1338
1339 1340
1341 1345
1347 1349
1350 1352
1353 1354
1356 1357
1358 1361
1364 1366
1367 1368
1369 1371
1373 1374
1377 1378
1379 1380
1381 1382
1383 1386
1388 1389
1390 1391
1392 1393
1397 1398
1400 1404
1405 1408
1412 1413
1415 1416
1419 1420
1421 1425
1426 1427
1432 1433
1434 1435
1436 1437
1438 1441
1444 1446
1447 1449
1450 1451
1455 1457
1459 1464
1471 1473
1474 1479
1481 1482
1484 1486
1488 1490
1491 1492
1493 1494
1497 1499
1500 1501
1502 1505
1506 1510
1511 1512
1517 1522
1523 1526
1527 1528
1529 1533
1534 1538
1540 1545
1546 1547
1548 1549
1550 1551
1552 1554
1555 1556
1559 1560
1561 1562
1567 1568
1569 1570
1571 1572
1574 1578
1579 1581
1582 1583
1586 1587
1589 1590
1592 1594
1596 1599
1601 1602
1603 1604
1605 1607
1608 1612
1621 1622
1623 1624
1627 1629
1631 1633
1634 1637
1638 1639
1640 1641
1642 1645
1646 1648
1649 1653
1654 1655
1656 1664
1667 1668
1669 1674
1678 1681
1682 1683
1684 1685
1686 1687
1689 1693
1696 1697
1699 1703
1704 1707
1709 1712
1714 1718
1719 1722
1723 1724
1725 1726
1727 1729
1730 1732
1733 1734
1736 1738
1739 1743
1748 1749
1751 1754
1761 1763
1766 1767
1769 1771
1772 1773
1775 1777
1782 1787
1792 1795
1796 1797
1800 1802
1803 1807
1809 1811
1812 1814
1815 1817
1818 1819
1820 1821
1823 1824
1825 1827
1828 1829
1832 1833
1834 1838
1839 1844
1846 1847
1849 1851
1852 1855
1856 1860
1861 1862
1868 1869
1870 1874
1876 1877
1880 1881
1882 1884
1885 1889
1890 1893
1894 1897
1898 1899
1902 1904
1905 1906
1913 1914
1915 1916
1920 1921
1922 1923
1924 1928
1930 1933
1934 1936
1938 1940
1942 1944
1945 1946
1950 1951
1954 1956
1959 1963
1967 1969
1970 1971
1973 1976
1979 1981
1983 1987
1989 1992
1993 1994
1997 2002
2003 2004
2005 2009
2010 2011
2014 2015
2016 2017
2018 2019
2021 2024
2026 2031
2032 2035
2036 2038
2039 2041
2042 2043
2044 2045
2046 2047
2048 2049
2052 2055
2056 2057
2058 2061
2062 2063
2064 2065
2068 2069
2070 2071
2075 2076
2078 2079
2080 2081
2082 2087
2088 2096
2100 2101
2103 2104
2106 2107
2110 2112
2113 2115
2118 2120
2122 2129
2132 2133
2134 2135
2137 2138
2142 2143
2144 2145
2146 2147
2148 2149
2151 2152
2154 2156
2157 2158
2159 2160
2161 2162
2163 2165
2168 2169
2171 2172
2173 2174
2175 2177
2181 2182
2187 2190
2192 2193
2194 2195
2196 2197
2198 2199
2201 2202
2204 2205
2206 2207
2208 2215
2216 2217
2221 2225
2226 2227
2228 2230
2233 2237
2238 2239
2240 2241
2242 2243
2245 2248
2251 2252
2253 2254
2255 2256
2258 2259
2260 2262
2263 2266
2268 2271
2273 2274
2275 2276
2278 2279
2280 2282
2283 2284
2285 2290
2294 2295
2296 2297
2298 2300
2306 2311
2314 2315
2316 2317
2324 2327
2328 2329
2332 2336
2338 2339
2340 2341
