{
  "collapse-filter": true,
  "search": "",
  "showTags": false,
  "showAttachments": false,
  "hideUnresolved": false,
  "showOrphans": true,
  "collapse-color-groups": true,
  "colorGroups": [],
  "collapse-display": false,
  "showArrow": true,
  "textFadeMultiplier": -3,
  "nodeSizeMultiplier": 1.5645032051282,
  "lineSizeMultiplier": 1.39698183760684,
  "collapse-forces": false,
  "centerStrength": 0.0341880341880342,
  "repelStrength": 12.1367521367521,
  "linkStrength": 0.820512820512821,
  "linkDistance": 159,
  "scale": 0.11634075449751083,
  "close": false
}